"molecule_id","AMW","C.","H.","Me","Mi","Mp","Mv","MW","N.","nAB","nAT","nB","nBM","nBO","nBR","nBT","nC","nCL","nCsp","nCsp2","nCsp3","nDB","nF","nH","nHet","nHM","nI","nN","nO","nP","nS","nSK","nTB","nX","O.","RBF","RBN","SCBO","Se","Si","Sp","Sv","X.","pXC50"
{1 7.768,2 43.2,3 45.9,4 0.997,5 1.112,6 0.693,7 0.645,8 287.41,9 2.7,10 11,11 37,13 11,14 23,16 40,17 16,20 10,21 6,24 17,25 4,26 1,28 1,29 2,31 1,32 20,35 5.4,38 28.5,39 36.902,40 41.159,41 25.654,42 23.853,44 7.481}
{0 CHEMBL2114441,1 7.163,2 41.3,3 50,4 0.99,5 1.117,6 0.673,7 0.618,8 329.5,9 2.2,10 11,11 46,13 11,14 26,16 49,17 19,20 10,21 9,24 23,25 4,26 1,28 1,29 2,31 1,32 23,35 4.3,36 0.02,37 1,38 31.5,39 45.552,40 51.404,41 30.938,42 28.433,44 7.62}
{0 CHEMBL2114444,1 7.536,2 42.5,3 47.5,4 0.995,5 1.114,6 0.685,7 0.634,8 301.44,9 2.5,10 11,11 40,13 11,14 24,16 43,17 17,20 10,21 7,24 19,25 4,26 1,28 1,29 2,31 1,32 21,35 5,36 0.023,37 1,38 29.5,39 39.785,40 44.574,41 27.415,42 25.379,44 7.658}
{0 CHEMBL2115372,1 7.768,2 43.2,3 45.9,4 0.997,5 1.112,6 0.693,7 0.645,8 287.41,9 2.7,10 11,11 37,13 11,14 23,16 40,17 16,20 10,21 6,24 17,25 4,26 1,28 1,29 2,31 1,32 20,35 5.4,38 28.5,39 36.902,40 41.159,41 25.654,42 23.853,44 5}
{0 CHEMBL2115373,1 7.163,2 41.3,3 50,4 0.99,5 1.117,6 0.673,7 0.618,8 329.5,9 2.2,10 11,11 46,13 11,14 26,16 49,17 19,20 10,21 9,24 23,25 4,26 1,28 1,29 2,31 1,32 23,35 4.3,36 0.02,37 1,38 31.5,39 45.552,40 51.404,41 30.938,42 28.433,44 5.757}
{0 CHEMBL2115374,1 7.337,2 41.9,3 48.8,4 0.992,5 1.116,6 0.679,7 0.626,8 315.47,9 2.3,10 11,11 43,13 11,14 25,16 46,17 18,20 10,21 8,24 21,25 4,26 1,28 1,29 2,31 1,32 22,35 4.7,36 0.043,37 2,38 30.5,39 42.669,40 47.989,41 29.176,42 26.906,44 5.569}
{0 CHEMBL2115377,1 7.536,2 42.5,3 47.5,4 0.995,5 1.114,6 0.685,7 0.634,8 301.44,9 2.5,10 11,11 40,13 11,14 24,16 43,17 17,20 10,21 7,24 19,25 4,26 1,28 1,29 2,31 1,32 21,35 5,36 0.023,37 1,38 29.5,39 39.785,40 44.574,41 27.415,42 25.379,44 5}
{0 CHEMBL24077,1 7.093,2 44.4,3 47.2,4 0.995,5 1.118,6 0.667,7 0.63,8 255.34,9 2.8,10 12,11 36,13 12,14 21,16 38,17 16,20 12,21 4,24 17,25 3,28 1,29 2,32 19,35 5.6,36 0.026,37 1,38 27,39 35.825,40 40.239,41 24.006,42 22.665,44 6.022}
{0 CHEMBL25856,1 7.226,2 45.9,3 45.9,4 0.995,5 1.115,6 0.676,7 0.64,8 267.35,9 2.7,10 12,11 37,13 12,14 23,16 40,17 17,20 12,21 5,24 17,25 3,28 1,29 2,32 20,35 5.4,38 29,39 36.825,40 41.239,41 25.006,42 23.665,44 7.056}
{0 CHEMBL28338,1 7.337,2 41.9,3 48.8,4 0.992,5 1.116,6 0.679,7 0.626,8 315.47,9 2.3,10 11,11 43,13 11,14 25,16 46,17 18,20 10,21 8,24 21,25 4,26 1,28 1,29 2,31 1,32 22,35 4.7,36 0.043,37 2,38 30.5,39 42.669,40 47.989,41 29.176,42 26.906,44 7.62}
{0 CHEMBL287931,1 7.111,2 42,3 50,4 0.989,5 1.116,6 0.674,7 0.619,8 355.54,9 2,10 11,11 50,13 11,14 29,16 54,17 21,20 10,21 11,24 25,25 4,26 1,28 1,29 2,31 1,32 25,35 4,36 0.037,37 2,38 34.5,39 49.436,40 55.82,41 33.699,42 30.96,44 6.903}
{0 CHEMBL288536,1 8.041,2 44.1,3 44.1,4 1.001,5 1.11,6 0.703,7 0.657,8 273.38,9 2.9,10 11,11 34,13 11,14 22,16 37,17 15,20 10,21 5,24 15,25 4,26 1,28 1,29 2,31 1,32 19,35 5.9,38 27.5,39 34.018,40 37.744,41 23.892,42 22.326,44 7.409}
{0 CHEMBL288846,1 7.163,2 41.3,3 50,4 0.99,5 1.117,6 0.673,7 0.618,8 329.5,9 2.2,10 11,11 46,13 11,14 26,16 49,17 19,20 10,21 9,24 23,25 4,26 1,28 1,29 2,31 1,32 23,35 4.3,36 0.041,37 2,38 31.5,39 45.552,40 51.404,41 30.938,42 28.433,44 7.056}
{0 CHEMBL289867,1 7.163,2 41.3,3 50,4 0.99,5 1.117,6 0.673,7 0.618,8 329.5,9 2.2,10 11,11 46,13 11,14 26,16 49,17 19,20 10,21 9,24 23,25 4,26 1,28 1,29 2,31 1,32 23,35 4.3,36 0.061,37 3,38 31.5,39 45.552,40 51.404,41 30.938,42 28.433,44 7.357}
{0 CHEMBL289927,1 6.876,2 40.4,3 51.9,4 0.987,5 1.12,6 0.663,7 0.606,8 357.56,9 1.9,10 11,11 52,13 11,14 28,16 55,17 21,20 10,21 11,24 27,25 4,26 1,28 1,29 2,31 1,32 25,35 3.8,36 0.091,37 5,38 33.5,39 51.32,40 58.235,41 34.461,42 31.487,44 6.854}
{0 CHEMBL290149,1 7.111,2 42,3 50,4 0.989,5 1.116,6 0.674,7 0.619,8 355.54,9 2,10 11,11 50,13 11,14 29,16 54,17 21,20 10,21 11,24 25,25 4,26 1,28 1,29 2,31 1,32 25,35 4,36 0.019,37 1,38 34.5,39 49.436,40 55.82,41 33.699,42 30.96,44 7.027}
{0 CHEMBL290842,1 9.054,2 44.1,3 41.2,4 1.01,5 1.108,6 0.728,7 0.681,8 307.82,9 2.9,10 11,11 34,13 11,14 23,16 37,17 15,18 1,20 10,21 5,24 14,25 5,26 2,28 1,29 2,31 1,32 20,34 1,35 5.9,38 28.5,39 34.342,40 37.688,41 24.75,42 23.153,43 2.9,44 7.367}
{0 CHEMBL291100,1 7.163,2 41.3,3 50,4 0.99,5 1.117,6 0.673,7 0.618,8 329.5,9 2.2,10 11,11 46,13 11,14 26,16 49,17 19,20 10,21 9,24 23,25 4,26 1,28 1,29 2,31 1,32 23,35 4.3,36 0.02,37 1,38 31.5,39 45.552,40 51.404,41 30.938,42 28.433,44 7.553}
{0 CHEMBL291143,1 6.46,2 39.2,3 52.9,4 0.992,5 1.128,6 0.633,7 0.589,8 329.48,9 2,10 6,11 51,13 6,14 28,16 55,17 20,20 6,21 14,24 27,25 4,28 1,29 3,32 24,35 5.9,36 0.036,37 2,38 31,39 50.571,40 57.524,41 32.267,42 30.014,44 8.086}
{0 CHEMBL38757,1 7.011,2 40.8,3 51,4 0.988,5 1.119,6 0.667,7 0.611,8 343.53,9 2,10 11,11 49,13 11,14 27,16 52,17 20,20 10,21 10,24 25,25 4,26 1,28 1,29 2,31 1,32 24,35 4.1,36 0.077,37 4,38 32.5,39 48.436,40 54.82,41 32.699,42 29.96,44 6.77}
{0 CHEMBL39266,1 9.054,2 44.1,3 41.2,4 1.01,5 1.108,6 0.728,7 0.681,8 307.82,9 2.9,10 11,11 34,13 11,14 23,16 37,17 15,18 1,20 10,21 5,24 14,25 5,26 2,28 1,29 2,31 1,32 20,34 1,35 5.9,38 28.5,39 34.342,40 37.688,41 24.75,42 23.153,43 2.9,44 6.77}
{0 CHEMBL40667,1 7.337,2 41.9,3 48.8,4 0.992,5 1.116,6 0.679,7 0.626,8 315.47,9 2.3,10 11,11 43,13 11,14 25,16 46,17 18,20 10,21 8,24 21,25 4,26 1,28 1,29 2,31 1,32 22,35 4.7,36 0.043,37 2,38 30.5,39 42.669,40 47.989,41 29.176,42 26.906,44 7.553}
{0 CHEMBL40950,1 8.041,2 44.1,3 44.1,4 1.001,5 1.11,6 0.703,7 0.657,8 273.38,9 2.9,10 11,11 34,13 11,14 22,16 37,17 15,20 10,21 5,24 15,25 4,26 1,28 1,29 2,31 1,32 19,35 5.9,38 27.5,39 34.018,40 37.744,41 23.892,42 22.326,44 7.328}
{0 CHEMBL41132,1 7.768,2 43.2,3 45.9,4 0.997,5 1.112,6 0.693,7 0.645,8 287.41,9 2.7,10 11,11 37,13 11,14 23,16 40,17 16,20 10,21 6,24 17,25 4,26 1,28 1,29 2,31 1,32 20,35 5.4,38 28.5,39 36.902,40 41.159,41 25.654,42 23.853,44 7.959}
{0 CHEMBL41196,1 7.111,2 42,3 50,4 0.989,5 1.116,6 0.674,7 0.619,8 355.54,9 2,10 11,11 50,13 11,14 29,16 54,17 21,20 10,21 11,24 25,25 4,26 1,28 1,29 2,31 1,32 25,35 4,36 0.019,37 1,38 34.5,39 49.436,40 55.82,41 33.699,42 30.96,44 7.102}
{0 CHEMBL41238,1 7.337,2 41.9,3 48.8,4 0.992,5 1.116,6 0.679,7 0.626,8 315.47,9 2.3,10 11,11 43,13 11,14 25,16 46,17 18,20 10,21 8,24 21,25 4,26 1,28 1,29 2,31 1,32 22,35 4.7,36 0.043,37 2,38 30.5,39 42.669,40 47.989,41 29.176,42 26.906,44 7.086}
{0 CHEMBL416435,1 7.734,2 46.8,3 44.7,4 0.993,5 1.106,6 0.706,7 0.658,8 363.51,9 2.1,10 17,11 47,13 17,14 30,16 51,17 22,20 16,21 6,24 21,25 4,26 1,28 1,29 2,31 1,32 26,35 4.3,36 0.02,37 1,38 38.5,39 46.669,40 51.989,41 33.176,42 30.906,44 6.194}
{0 CHEMBL417164,1 7.163,2 41.3,3 50,4 0.99,5 1.117,6 0.673,7 0.618,8 329.5,9 2.2,10 11,11 46,13 11,14 26,16 49,17 19,20 10,21 9,24 23,25 4,26 1,28 1,29 2,31 1,32 23,35 4.3,36 0.061,37 3,38 31.5,39 45.552,40 51.404,41 30.938,42 28.433,44 7.114}
{0 CHEMBL41809,1 7.011,2 40.8,3 51,4 0.988,5 1.119,6 0.667,7 0.611,8 343.53,9 2,10 11,11 49,13 11,14 27,16 52,17 20,20 10,21 10,24 25,25 4,26 1,28 1,29 2,31 1,32 24,35 4.1,36 0.058,37 3,38 32.5,39 48.436,40 54.82,41 32.699,42 29.96,44 6.328}
{0 CHEMBL43514,1 7.943,2 47.7,3 43.2,4 0.995,5 1.104,6 0.714,7 0.668,8 349.48,9 2.3,10 17,11 44,13 17,14 29,16 48,17 21,20 16,21 5,24 19,25 4,26 1,28 1,29 2,31 1,32 25,35 4.5,36 0.021,37 1,38 37.5,39 43.785,40 48.574,41 31.415,42 29.379,44 7.097}
{0 CHEMBL44414,1 7.536,2 42.5,3 47.5,4 0.995,5 1.114,6 0.685,7 0.634,8 301.44,9 2.5,10 11,11 40,13 11,14 24,16 43,17 17,20 10,21 7,24 19,25 4,26 1,28 1,29 2,31 1,32 21,35 5,36 0.023,37 1,38 29.5,39 39.785,40 44.574,41 27.415,42 25.379,44 7.301}
{0 CHEMBL446350,1 7.337,2 41.9,3 48.8,4 0.992,5 1.116,6 0.679,7 0.626,8 315.47,9 2.3,10 11,11 43,13 11,14 25,16 46,17 18,20 10,21 8,24 21,25 4,26 1,28 1,29 2,31 1,32 22,35 4.7,36 0.022,37 1,38 30.5,39 42.669,40 47.989,41 29.176,42 26.906,44 7.538}
{0 CHEMBL542351,1 7.337,2 41.9,3 48.8,4 0.992,5 1.116,6 0.679,7 0.626,8 315.47,9 2.3,10 11,11 43,13 11,14 25,16 46,17 18,20 10,21 8,24 21,25 4,26 1,28 1,29 2,31 1,32 22,35 4.7,36 0.043,37 2,38 30.5,39 42.669,40 47.989,41 29.176,42 26.906,44 6.796}
{0 CHEMBL542593,1 8.041,2 44.1,3 44.1,4 1.001,5 1.11,6 0.703,7 0.657,8 273.38,9 2.9,10 11,11 34,13 11,14 22,16 37,17 15,20 10,21 5,24 15,25 4,26 1,28 1,29 2,31 1,32 19,35 5.9,38 27.5,39 34.018,40 37.744,41 23.892,42 22.326,44 5.495}
{0 CHEMBL554571,1 8.041,2 44.1,3 44.1,4 1.001,5 1.11,6 0.703,7 0.657,8 273.38,9 2.9,10 11,11 34,13 11,14 22,16 37,17 15,20 10,21 5,24 15,25 4,26 1,28 1,29 2,31 1,32 19,35 5.9,38 27.5,39 34.018,40 37.744,41 23.892,42 22.326,44 6.62}
