{
  "data_set_description": {
    "collection_date": "November 2013",
    "creator": "Dr Jeremy Besnard, Dr Ivan Olier, Dr Noureddin Sadawi, Dr Larisa Soldatova, Dr Crina Grosan, Prof Ross King, Dr Richard Bickerton, Prof Andrew Hopkins and Dr Willem van Hoorn",
    "default_target_attribute": "pXC50",
    "description": "This dataset contains QSAR data (from ChEMBL version 17) showing activity values (unit is pseudo-pCI50) of several compounds on drug target ChEMBL_ID: CHEMBL2873 (TID: 11873), and it has 115 rows and 43 features (not including molecule IDs and class feature: molecule_id and pXC50). The features represent Basic Molecular Descriptors which were generated from SMILES strings.  Missing value imputation was applied to this dataset (By choosing the Median).",
    "description_version": "1",
    "file_id": "3569527",
    "format": "ARFF",
    "id": "35830",
    "licence": "Public",
    "md5_checksum": "a403df12051f6284d554632efd2e8b2b",
    "minio_url": "https://data.openml.org/datasets/0003/35830/dataset_35830.pq",
    "name": "QSAR-DATASET-FOR-DRUG-TARGET-CHEMBL2873",
    "original_data_url": "https://www.ebi.ac.uk/chembl/target/inspect/CHEMBL2873",
    "parquet_url": "https://data.openml.org/datasets/0003/35830/dataset_35830.pq",
    "processing_date": "2018-10-04 04:39:17",
    "row_id_attribute": "molecule_id",
    "status": "deactivated",
    "tag": [
      "MetaQSAR",
      "study_13"
    ],
    "upload_date": "2016-07-15T19:07:13",
    "url": "https://api.openml.org/data/v1/download/3569527/QSAR-DATASET-FOR-DRUG-TARGET-CHEMBL2873.arff",
    "version": "10",
    "visibility": "public"
  }
}