"molecule_id","FCFP4_1024b782","FCFP4_1024b134","FCFP4_1024b539","FCFP4_1024b563","FCFP4_1024b727","FCFP4_1024b265","FCFP4_1024b793","FCFP4_1024b610","FCFP4_1024b808","FCFP4_1024b641","FCFP4_1024b352","FCFP4_1024b451","FCFP4_1024b983","FCFP4_1024b426","FCFP4_1024b166","FCFP4_1024b855","FCFP4_1024b885","FCFP4_1024b199","FCFP4_1024b495","FCFP4_1024b235","FCFP4_1024b858","FCFP4_1024b821","FCFP4_1024b453","FCFP4_1024b628","FCFP4_1024b107","FCFP4_1024b1","FCFP4_1024b10","FCFP4_1024b100","FCFP4_1024b1000","FCFP4_1024b1001","FCFP4_1024b1002","FCFP4_1024b1003","FCFP4_1024b1004","FCFP4_1024b1005","FCFP4_1024b1006","FCFP4_1024b1007","FCFP4_1024b1008","FCFP4_1024b1009","FCFP4_1024b101","FCFP4_1024b1010","FCFP4_1024b1011","FCFP4_1024b1012","FCFP4_1024b1013","FCFP4_1024b1014","FCFP4_1024b1015","FCFP4_1024b1016","FCFP4_1024b1017","FCFP4_1024b1018","FCFP4_1024b1019","FCFP4_1024b102","FCFP4_1024b1020","FCFP4_1024b1021","FCFP4_1024b1022","FCFP4_1024b1023","FCFP4_1024b1024","FCFP4_1024b103","FCFP4_1024b104","FCFP4_1024b105","FCFP4_1024b106","FCFP4_1024b108","FCFP4_1024b109","FCFP4_1024b11","FCFP4_1024b110","FCFP4_1024b111","FCFP4_1024b112","FCFP4_1024b113","FCFP4_1024b114","FCFP4_1024b115","FCFP4_1024b116","FCFP4_1024b117","FCFP4_1024b118","FCFP4_1024b119","FCFP4_1024b12","FCFP4_1024b120","FCFP4_1024b121","FCFP4_1024b122","FCFP4_1024b123","FCFP4_1024b124","FCFP4_1024b125","FCFP4_1024b126","FCFP4_1024b127","FCFP4_1024b128","FCFP4_1024b129","FCFP4_1024b13","FCFP4_1024b130","FCFP4_1024b131","FCFP4_1024b132","FCFP4_1024b133","FCFP4_1024b135","FCFP4_1024b136","FCFP4_1024b137","FCFP4_1024b138","FCFP4_1024b139","FCFP4_1024b14","FCFP4_1024b140","FCFP4_1024b141","FCFP4_1024b142","FCFP4_1024b143","FCFP4_1024b144","FCFP4_1024b145","FCFP4_1024b146","FCFP4_1024b147","FCFP4_1024b148","FCFP4_1024b149","FCFP4_1024b15","FCFP4_1024b150","FCFP4_1024b151","FCFP4_1024b152","FCFP4_1024b153","FCFP4_1024b154","FCFP4_1024b155","FCFP4_1024b156","FCFP4_1024b157","FCFP4_1024b158","FCFP4_1024b159","FCFP4_1024b16","FCFP4_1024b160","FCFP4_1024b161","FCFP4_1024b162","FCFP4_1024b163","FCFP4_1024b164","FCFP4_1024b165","FCFP4_1024b167","FCFP4_1024b168","FCFP4_1024b169","FCFP4_1024b17","FCFP4_1024b170","FCFP4_1024b171","FCFP4_1024b172","FCFP4_1024b173","FCFP4_1024b174","FCFP4_1024b175","FCFP4_1024b176","FCFP4_1024b177","FCFP4_1024b178","FCFP4_1024b179","FCFP4_1024b18","FCFP4_1024b180","FCFP4_1024b181","FCFP4_1024b182","FCFP4_1024b183","FCFP4_1024b184","FCFP4_1024b185","FCFP4_1024b186","FCFP4_1024b187","FCFP4_1024b188","FCFP4_1024b189","FCFP4_1024b19","FCFP4_1024b190","FCFP4_1024b191","FCFP4_1024b192","FCFP4_1024b193","FCFP4_1024b194","FCFP4_1024b195","pXC50"
{18 1,26 1,41 1,49 1,74 1,93 1,124 1,126 1,127 1,137 1,141 1,155 5.15}
{0 CHEMBL101253,13 1,16 1,21 1,23 1,26 1,93 1,113 1,126 1,127 1,137 1,155 5.1}
{0 CHEMBL103667,11 1,12 1,13 1,16 1,22 1,23 1,25 1,26 1,27 1,126 1,127 1,137 1,155 5.15}
{0 CHEMBL105442,10 1,23 1,26 1,93 1,126 1,127 1,144 1,155 5}
{0 CHEMBL1082440,13 1,26 1,27 1,55 1,76 1,126 1,127 1,130 1,137 1,146 1,155 6.2}
{0 CHEMBL1084546,16 1,21 1,23 1,25 1,26 1,73 1,108 1,109 1,123 1,126 1,127 1,137 1,155 6.3}
{0 CHEMBL1090356,17 1,21 1,23 1,25 1,26 1,61 1,88 1,108 1,123 1,126 1,127 1,137 1,153 1,155 6.3}
{0 CHEMBL1090360,17 1,21 1,23 1,25 1,26 1,61 1,88 1,108 1,123 1,126 1,127 1,137 1,153 1,155 6.194}
{0 CHEMBL116070,6 1,13 1,26 1,93 1,126 1,127 1,137 1,155 5.1}
{0 CHEMBL1164180,6 1,16 1,20 1,25 1,26 1,27 1,73 1,90 1,93 1,103 1,109 1,126 1,127 1,130 1,137 1,140 1,155 6}
{0 CHEMBL1164265,6 1,16 1,20 1,25 1,26 1,27 1,90 1,93 1,103 1,109 1,126 1,127 1,130 1,137 1,140 1,155 5.5}
{0 CHEMBL1173055,13 1,18 1,26 1,60 1,126 1,127 1,147 1,155 5.1}
{0 CHEMBL1173655,13 1,16 1,21 1,23 1,25 1,26 1,27 1,93 1,98 1,108 1,126 1,127 1,134 1,137 1,138 1,140 1,155 5}
{0 CHEMBL117697,13 1,16 1,21 1,23 1,26 1,82 1,98 1,126 1,127 1,137 1,155 5.1}
{0 CHEMBL1190711,16 1,17 1,26 1,82 1,86 1,88 1,126 1,127 1,137 1,155 5.8}
{0 CHEMBL119385,26 1,32 1,43 1,93 1,114 1,126 1,127 1,155 5.1}
{0 CHEMBL1230020,3 1,4 1,5 1,6 1,8 1,13 1,18 1,23 1,25 1,26 1,93 1,107 1,126 1,127 1,137 1,155 5}
{0 CHEMBL1230122,25 1,26 1,93 1,109 1,126 1,127 1,137 1,155 5.1}
{0 CHEMBL1236107,13 1,15 1,19 1,26 1,126 1,127 1,137 1,155 5}
{0 CHEMBL1236126,25 1,26 1,63 1,126 1,127 1,135 1,137 1,155 5.1}
{0 CHEMBL1240703,13 1,20 1,26 1,33 1,68 1,84 1,126 1,127 1,134 1,137 1,155 6.886}
{0 CHEMBL1241473,16 1,21 1,23 1,26 1,45 1,82 1,123 1,126 1,127 1,134 1,135 1,137 1,155 7.5}
{0 CHEMBL1241674,7 1,13 1,16 1,18 1,26 1,51 1,77 1,98 1,126 1,127 1,137 1,145 1,155 5.585}
{0 CHEMBL1242373,7 1,11 1,12 1,13 1,16 1,22 1,23 1,25 1,26 1,46 1,51 1,52 1,98 1,126 1,127 1,137 1,155 5.1}
{0 CHEMBL124660,13 1,23 1,25 1,26 1,27 1,82 1,109 1,126 1,127 1,137 1,155 5.1}
{0 CHEMBL1270795,6 1,16 1,26 1,29 1,109 1,126 1,127 1,137 1,155 5}
{0 CHEMBL127898,26 1,27 1,44 1,74 1,91 1,126 1,127 1,137 1,155 5.1}
{0 CHEMBL1287853,16 1,21 1,23 1,26 1,27 1,81 1,123 1,126 1,127 1,137 1,155 5}
{0 CHEMBL1289926,13 1,26 1,29 1,52 1,60 1,74 1,91 1,100 1,122 1,126 1,127 1,137 1,145 1,155 5.658}
{0 CHEMBL1336,11 1,12 1,22 1,23 1,25 1,26 1,60 1,73 1,91 1,93 1,100 1,126 1,127 1,137 1,155 5.1}
{0 CHEMBL1375418,16 1,20 1,25 1,26 1,91 1,126 1,127 1,137 1,155 5.1}
{0 CHEMBL1375640,17 1,26 1,51 1,69 1,93 1,126 1,127 1,130 1,137 1,153 1,155 5.1}
{0 CHEMBL1381197,16 1,20 1,25 1,26 1,91 1,93 1,126 1,127 1,137 1,155 5.1}
{0 CHEMBL1419458,16 1,26 1,49 1,51 1,63 1,125 1,126 1,127 1,137 1,155 5.1}
{0 CHEMBL1421,10 1,16 1,25 1,26 1,27 1,41 1,93 1,109 1,123 1,126 1,127 1,133 1,137 1,155 5.1}
{0 CHEMBL1461728,13 1,23 1,25 1,26 1,29 1,54 1,77 1,93 1,126 1,127 1,137 1,155 5.1}
{0 CHEMBL14762,11 1,16 1,25 1,26 1,126 1,127 1,137 1,155 5}
{0 CHEMBL1516890,7 1,12 1,13 1,20 1,23 1,25 1,26 1,91 1,108 1,109 1,126 1,127 1,137 1,155 6.5}
{0 CHEMBL1614701,10 1,23 1,26 1,63 1,93 1,126 1,127 1,137 1,144 1,155 5}
{0 CHEMBL1614705,26 1,29 1,74 1,93 1,110 1,126 1,127 1,137 1,153 1,155 5.1}
{0 CHEMBL162,13 1,20 1,26 1,60 1,68 1,84 1,126 1,127 1,134 1,137 1,155 9.566}
{0 CHEMBL1624529,26 1,36 1,93 1,109 1,126 1,127 1,137 1,149 1,155 5.1}
{0 CHEMBL1650533,6 1,16 1,26 1,27 1,29 1,86 1,109 1,126 1,127 1,137 1,155 7}
{0 CHEMBL1650545,6 1,16 1,26 1,27 1,29 1,93 1,109 1,126 1,127 1,137 1,155 7}
{0 CHEMBL1650551,6 1,16 1,26 1,27 1,29 1,109 1,126 1,127 1,137 1,155 7}
{0 CHEMBL1682341,13 1,26 1,29 1,54 1,77 1,126 1,127 1,137 1,155 5.1}
{0 CHEMBL1682345,13 1,26 1,29 1,54 1,71 1,77 1,126 1,127 1,137 1,155 5.1}
{0 CHEMBL1682346,13 1,26 1,29 1,51 1,71 1,104 1,126 1,127 1,137 1,155 5.1}
{0 CHEMBL1682357,13 1,26 1,29 1,54 1,77 1,126 1,127 1,137 1,155 5.1}
{0 CHEMBL1682359,13 1,26 1,29 1,54 1,77 1,126 1,127 1,137 1,155 5.1}
{0 CHEMBL1682360,13 1,26 1,27 1,29 1,54 1,77 1,93 1,126 1,127 1,137 1,155 5.1}
{0 CHEMBL1682540,13 1,29 1,54 1,62 1,77 1,126 1,127 1,133 1,137 1,155 5.1}
{0 CHEMBL1682545,13 1,17 1,21 1,23 1,29 1,54 1,62 1,77 1,123 1,126 1,127 1,137 1,155 5.1}
{0 CHEMBL1682546,13 1,17 1,25 1,26 1,29 1,45 1,54 1,62 1,77 1,126 1,127 1,137 1,155 5.1}
{0 CHEMBL1682552,13 1,16 1,25 1,26 1,29 1,54 1,77 1,126 1,127 1,133 1,135 1,137 1,155 5.2}
{0 CHEMBL1682553,13 1,16 1,24 1,25 1,26 1,29 1,54 1,77 1,126 1,127 1,133 1,135 1,137 1,155 5.5}
{0 CHEMBL1682558,13 1,26 1,27 1,29 1,54 1,77 1,93 1,126 1,127 1,137 1,155 5.1}
{0 CHEMBL1721885,6 1,18 1,23 1,25 1,26 1,27 1,74 1,77 1,93 1,108 1,126 1,127 1,131 1,155 7.187}
{0 CHEMBL1727312,23 1,25 1,26 1,126 1,127 1,134 1,155 5.1}
{0 CHEMBL17370,18 1,26 1,41 1,49 1,82 1,93 1,124 1,126 1,127 1,137 1,141 1,155 5.1}
{0 CHEMBL1738710,21 1,26 1,38 1,93 1,126 1,127 1,130 1,155 5}
{0 CHEMBL1765781,16 1,25 1,26 1,27 1,39 1,60 1,108 1,126 1,127 1,137 1,155 6}
{0 CHEMBL178737,13 1,26 1,56 1,108 1,126 1,127 1,130 1,133 1,137 1,143 1,155 5.1}
{0 CHEMBL1789941,3 1,4 1,5 1,6 1,13 1,15 1,18 1,26 1,27 1,63 1,95 1,110 1,126 1,127 1,137 1,151 1,155 5}
{0 CHEMBL180022,9 1,13 1,19 1,21 1,23 1,25 1,26 1,27 1,91 1,108 1,126 1,127 1,130 1,134 1,137 1,138 1,140 1,155 7.237}
{0 CHEMBL1825138,15 1,16 1,20 1,24 1,26 1,51 1,76 1,93 1,103 1,126 1,127 1,137 1,152 1,155 5.5}
{0 CHEMBL183844,11 1,12 1,22 1,23 1,25 1,26 1,31 1,126 1,127 1,155 5.1}
{0 CHEMBL184847,11 1,12 1,22 1,23 1,25 1,26 1,126 1,127 1,155 5.4}
{0 CHEMBL185569,11 1,12 1,22 1,23 1,25 1,26 1,126 1,127 1,155 6}
{0 CHEMBL1890036,16 1,26 1,51 1,91 1,125 1,126 1,127 1,137 1,155 5.1}
{0 CHEMBL1908391,17 1,20 1,23 1,25 1,26 1,27 1,62 1,93 1,123 1,126 1,127 1,134 1,137 1,140 1,155 5}
{0 CHEMBL1908392,1 1,7 1,13 1,18 1,26 1,27 1,33 1,77 1,88 1,126 1,127 1,140 1,155 7.42}
{0 CHEMBL1908393,13 1,19 1,23 1,25 1,26 1,27 1,82 1,108 1,126 1,127 1,137 1,152 1,155 5}
{0 CHEMBL1908394,26 1,27 1,73 1,93 1,126 1,127 1,137 1,140 1,155 5}
{0 CHEMBL1908395,6 1,18 1,23 1,25 1,26 1,27 1,49 1,108 1,116 1,126 1,127 1,137 1,138 1,140 1,144 1,155 6.796}
{0 CHEMBL1908396,11 1,13 1,19 1,22 1,23 1,25 1,26 1,82 1,88 1,126 1,127 1,137 1,139 1,155 5}
{0 CHEMBL1908397,13 1,26 1,29 1,74 1,126 1,127 1,137 1,155 5}
{0 CHEMBL191003,21 1,23 1,26 1,48 1,51 1,93 1,113 1,126 1,127 1,137 1,155 6.7}
{0 CHEMBL1929238,11 1,12 1,16 1,22 1,23 1,25 1,26 1,27 1,31 1,93 1,119 1,126 1,127 1,137 1,138 1,140 1,155 4.523}
{0 CHEMBL1938680,23 1,25 1,26 1,93 1,126 1,127 1,137 1,155 4.523}
{0 CHEMBL1958401,2 1,22 1,26 1,93 1,108 1,126 1,127 1,137 1,155 5.1}
{0 CHEMBL196363,7 1,11 1,12 1,13 1,16 1,17 1,20 1,22 1,23 1,25 1,26 1,46 1,51 1,52 1,98 1,126 1,127 1,137 1,155 6.3}
{0 CHEMBL1964290,17 1,18 1,26 1,51 1,112 1,126 1,127 1,137 1,147 1,153 1,155 5.1}
{0 CHEMBL1964307,13 1,16 1,23 1,25 1,26 1,29 1,51 1,77 1,108 1,126 1,127 1,137 1,155 5.9}
{0 CHEMBL1964399,21 1,23 1,26 1,65 1,82 1,109 1,123 1,126 1,127 1,137 1,154 1,155 5.1}
{0 CHEMBL1964413,13 1,26 1,29 1,49 1,54 1,71 1,73 1,77 1,126 1,127 1,137 1,155 5.1}
{0 CHEMBL1964444,11 1,12 1,13 1,16 1,19 1,22 1,25 1,26 1,73 1,88 1,126 1,127 1,137 1,152 1,155 6.8}
{0 CHEMBL1964644,22 1,25 1,26 1,75 1,126 1,127 1,135 1,137 1,155 5.1}
{0 CHEMBL1964687,7 1,11 1,12 1,13 1,16 1,22 1,23 1,25 1,26 1,46 1,49 1,51 1,52 1,98 1,126 1,127 1,137 1,155 5.1}
{0 CHEMBL1964692,6 1,11 1,12 1,13 1,16 1,17 1,20 1,22 1,23 1,25 1,26 1,51 1,73 1,88 1,126 1,127 1,137 1,155 5.1}
{0 CHEMBL1964777,6 1,13 1,26 1,93 1,126 1,127 1,137 1,155 5.1}
{0 CHEMBL1964804,13 1,20 1,26 1,103 1,126 1,127 1,137 1,155 5.1}
{0 CHEMBL1964937,3 1,4 1,5 1,6 1,8 1,13 1,18 1,26 1,107 1,108 1,126 1,127 1,137 1,155 5.6}
{0 CHEMBL1965131,13 1,25 1,26 1,93 1,126 1,127 1,137 1,155 5.3}
{0 CHEMBL1965351,16 1,26 1,41 1,49 1,63 1,91 1,93 1,103 1,109 1,125 1,126 1,127 1,137 1,155 5.1}
{0 CHEMBL1965423,26 1,51 1,61 1,63 1,74 1,88 1,93 1,126 1,127 1,137 1,155 5.1}
{0 CHEMBL1965495,13 1,26 1,27 1,29 1,64 1,74 1,91 1,126 1,127 1,137 1,155 5.6}
{0 CHEMBL1965507,7 1,11 1,12 1,13 1,16 1,22 1,23 1,25 1,26 1,46 1,51 1,97 1,98 1,126 1,127 1,137 1,155 6.6}
{0 CHEMBL1965570,7 1,10 1,11 1,12 1,13 1,16 1,17 1,19 1,20 1,22 1,23 1,25 1,26 1,41 1,51 1,93 1,103 1,126 1,127 1,137 1,155 7.1}
{0 CHEMBL1965589,17 1,25 1,26 1,88 1,91 1,93 1,105 1,117 1,126 1,127 1,137 1,143 1,148 1,153 1,155 5.1}
{0 CHEMBL1965631,13 1,25 1,26 1,27 1,29 1,64 1,71 1,104 1,108 1,126 1,127 1,137 1,138 1,140 1,155 5.1}
{0 CHEMBL1965660,17 1,18 1,26 1,51 1,93 1,112 1,126 1,127 1,137 1,147 1,153 1,155 5.5}
{0 CHEMBL1965702,1 1,2 1,3 1,4 1,5 1,6 1,8 1,9 1,10 1,13 1,14 1,17 1,18 1,21 1,25 1,26 1,27 1,126 1,127 1,137 1,140 1,155 6.8}
{0 CHEMBL1965836,13 1,20 1,26 1,29 1,74 1,103 1,126 1,127 1,137 1,155 6.6}
{0 CHEMBL1965845,3 1,4 1,5 1,6 1,8 1,13 1,18 1,26 1,82 1,107 1,108 1,126 1,127 1,137 1,155 5.8}
{0 CHEMBL1965910,7 1,13 1,16 1,17 1,26 1,27 1,51 1,52 1,98 1,126 1,127 1,128 1,130 1,137 1,155 5.9}
{0 CHEMBL1965988,7 1,11 1,12 1,13 1,16 1,17 1,19 1,20 1,22 1,23 1,25 1,26 1,51 1,119 1,126 1,127 1,137 1,155 5.9}
{0 CHEMBL1966035,26 1,37 1,62 1,126 1,127 1,137 1,155 5.1}
{0 CHEMBL1966069,13 1,26 1,29 1,54 1,77 1,126 1,127 1,137 1,155 5.1}
{0 CHEMBL1966087,17 1,26 1,50 1,76 1,126 1,127 1,137 1,155 5.1}
{0 CHEMBL1966204,13 1,25 1,26 1,29 1,71 1,93 1,104 1,126 1,127 1,137 1,155 5.5}
{0 CHEMBL1966279,1 1,23 1,25 1,26 1,49 1,76 1,125 1,126 1,127 1,135 1,155 6.3}
{0 CHEMBL1966343,13 1,16 1,26 1,29 1,51 1,77 1,126 1,127 1,137 1,155 5.1}
{0 CHEMBL1966425,21 1,23 1,26 1,27 1,123 1,126 1,127 1,137 1,138 1,140 1,155 5.5}
{0 CHEMBL1966514,7 1,11 1,12 1,13 1,16 1,17 1,19 1,20 1,22 1,23 1,25 1,26 1,41 1,51 1,93 1,103 1,126 1,127 1,137 1,155 6.6}
{0 CHEMBL1966524,6 1,13 1,18 1,20 1,26 1,67 1,77 1,107 1,121 1,126 1,127 1,137 1,155 6.1}
{0 CHEMBL1966628,1 1,2 1,3 1,4 1,5 1,6 1,8 1,13 1,17 1,18 1,25 1,26 1,126 1,127 1,137 1,153 1,155 7.4}
{0 CHEMBL1966703,26 1,29 1,74 1,93 1,109 1,126 1,127 1,137 1,154 1,155 5.1}
{0 CHEMBL1966722,11 1,22 1,23 1,25 1,26 1,93 1,94 1,108 1,126 1,127 1,151 1,155 5.6}
{0 CHEMBL1966808,16 1,20 1,25 1,26 1,41 1,124 1,126 1,127 1,137 1,153 1,155 5.1}
{0 CHEMBL1966816,11 1,12 1,13 1,16 1,19 1,22 1,25 1,26 1,34 1,73 1,93 1,126 1,127 1,137 1,152 1,155 6.8}
{0 CHEMBL1966842,17 1,23 1,25 1,26 1,27 1,61 1,82 1,88 1,108 1,123 1,126 1,127 1,137 1,140 1,153 1,155 7.3}
{0 CHEMBL1967094,13 1,26 1,29 1,64 1,84 1,93 1,126 1,127 1,137 1,155 5.1}
{0 CHEMBL1967116,7 1,11 1,12 1,13 1,15 1,16 1,17 1,19 1,20 1,22 1,23 1,24 1,25 1,26 1,51 1,126 1,127 1,137 1,155 7.7}
{0 CHEMBL1967302,6 1,13 1,18 1,20 1,23 1,25 1,26 1,31 1,67 1,77 1,103 1,107 1,108 1,126 1,127 1,137 1,155 6.1}
{0 CHEMBL1967531,7 1,11 1,12 1,13 1,16 1,17 1,20 1,22 1,23 1,25 1,26 1,46 1,51 1,52 1,98 1,126 1,127 1,137 1,155 6.6}
{0 CHEMBL1967544,13 1,20 1,26 1,103 1,106 1,123 1,126 1,127 1,137 1,155 5.1}
{0 CHEMBL1967560,23 1,26 1,27 1,32 1,61 1,82 1,104 1,109 1,123 1,126 1,127 1,137 1,140 1,143 1,155 5.1}
{0 CHEMBL1967564,13 1,25 1,26 1,29 1,64 1,104 1,108 1,119 1,126 1,127 1,137 1,155 5.1}
{0 CHEMBL1967720,7 1,11 1,12 1,13 1,15 1,16 1,17 1,19 1,20 1,22 1,23 1,24 1,25 1,26 1,51 1,93 1,108 1,126 1,127 1,137 1,155 6.9}
{0 CHEMBL1967878,11 1,16 1,21 1,23 1,25 1,26 1,27 1,108 1,123 1,126 1,127 1,137 1,140 1,155 7.9}
{0 CHEMBL1967887,13 1,20 1,26 1,29 1,74 1,103 1,126 1,127 1,137 1,155 5.6}
{0 CHEMBL1968070,16 1,21 1,23 1,25 1,26 1,60 1,126 1,127 1,137 1,148 1,155 5.6}
{0 CHEMBL1968127,17 1,25 1,26 1,27 1,57 1,61 1,88 1,93 1,126 1,127 1,137 1,138 1,140 1,153 1,155 5.1}
{0 CHEMBL1968151,16 1,20 1,25 1,26 1,41 1,124 1,126 1,127 1,137 1,153 1,155 5.1}
{0 CHEMBL1968245,6 1,13 1,18 1,21 1,26 1,50 1,67 1,77 1,107 1,126 1,127 1,137 1,155 5.1}
{0 CHEMBL1968380,23 1,26 1,27 1,42 1,82 1,109 1,123 1,126 1,127 1,137 1,140 1,155 5.1}
{0 CHEMBL1968406,7 1,11 1,12 1,13 1,16 1,22 1,23 1,25 1,26 1,46 1,51 1,52 1,98 1,126 1,127 1,137 1,155 5.1}
{0 CHEMBL1968590,7 1,13 1,16 1,17 1,19 1,20 1,26 1,51 1,60 1,108 1,126 1,127 1,137 1,155 5.5}
{0 CHEMBL1968705,8 1,13 1,16 1,20 1,21 1,23 1,25 1,26 1,27 1,29 1,54 1,62 1,77 1,108 1,119 1,126 1,127 1,137 1,155 5.8}
{0 CHEMBL1968791,7 1,13 1,16 1,21 1,26 1,27 1,51 1,52 1,98 1,126 1,127 1,128 1,130 1,137 1,155 5.8}
{0 CHEMBL1968850,16 1,21 1,23 1,25 1,26 1,60 1,126 1,127 1,137 1,148 1,155 5.1}
{0 CHEMBL1968926,26 1,29 1,41 1,105 1,126 1,127 1,128 1,130 1,137 1,155 5.1}
{0 CHEMBL1968930,1 1,2 1,3 1,4 1,5 1,6 1,8 1,9 1,10 1,13 1,14 1,17 1,18 1,21 1,25 1,26 1,57 1,126 1,127 1,137 1,155 7.4}
{0 CHEMBL1969042,21 1,23 1,29 1,104 1,126 1,127 1,137 1,145 1,155 5.2}
{0 CHEMBL1969049,26 1,41 1,49 1,82 1,126 1,127 1,137 1,155 5.1}
{0 CHEMBL1969102,6 1,7 1,11 1,12 1,13 1,16 1,17 1,19 1,20 1,22 1,23 1,25 1,26 1,29 1,51 1,126 1,127 1,137 1,155 7.3}
{0 CHEMBL1969126,26 1,61 1,88 1,93 1,126 1,127 1,137 1,155 5.1}
{0 CHEMBL1969151,1 1,2 1,3 1,4 1,5 1,6 1,8 1,9 1,10 1,13 1,14 1,17 1,18 1,21 1,25 1,26 1,27 1,126 1,127 1,137 1,140 1,155 7.1}
{0 CHEMBL1969190,11 1,12 1,13 1,16 1,22 1,23 1,25 1,26 1,51 1,82 1,126 1,127 1,137 1,155 6.2}
{0 CHEMBL1969264,5 1,13 1,18 1,26 1,77 1,89 1,123 1,126 1,127 1,137 1,155 5.1}
{0 CHEMBL1969301,25 1,26 1,27 1,49 1,63 1,91 1,95 1,126 1,127 1,137 1,155 5.1}
{0 CHEMBL1969372,6 1,17 1,25 1,26 1,42 1,88 1,93 1,105 1,126 1,127 1,137 1,153 1,155 5.1}
{0 CHEMBL1969483,17 1,21 1,23 1,25 1,26 1,61 1,88 1,108 1,123 1,126 1,127 1,137 1,153 1,155 6.6}
{0 CHEMBL1969502,6 1,13 1,18 1,25 1,26 1,53 1,63 1,67 1,107 1,108 1,125 1,126 1,127 1,155 5.8}
{0 CHEMBL1969506,13 1,15 1,23 1,25 1,26 1,66 1,126 1,127 1,137 1,155 5.1}
{0 CHEMBL1969523,21 1,23 1,26 1,65 1,109 1,123 1,126 1,127 1,137 1,154 1,155 5.1}
{0 CHEMBL1969537,13 1,26 1,126 1,137 1,155 5.1}
{0 CHEMBL1969561,13 1,26 1,29 1,33 1,54 1,77 1,126 1,127 1,137 1,155 5.1}
{0 CHEMBL1969664,7 1,13 1,18 1,26 1,27 1,77 1,88 1,91 1,93 1,117 1,126 1,127 1,137 1,155 5.1}
{0 CHEMBL1969735,17 1,21 1,25 1,26 1,57 1,88 1,93 1,105 1,126 1,127 1,137 1,153 1,155 5.1}
{0 CHEMBL1969755,25 1,26 1,41 1,126 1,127 1,137 1,155 5.1}
{0 CHEMBL1969843,13 1,26 1,29 1,35 1,54 1,71 1,77 1,126 1,127 1,137 1,155 5.1}
{0 CHEMBL1969879,3 1,4 1,5 1,6 1,13 1,18 1,26 1,35 1,109 1,110 1,126 1,127 1,137 1,151 1,155 5.1}
{0 CHEMBL1970006,3 1,4 1,5 1,6 1,13 1,16 1,18 1,25 1,26 1,51 1,126 1,127 1,137 1,151 1,155 5.1}
{0 CHEMBL1970074,11 1,12 1,13 1,22 1,23 1,25 1,26 1,29 1,73 1,74 1,126 1,127 1,137 1,155 5.1}
{0 CHEMBL1970083,7 1,10 1,11 1,12 1,13 1,16 1,17 1,19 1,20 1,22 1,23 1,25 1,26 1,41 1,51 1,73 1,93 1,126 1,127 1,137 1,155 6.7}
{0 CHEMBL1970104,13 1,18 1,26 1,28 1,29 1,56 1,77 1,84 1,126 1,127 1,137 1,155 6.2}
{0 CHEMBL1970142,7 1,11 1,12 1,13 1,15 1,16 1,17 1,19 1,20 1,22 1,23 1,24 1,25 1,26 1,51 1,60 1,108 1,126 1,127 1,137 1,155 7.5}
{0 CHEMBL1970189,26 1,27 1,29 1,41 1,74 1,93 1,109 1,126 1,127 1,137 1,155 5.1}
{0 CHEMBL1970203,7 1,11 1,12 1,13 1,16 1,22 1,23 1,25 1,26 1,46 1,49 1,51 1,97 1,98 1,126 1,127 1,137 1,155 7.2}
{0 CHEMBL1970217,26 1,41 1,82 1,126 1,127 1,137 1,155 5.1}
{0 CHEMBL1970314,13 1,19 1,23 1,26 1,31 1,51 1,126 1,127 1,137 1,152 1,155 5.1}
{0 CHEMBL1970317,7 1,11 1,12 1,13 1,15 1,16 1,17 1,19 1,20 1,22 1,23 1,24 1,25 1,26 1,51 1,93 1,126 1,127 1,137 1,155 7.6}
{0 CHEMBL1970340,13 1,16 1,51 1,126 1,127 1,137 1,145 1,155 5.2}
{0 CHEMBL1970369,13 1,26 1,29 1,33 1,54 1,77 1,108 1,123 1,126 1,127 1,137 1,155 5.1}
{0 CHEMBL1970522,26 1,82 1,90 1,108 1,117 1,126 1,127 1,155 5.1}
{0 CHEMBL1970709,11 1,13 1,22 1,23 1,25 1,26 1,29 1,54 1,77 1,93 1,126 1,127 1,137 1,155 5.1}
{0 CHEMBL1970735,16 1,25 1,26 1,27 1,51 1,91 1,108 1,109 1,114 1,126 1,127 1,137 1,155 5.1}
{0 CHEMBL1970806,16 1,20 1,25 1,26 1,124 1,126 1,127 1,137 1,153 1,155 5.1}
{0 CHEMBL1970879,7 1,13 1,16 1,20 1,23 1,25 1,26 1,27 1,31 1,51 1,82 1,98 1,126 1,127 1,137 1,152 1,155 5.8}
{0 CHEMBL1970903,6 1,13 1,18 1,20 1,26 1,29 1,67 1,74 1,77 1,103 1,107 1,126 1,127 1,137 1,155 7.3}
{0 CHEMBL1970913,13 1,16 1,25 1,26 1,108 1,119 1,126 1,127 1,137 1,155 5.1}
{0 CHEMBL1971017,6 1,13 1,17 1,20 1,26 1,93 1,126 1,127 1,137 1,155 6.2}
{0 CHEMBL1971021,11 1,12 1,22 1,23 1,25 1,26 1,49 1,73 1,126 1,127 1,155 5.1}
{0 CHEMBL1971029,11 1,16 1,23 1,26 1,60 1,82 1,91 1,123 1,126 1,127 1,134 1,137 1,155 8}
{0 CHEMBL1971141,11 1,12 1,22 1,23 1,25 1,26 1,31 1,126 1,127 1,155 5.1}
{0 CHEMBL1971149,6 1,17 1,25 1,26 1,57 1,88 1,91 1,93 1,105 1,117 1,126 1,127 1,137 1,143 1,153 1,155 5.1}
{0 CHEMBL1971172,1 1,2 1,3 1,4 1,5 1,6 1,8 1,10 1,13 1,16 1,18 1,21 1,25 1,26 1,57 1,92 1,126 1,127 1,137 1,141 1,155 6}
{0 CHEMBL1971186,17 1,25 1,26 1,61 1,76 1,88 1,93 1,126 1,127 1,137 1,153 1,155 5.1}
{0 CHEMBL1971245,17 1,21 1,23 1,26 1,27 1,123 1,126 1,127 1,133 1,137 1,140 1,153 1,155 5.1}
{0 CHEMBL1971430,26 1,49 1,93 1,120 1,126 1,127 1,137 1,155 5.1}
{0 CHEMBL1971649,10 1,11 1,12 1,19 1,22 1,23 1,25 1,26 1,32 1,51 1,88 1,93 1,126 1,127 1,137 1,155 5.1}
{0 CHEMBL1971694,23 1,25 1,26 1,76 1,93 1,108 1,126 1,127 1,143 1,155 5.1}
{0 CHEMBL1971801,16 1,23 1,25 1,26 1,126 1,127 1,137 1,148 1,155 5.2}
{0 CHEMBL1971943,3 1,4 1,5 1,6 1,8 1,9 1,10 1,13 1,16 1,18 1,21 1,26 1,44 1,51 1,107 1,126 1,127 1,137 1,155 6.3}
{0 CHEMBL1971947,7 1,11 1,12 1,13 1,16 1,17 1,19 1,20 1,22 1,23 1,25 1,26 1,51 1,126 1,127 1,137 1,155 6}
{0 CHEMBL1972119,11 1,12 1,13 1,16 1,19 1,22 1,25 1,26 1,73 1,109 1,126 1,127 1,137 1,155 5.2}
{0 CHEMBL1972125,1 1,6 1,13 1,18 1,20 1,23 1,26 1,31 1,51 1,67 1,77 1,103 1,107 1,126 1,127 1,137 1,155 5.5}
{0 CHEMBL1972142,3 1,4 1,5 1,6 1,8 1,13 1,18 1,20 1,26 1,31 1,103 1,126 1,127 1,137 1,151 1,155 5.1}
{0 CHEMBL1972152,5 1,26 1,117 1,126 1,127 1,130 1,137 1,155 5.1}
{0 CHEMBL1972158,13 1,26 1,29 1,51 1,104 1,126 1,127 1,128 1,137 1,155 5.1}
{0 CHEMBL1972183,26 1,27 1,126 1,127 1,137 1,140 1,155 5.1}
{0 CHEMBL1972221,13 1,16 1,23 1,25 1,26 1,29 1,77 1,91 1,108 1,119 1,126 1,127 1,137 1,155 5.1}
{0 CHEMBL1972250,20 1,26 1,27 1,29 1,49 1,82 1,84 1,91 1,126 1,127 1,137 1,155 5.1}
{0 CHEMBL1972258,26 1,50 1,126 1,127 1,135 1,137 1,155 5.1}
{0 CHEMBL1972276,16 1,18 1,25 1,26 1,27 1,56 1,77 1,126 1,127 1,137 1,146 1,155 5.1}
{0 CHEMBL1972290,1 1,2 1,3 1,4 1,5 1,6 1,8 1,10 1,13 1,16 1,18 1,21 1,25 1,26 1,92 1,126 1,127 1,137 1,141 1,155 7}
{0 CHEMBL1972339,13 1,26 1,29 1,74 1,93 1,126 1,127 1,128 1,137 1,155 6.3}
{0 CHEMBL1972346,8 1,26 1,111 1,126 1,127 1,145 1,155 6.2}
{0 CHEMBL1972362,6 1,13 1,17 1,20 1,26 1,126 1,127 1,137 1,155 5.7}
{0 CHEMBL1972489,6 1,13 1,23 1,25 1,26 1,29 1,93 1,126 1,127 1,137 1,155 5.1}
{0 CHEMBL1972568,26 1,50 1,82 1,126 1,127 1,137 1,155 5.1}
{0 CHEMBL1972576,7 1,11 1,12 1,13 1,16 1,22 1,23 1,25 1,26 1,46 1,51 1,97 1,98 1,126 1,127 1,137 1,155 6.3}
{0 CHEMBL1972584,7 1,13 1,16 1,20 1,23 1,25 1,26 1,27 1,31 1,51 1,98 1,126 1,127 1,137 1,152 1,155 5.5}
{0 CHEMBL1972659,13 1,26 1,108 1,125 1,126 1,127 1,155 5.1}
{0 CHEMBL1972820,26 1,40 1,118 1,126 1,127 1,155 5.1}
{0 CHEMBL1972840,6 1,13 1,18 1,20 1,26 1,67 1,77 1,107 1,121 1,126 1,127 1,137 1,155 5.5}
{0 CHEMBL1972849,26 1,61 1,88 1,93 1,126 1,127 1,137 1,155 5.1}
{0 CHEMBL1972937,26 1,82 1,90 1,108 1,117 1,126 1,127 1,155 5.1}
{0 CHEMBL1972988,1 1,2 1,3 1,4 1,5 1,6 1,8 1,10 1,13 1,14 1,18 1,21 1,126 1,127 1,137 1,155 5.5}
{0 CHEMBL1973098,26 1,82 1,108 1,117 1,126 1,127 1,155 5.1}
{0 CHEMBL1973142,13 1,25 1,26 1,93 1,108 1,126 1,127 1,137 1,155 5.4}
{0 CHEMBL1973145,7 1,11 1,12 1,13 1,16 1,17 1,20 1,22 1,23 1,25 1,26 1,46 1,51 1,52 1,126 1,127 1,137 1,155 5.1}
{0 CHEMBL1973211,7 1,11 1,12 1,13 1,16 1,17 1,19 1,20 1,22 1,23 1,25 1,26 1,27 1,51 1,126 1,127 1,137 1,155 6.4}
{0 CHEMBL1973348,1 1,6 1,13 1,18 1,20 1,23 1,26 1,31 1,51 1,67 1,77 1,93 1,103 1,107 1,126 1,127 1,137 1,155 5.2}
{0 CHEMBL1973395,2 1,3 1,4 1,5 1,6 1,13 1,18 1,26 1,109 1,126 1,127 1,137 1,141 1,155 7.6}
{0 CHEMBL1973483,11 1,12 1,13 1,16 1,19 1,22 1,25 1,26 1,73 1,126 1,127 1,137 1,152 1,155 5.2}
{0 CHEMBL1973711,26 1,27 1,93 1,108 1,114 1,126 1,127 1,155 5.1}
{0 CHEMBL1973720,1 1,2 1,3 1,4 1,5 1,6 1,8 1,9 1,10 1,13 1,14 1,17 1,18 1,21 1,25 1,26 1,126 1,127 1,137 1,155 7.1}
{0 CHEMBL1973808,13 1,23 1,25 1,26 1,29 1,54 1,77 1,93 1,126 1,127 1,137 1,155 5.1}
{0 CHEMBL1973860,13 1,16 1,20 1,25 1,26 1,41 1,103 1,126 1,127 1,137 1,155 5.1}
{0 CHEMBL1973893,13 1,16 1,23 1,25 1,26 1,29 1,77 1,91 1,108 1,126 1,127 1,137 1,155 5.1}
{0 CHEMBL1973937,11 1,12 1,13 1,22 1,23 1,25 1,26 1,29 1,35 1,51 1,93 1,104 1,122 1,126 1,127 1,137 1,155 5.8}
{0 CHEMBL1973961,13 1,25 1,26 1,27 1,29 1,82 1,88 1,104 1,126 1,127 1,137 1,139 1,140 1,145 1,155 5.5}
{0 CHEMBL1974157,8 1,26 1,27 1,108 1,126 1,127 1,155 5.1}
{0 CHEMBL1974254,7 1,11 1,12 1,13 1,15 1,16 1,17 1,19 1,20 1,22 1,23 1,24 1,25 1,26 1,51 1,126 1,127 1,137 1,155 7.5}
{0 CHEMBL1974288,26 1,41 1,126 1,127 1,137 1,155 5.1}
{0 CHEMBL1974310,6 1,13 1,17 1,20 1,26 1,93 1,126 1,127 1,137 1,155 5.4}
{0 CHEMBL1974328,16 1,21 1,23 1,25 1,26 1,91 1,125 1,126 1,127 1,137 1,155 6.9}
{0 CHEMBL1974416,1 1,2 1,3 1,4 1,5 1,6 1,8 1,13 1,18 1,25 1,26 1,93 1,126 1,127 1,137 1,141 1,155 6.2}
{0 CHEMBL1974457,6 1,13 1,17 1,20 1,26 1,93 1,126 1,127 1,137 1,155 5.1}
{0 CHEMBL1974664,13 1,16 1,18 1,26 1,49 1,63 1,77 1,82 1,98 1,103 1,106 1,125 1,126 1,127 1,137 1,155 5.6}
{0 CHEMBL1974702,13 1,26 1,34 1,59 1,90 1,93 1,126 1,127 1,137 1,155 5.1}
{0 CHEMBL1974803,25 1,26 1,93 1,108 1,126 1,127 1,155 5.1}
{0 CHEMBL1974870,13 1,20 1,26 1,29 1,74 1,93 1,103 1,126 1,127 1,137 1,155 7.2}
{0 CHEMBL1974935,6 1,13 1,18 1,26 1,50 1,67 1,77 1,107 1,126 1,127 1,137 1,155 5.1}
{0 CHEMBL1975121,26 1,41 1,82 1,126 1,127 1,137 1,155 5.1}
{0 CHEMBL1975128,13 1,21 1,26 1,29 1,51 1,104 1,126 1,127 1,137 1,155 5.1}
{0 CHEMBL1975138,11 1,22 1,23 1,25 1,26 1,93 1,94 1,108 1,126 1,127 1,151 1,155 5.1}
{0 CHEMBL1975208,13 1,26 1,40 1,46 1,66 1,108 1,109 1,126 1,137 1,155 5.1}
{0 CHEMBL1975233,11 1,12 1,16 1,22 1,25 1,26 1,27 1,82 1,91 1,126 1,127 1,137 1,155 5.1}
{0 CHEMBL1975256,16 1,26 1,51 1,91 1,117 1,125 1,126 1,127 1,137 1,155 5.1}
{0 CHEMBL1975357,2 1,13 1,20 1,26 1,74 1,126 1,127 1,137 1,155 5.1}
{0 CHEMBL1975418,13 1,26 1,29 1,54 1,77 1,126 1,127 1,137 1,155 5.3}
{0 CHEMBL1975490,21 1,23 1,26 1,123 1,126 1,127 1,135 1,137 1,155 5.1}
{0 CHEMBL1975500,23 1,25 1,26 1,38 1,66 1,82 1,108 1,126 1,127 1,134 1,155 5.1}
{0 CHEMBL1975534,7 1,13 1,16 1,26 1,51 1,98 1,124 1,126 1,137 1,155 5.1}
{0 CHEMBL1975647,11 1,12 1,13 1,16 1,19 1,22 1,25 1,26 1,34 1,88 1,93 1,126 1,127 1,137 1,155 5.9}
{0 CHEMBL1975787,6 1,13 1,17 1,20 1,26 1,93 1,126 1,127 1,137 1,155 5.6}
{0 CHEMBL1975900,25 1,26 1,93 1,126 1,127 1,137 1,155 5.1}
{0 CHEMBL1976040,12 1,20 1,21 1,23 1,26 1,27 1,32 1,62 1,109 1,123 1,126 1,127 1,137 1,140 1,155 5.5}
{0 CHEMBL1976090,7 1,13 1,16 1,46 1,51 1,77 1,98 1,126 1,137 1,155 5.5}
{0 CHEMBL1976093,17 1,25 1,26 1,27 1,42 1,57 1,88 1,93 1,105 1,126 1,127 1,137 1,138 1,140 1,153 1,155 5.1}
{0 CHEMBL1976134,3 1,4 1,5 1,6 1,8 1,13 1,18 1,20 1,23 1,29 1,103 1,126 1,127 1,137 1,151 1,155 5.9}
{0 CHEMBL1976220,7 1,11 1,12 1,13 1,16 1,17 1,19 1,20 1,22 1,23 1,25 1,26 1,51 1,93 1,126 1,127 1,137 1,155 5.7}
{0 CHEMBL1976240,26 1,41 1,82 1,126 1,127 1,137 1,155 5.1}
{0 CHEMBL1976328,11 1,12 1,13 1,16 1,22 1,23 1,25 1,26 1,49 1,51 1,126 1,127 1,137 1,155 5.1}
{0 CHEMBL1976420,5 1,8 1,18 1,19 1,26 1,88 1,126 1,127 1,137 1,147 1,155 5.5}
{0 CHEMBL1976455,11 1,12 1,13 1,16 1,19 1,22 1,25 1,26 1,73 1,88 1,126 1,127 1,137 1,155 5.8}
{0 CHEMBL1976732,17 1,26 1,61 1,88 1,93 1,126 1,127 1,135 1,137 1,155 5.1}
{0 CHEMBL1976936,1 1,2 1,3 1,4 1,5 1,6 1,8 1,10 1,13 1,16 1,18 1,20 1,21 1,25 1,26 1,39 1,64 1,114 1,126 1,127 1,137 1,155 8.1}
{0 CHEMBL1977041,11 1,12 1,16 1,22 1,23 1,25 1,26 1,51 1,59 1,91 1,98 1,112 1,126 1,127 1,137 1,155 6.1}
{0 CHEMBL1977128,13 1,25 1,26 1,27 1,29 1,49 1,71 1,91 1,104 1,126 1,127 1,137 1,155 5.5}
{0 CHEMBL1977135,26 1,41 1,126 1,127 1,137 1,155 5.1}
{0 CHEMBL1977148,7 1,11 1,12 1,13 1,15 1,16 1,17 1,19 1,20 1,22 1,23 1,24 1,25 1,26 1,48 1,51 1,82 1,126 1,127 1,137 1,155 7.9}
{0 CHEMBL1977223,13 1,25 1,26 1,29 1,64 1,71 1,104 1,108 1,119 1,126 1,127 1,137 1,155 5.1}
{0 CHEMBL1977346,16 1,21 1,23 1,25 1,26 1,60 1,126 1,127 1,137 1,148 1,155 5.6}
{0 CHEMBL1977374,26 1,93 1,126 1,127 1,137 1,138 1,155 5.1}
{0 CHEMBL1977604,21 1,26 1,33 1,98 1,126 1,127 1,155 5.1}
{0 CHEMBL1977681,13 1,26 1,29 1,60 1,64 1,84 1,93 1,100 1,126 1,127 1,137 1,155 5.2}
{0 CHEMBL1977713,11 1,13 1,22 1,23 1,25 1,26 1,29 1,77 1,93 1,126 1,127 1,137 1,155 5.1}
{0 CHEMBL1977814,24 1,26 1,51 1,62 1,93 1,109 1,126 1,127 1,137 1,155 5.1}
{0 CHEMBL1978014,13 1,16 1,26 1,27 1,51 1,71 1,126 1,127 1,137 1,140 1,155 5.1}
{0 CHEMBL1978099,11 1,16 1,21 1,23 1,26 1,60 1,108 1,123 1,126 1,127 1,137 1,155 5.4}
{0 CHEMBL1978166,7 1,11 1,12 1,13 1,16 1,17 1,19 1,20 1,22 1,23 1,25 1,26 1,51 1,126 1,127 1,135 1,137 1,155 5.6}
{0 CHEMBL1978200,17 1,25 1,26 1,88 1,91 1,93 1,105 1,117 1,126 1,127 1,137 1,143 1,153 1,155 5.1}
{0 CHEMBL1978267,17 1,21 1,23 1,25 1,26 1,61 1,88 1,123 1,126 1,127 1,137 1,153 1,155 6.6}
{0 CHEMBL1978448,23 1,25 1,26 1,27 1,126 1,127 1,137 1,152 1,155 5.1}
{0 CHEMBL1978656,23 1,25 1,26 1,114 1,126 1,127 1,137 1,153 1,155 5.1}
{0 CHEMBL1979057,18 1,21 1,23 1,26 1,56 1,77 1,126 1,127 1,137 1,155 5.8}
{0 CHEMBL1979093,11 1,12 1,13 1,16 1,22 1,23 1,25 1,26 1,51 1,82 1,93 1,126 1,127 1,137 1,155 6}
{0 CHEMBL1979176,11 1,12 1,13 1,16 1,19 1,22 1,25 1,26 1,73 1,82 1,126 1,127 1,137 1,155 5.1}
{0 CHEMBL1979252,25 1,26 1,49 1,73 1,126 1,127 1,137 1,155 5.1}
{0 CHEMBL1979318,26 1,27 1,29 1,41 1,74 1,93 1,109 1,126 1,127 1,137 1,155 5.1}
{0 CHEMBL1979357,7 1,13 1,20 1,26 1,49 1,50 1,126 1,127 1,137 1,155 5.1}
{0 CHEMBL1979516,7 1,11 1,12 1,13 1,16 1,17 1,19 1,20 1,22 1,23 1,25 1,26 1,51 1,85 1,93 1,126 1,127 1,137 1,155 7.3}
{0 CHEMBL1979554,13 1,23 1,25 1,26 1,29 1,54 1,77 1,93 1,126 1,127 1,137 1,155 5.1}
{0 CHEMBL1979577,7 1,11 1,12 1,13 1,16 1,17 1,19 1,20 1,22 1,23 1,25 1,26 1,51 1,126 1,127 1,137 1,155 5.4}
{0 CHEMBL1979718,13 1,20 1,25 1,26 1,29 1,88 1,126 1,127 1,137 1,155 5.1}
{0 CHEMBL1979855,11 1,12 1,13 1,16 1,22 1,23 1,25 1,26 1,27 1,126 1,127 1,137 1,155 5.8}
{0 CHEMBL1979883,7 1,11 1,12 1,13 1,16 1,17 1,19 1,20 1,22 1,23 1,25 1,26 1,27 1,51 1,126 1,127 1,137 1,138 1,140 1,155 6}
{0 CHEMBL1979933,21 1,23 1,26 1,40 1,93 1,123 1,126 1,127 1,134 1,137 1,155 5.5}
{0 CHEMBL1979970,13 1,25 1,26 1,29 1,64 1,93 1,104 1,108 1,119 1,126 1,127 1,137 1,155 5.1}
{0 CHEMBL1980142,11 1,12 1,13 1,16 1,19 1,22 1,25 1,26 1,73 1,126 1,127 1,137 1,152 1,155 5.1}
{0 CHEMBL1980144,7 1,11 1,12 1,13 1,16 1,22 1,23 1,25 1,26 1,46 1,51 1,97 1,98 1,126 1,127 1,137 1,155 6.4}
{0 CHEMBL1980163,13 1,16 1,21 1,23 1,26 1,98 1,126 1,127 1,128 1,130 1,137 1,155 5.1}
{0 CHEMBL1980178,1 1,2 1,3 1,4 1,5 1,6 1,8 1,9 1,10 1,13 1,14 1,17 1,18 1,21 1,25 1,26 1,66 1,108 1,114 1,126 1,127 1,137 1,155 6.5}
{0 CHEMBL1980253,1 1,2 1,3 1,4 1,5 1,6 1,8 1,9 1,10 1,13 1,14 1,17 1,18 1,21 1,25 1,26 1,126 1,127 1,137 1,155 6.9}
{0 CHEMBL1980297,7 1,11 1,12 1,13 1,15 1,16 1,17 1,19 1,20 1,22 1,23 1,24 1,25 1,26 1,48 1,51 1,93 1,126 1,127 1,137 1,155 7.8}
{0 CHEMBL1980391,24 1,26 1,29 1,33 1,82 1,93 1,104 1,126 1,127 1,134 1,137 1,155 7.4}
{0 CHEMBL1980435,13 1,25 1,26 1,29 1,71 1,82 1,104 1,126 1,127 1,137 1,155 5.5}
{0 CHEMBL1980489,25 1,26 1,93 1,126 1,127 1,137 1,155 5.1}
{0 CHEMBL1980540,11 1,12 1,13 1,16 1,19 1,22 1,25 1,26 1,34 1,73 1,93 1,126 1,127 1,137 1,152 1,155 5.1}
{0 CHEMBL1980562,1 1,2 1,3 1,4 1,5 1,6 1,8 1,9 1,10 1,13 1,14 1,17 1,18 1,21 1,25 1,26 1,126 1,127 1,137 1,155 6.7}
{0 CHEMBL1980704,9 1,13 1,26 1,105 1,126 1,127 1,130 1,131 1,133 1,137 1,155 5.1}
{0 CHEMBL1980715,20 1,22 1,23 1,25 1,26 1,126 1,127 1,137 1,155 5.4}
{0 CHEMBL1980802,11 1,12 1,16 1,22 1,25 1,26 1,27 1,91 1,93 1,109 1,126 1,127 1,137 1,155 6.1}
{0 CHEMBL1980896,7 1,13 1,16 1,21 1,23 1,25 1,26 1,46 1,51 1,52 1,93 1,98 1,108 1,126 1,127 1,137 1,155 5.1}
{0 CHEMBL1980995,13 1,20 1,26 1,60 1,68 1,84 1,126 1,127 1,134 1,137 1,155 9.4}
{0 CHEMBL1981045,23 1,25 1,26 1,82 1,126 1,127 1,133 1,134 1,155 5.1}
{0 CHEMBL1981047,16 1,25 1,26 1,27 1,28 1,29 1,54 1,74 1,126 1,127 1,130 1,137 1,140 1,155 6.4}
{0 CHEMBL1981079,17 1,18 1,26 1,51 1,93 1,112 1,126 1,127 1,137 1,147 1,153 1,155 5.2}
{0 CHEMBL1981410,11 1,12 1,16 1,22 1,23 1,25 1,26 1,60 1,73 1,98 1,126 1,127 1,137 1,155 5.6}
{0 CHEMBL1981720,11 1,12 1,13 1,16 1,19 1,22 1,25 1,26 1,88 1,126 1,127 1,137 1,155 5.9}
{0 CHEMBL1981725,10 1,17 1,21 1,23 1,25 1,26 1,27 1,31 1,93 1,105 1,123 1,126 1,127 1,133 1,137 1,153 1,155 6.4}
{0 CHEMBL1981782,11 1,13 1,22 1,23 1,25 1,26 1,29 1,54 1,77 1,93 1,126 1,127 1,137 1,155 5.1}
{0 CHEMBL1982122,25 1,26 1,41 1,126 1,127 1,135 1,137 1,155 5.1}
{0 CHEMBL1982135,7 1,11 1,12 1,13 1,16 1,22 1,23 1,25 1,26 1,46 1,51 1,52 1,98 1,126 1,127 1,137 1,155 5.1}
{0 CHEMBL1982167,25 1,26 1,82 1,114 1,126 1,127 1,137 1,153 1,155 5.1}
{0 CHEMBL1982271,1 1,2 1,3 1,4 1,5 1,6 1,8 1,9 1,10 1,13 1,14 1,17 1,18 1,21 1,25 1,26 1,27 1,108 1,126 1,127 1,137 1,138 1,140 1,155 6.6}
{0 CHEMBL1982361,25 1,26 1,93 1,126 1,127 1,137 1,155 5.1}
{0 CHEMBL1982383,17 1,25 1,26 1,57 1,77 1,88 1,91 1,93 1,105 1,117 1,126 1,127 1,136 1,137 1,153 1,155 5.1}
{0 CHEMBL1982465,7 1,11 1,12 1,13 1,16 1,17 1,19 1,20 1,22 1,23 1,25 1,26 1,27 1,51 1,126 1,127 1,137 1,155 6}
{0 CHEMBL1982466,7 1,11 1,12 1,13 1,15 1,16 1,17 1,19 1,20 1,22 1,23 1,24 1,25 1,26 1,51 1,126 1,127 1,137 1,155 7.5}
{0 CHEMBL1982476,7 1,11 1,12 1,13 1,16 1,17 1,19 1,20 1,22 1,23 1,25 1,26 1,51 1,60 1,93 1,100 1,126 1,127 1,137 1,155 7.7}
{0 CHEMBL1982506,13 1,26 1,82 1,91 1,104 1,126 1,127 1,137 1,155 5.9}
{0 CHEMBL1982563,17 1,25 1,26 1,57 1,88 1,91 1,93 1,105 1,117 1,126 1,127 1,137 1,143 1,153 1,155 5.1}
{0 CHEMBL1982610,26 1,62 1,93 1,126 1,127 1,137 1,155 5.3}
{0 CHEMBL1982660,11 1,12 1,13 1,16 1,19 1,22 1,25 1,26 1,73 1,82 1,126 1,127 1,137 1,152 1,155 6.3}
{0 CHEMBL1982711,2 1,3 1,4 1,5 1,6 1,8 1,13 1,18 1,25 1,26 1,59 1,126 1,127 1,137 1,141 1,155 6.3}
{0 CHEMBL1982753,16 1,21 1,23 1,25 1,26 1,93 1,125 1,126 1,127 1,137 1,155 6.1}
{0 CHEMBL1982866,26 1,42 1,74 1,93 1,126 1,127 1,137 1,153 1,155 5.1}
{0 CHEMBL1982874,26 1,51 1,61 1,63 1,74 1,88 1,93 1,126 1,127 1,137 1,155 5.1}
{0 CHEMBL1982880,16 1,20 1,26 1,82 1,91 1,126 1,127 1,137 1,155 5.3}
{0 CHEMBL1982924,1 1,2 1,3 1,4 1,5 1,6 1,8 1,13 1,18 1,25 1,26 1,82 1,126 1,127 1,137 1,141 1,155 6.8}
{0 CHEMBL1982957,1 1,2 1,3 1,4 1,5 1,6 1,8 1,13 1,18 1,20 1,26 1,31 1,103 1,126 1,127 1,137 1,141 1,155 7.1}
{0 CHEMBL1982980,10 1,13 1,18 1,26 1,74 1,93 1,126 1,127 1,155 5.1}
{0 CHEMBL1982992,13 1,16 1,21 1,23 1,46 1,98 1,126 1,127 1,137 1,145 1,155 5.1}
{0 CHEMBL1983006,11 1,12 1,16 1,22 1,25 1,26 1,27 1,40 1,82 1,91 1,126 1,127 1,137 1,155 5.5}
{0 CHEMBL1983025,7 1,11 1,12 1,13 1,16 1,17 1,19 1,20 1,22 1,23 1,25 1,26 1,51 1,126 1,127 1,137 1,155 5.2}
{0 CHEMBL1983111,16 1,19 1,21 1,23 1,25 1,26 1,66 1,73 1,108 1,123 1,126 1,127 1,137 1,155 7.3}
{0 CHEMBL1983195,23 1,25 1,26 1,117 1,121 1,126 1,127 1,137 1,155 5.1}
{0 CHEMBL1983268,13 1,25 1,26 1,27 1,29 1,88 1,104 1,126 1,127 1,137 1,140 1,155 5.7}
{0 CHEMBL1983309,25 1,26 1,36 1,82 1,93 1,126 1,127 1,137 1,139 1,145 1,155 5.1}
{0 CHEMBL1983449,26 1,37 1,49 1,97 1,126 1,127 1,128 1,130 1,137 1,155 5.1}
{0 CHEMBL1983534,25 1,26 1,41 1,45 1,126 1,127 1,137 1,155 5.1}
{0 CHEMBL1983589,1 1,2 1,3 1,4 1,5 1,6 1,8 1,10 1,13 1,16 1,18 1,20 1,21 1,25 1,26 1,39 1,64 1,126 1,127 1,137 1,155 7.3}
{0 CHEMBL1983595,13 1,25 1,26 1,29 1,71 1,93 1,104 1,126 1,127 1,137 1,155 5.5}
{0 CHEMBL1983923,16 1,26 1,27 1,29 1,41 1,74 1,109 1,126 1,127 1,137 1,140 1,155 5.4}
{0 CHEMBL1983932,10 1,11 1,12 1,13 1,16 1,19 1,21 1,22 1,25 1,26 1,82 1,126 1,127 1,137 1,155 5.1}
{0 CHEMBL1983945,6 1,13 1,18 1,25 1,26 1,50 1,67 1,77 1,107 1,108 1,126 1,127 1,137 1,155 5.2}
{0 CHEMBL1983963,7 1,11 1,12 1,13 1,16 1,17 1,20 1,22 1,23 1,25 1,26 1,46 1,51 1,52 1,98 1,126 1,127 1,137 1,155 6}
{0 CHEMBL1984038,23 1,25 1,26 1,45 1,82 1,126 1,127 1,134 1,155 5.2}
{0 CHEMBL1984039,10 1,13 1,18 1,26 1,74 1,126 1,127 1,137 1,155 5.1}
{0 CHEMBL1984044,18 1,26 1,27 1,56 1,77 1,126 1,127 1,137 1,155 5.1}
{0 CHEMBL1984162,7 1,13 1,16 1,21 1,23 1,26 1,49 1,51 1,98 1,123 1,126 1,127 1,137 1,152 1,155 6.3}
{0 CHEMBL1984191,29 1,74 1,84 1,93 1,126 1,127 1,137 1,153 1,155 5.1}
{0 CHEMBL1984206,26 1,27 1,51 1,91 1,109 1,114 1,126 1,127 1,137 1,155 5.1}
{0 CHEMBL1984274,26 1,27 1,72 1,93 1,126 1,127 1,137 1,155 5.1}
{0 CHEMBL1984363,13 1,16 1,23 1,25 1,26 1,29 1,51 1,77 1,93 1,108 1,126 1,127 1,137 1,155 6.1}
{0 CHEMBL1984367,13 1,26 1,29 1,64 1,84 1,126 1,127 1,137 1,155 5.1}
{0 CHEMBL1984432,13 1,26 1,29 1,49 1,54 1,71 1,77 1,126 1,127 1,137 1,155 5.1}
{0 CHEMBL1984541,26 1,37 1,93 1,97 1,126 1,127 1,155 5.1}
{0 CHEMBL1984548,11 1,15 1,16 1,23 1,26 1,123 1,126 1,127 1,134 1,137 1,152 1,155 8.4}
{0 CHEMBL1984586,7 1,11 1,12 1,13 1,16 1,17 1,20 1,22 1,23 1,25 1,26 1,46 1,51 1,52 1,98 1,126 1,127 1,137 1,155 5.7}
{0 CHEMBL1984633,8 1,20 1,26 1,41 1,82 1,122 1,126 1,127 1,137 1,155 5.1}
{0 CHEMBL1984700,17 1,25 1,26 1,88 1,93 1,105 1,109 1,126 1,127 1,137 1,153 1,155 5.1}
{0 CHEMBL1984711,16 1,21 1,26 1,45 1,82 1,123 1,126 1,127 1,137 1,155 5.1}
{0 CHEMBL1984788,18 1,26 1,56 1,76 1,126 1,127 1,137 1,155 5.1}
{0 CHEMBL1984842,17 1,25 1,26 1,57 1,88 1,93 1,105 1,109 1,126 1,127 1,137 1,153 1,155 5.1}
{0 CHEMBL1985074,13 1,26 1,82 1,104 1,126 1,127 1,137 1,155 5.1}
{0 CHEMBL1985092,16 1,21 1,23 1,29 1,84 1,93 1,126 1,127 1,137 1,145 1,155 5.3}
{0 CHEMBL1985095,6 1,13 1,26 1,29 1,51 1,54 1,108 1,121 1,126 1,127 1,137 1,155 5.6}
{0 CHEMBL1985311,10 1,11 1,12 1,13 1,22 1,23 1,25 1,26 1,29 1,51 1,93 1,104 1,122 1,126 1,127 1,137 1,155 6.5}
{0 CHEMBL1985406,13 1,25 1,26 1,29 1,64 1,93 1,104 1,108 1,119 1,126 1,127 1,137 1,155 5.1}
{0 CHEMBL1985566,23 1,25 1,26 1,27 1,82 1,126 1,127 1,134 1,155 5.1}
{0 CHEMBL1985580,13 1,25 1,26 1,50 1,108 1,126 1,127 1,137 1,155 5.1}
{0 CHEMBL1985723,1 1,2 1,3 1,4 1,5 1,6 1,8 1,10 1,13 1,16 1,18 1,21 1,25 1,26 1,57 1,92 1,126 1,127 1,137 1,141 1,155 6.5}
{0 CHEMBL1986139,13 1,16 1,21 1,23 1,46 1,98 1,126 1,127 1,137 1,155 5.1}
{0 CHEMBL1986186,26 1,37 1,65 1,126 1,127 1,137 1,155 5.1}
{0 CHEMBL1986263,21 1,23 1,26 1,82 1,93 1,123 1,126 1,127 1,128 1,137 1,143 1,150 1,155 5.9}
{0 CHEMBL1986328,23 1,25 1,26 1,117 1,121 1,126 1,127 1,137 1,155 5.1}
{0 CHEMBL1986499,13 1,26 1,29 1,51 1,93 1,104 1,126 1,127 1,128 1,137 1,155 5.1}
{0 CHEMBL1986530,24 1,26 1,49 1,63 1,93 1,108 1,111 1,125 1,126 1,127 1,137 1,155 5.1}
{0 CHEMBL1986597,18 1,23 1,25 1,26 1,27 1,43 1,49 1,56 1,77 1,126 1,127 1,137 1,155 5.1}
{0 CHEMBL1986603,16 1,17 1,22 1,25 1,26 1,76 1,77 1,108 1,119 1,126 1,127 1,137 1,155 5.1}
{0 CHEMBL1986666,6 1,13 1,21 1,23 1,26 1,29 1,40 1,123 1,126 1,127 1,134 1,137 1,155 6.3}
{0 CHEMBL1986781,17 1,25 1,26 1,61 1,88 1,93 1,126 1,127 1,137 1,153 1,155 5.1}
{0 CHEMBL1986851,7 1,10 1,11 1,12 1,13 1,15 1,16 1,17 1,19 1,20 1,22 1,23 1,24 1,25 1,26 1,48 1,51 1,126 1,127 1,137 1,155 7}
{0 CHEMBL1986855,1 1,2 1,3 1,4 1,5 1,6 1,8 1,10 1,13 1,16 1,18 1,21 1,25 1,26 1,82 1,92 1,126 1,127 1,137 1,141 1,155 7.5}
{0 CHEMBL1986869,13 1,25 1,26 1,41 1,46 1,51 1,105 1,126 1,127 1,137 1,155 5.1}
{0 CHEMBL1986943,1 1,2 1,3 1,4 1,5 1,6 1,8 1,9 1,10 1,13 1,14 1,17 1,18 1,21 1,25 1,26 1,126 1,127 1,137 1,155 7.3}
{0 CHEMBL1986970,13 1,18 1,26 1,29 1,54 1,77 1,126 1,127 1,137 1,155 5.1}
{0 CHEMBL1987007,13 1,26 1,27 1,29 1,64 1,84 1,126 1,127 1,137 1,140 1,155 5.1}
{0 CHEMBL1987009,13 1,26 1,29 1,64 1,82 1,84 1,126 1,127 1,137 1,155 5.6}
{0 CHEMBL1987034,11 1,16 1,21 1,23 1,26 1,27 1,123 1,126 1,127 1,137 1,155 6.9}
{0 CHEMBL1987054,7 1,13 1,16 1,21 1,23 1,26 1,34 1,51 1,98 1,123 1,126 1,127 1,137 1,152 1,155 6}
{0 CHEMBL1987073,13 1,25 1,26 1,29 1,71 1,93 1,104 1,126 1,127 1,137 1,155 5.5}
{0 CHEMBL1987261,1 1,2 1,3 1,4 1,5 1,6 1,8 1,10 1,13 1,16 1,18 1,21 1,25 1,26 1,57 1,92 1,126 1,127 1,137 1,141 1,155 6}
{0 CHEMBL1987359,13 1,23 1,25 1,26 1,38 1,55 1,126 1,127 1,155 5.1}
{0 CHEMBL1987448,1 1,2 1,3 1,4 1,5 1,6 1,8 1,10 1,13 1,16 1,18 1,21 1,51 1,92 1,126 1,127 1,137 1,141 1,155 6.3}
{0 CHEMBL1987648,17 1,25 1,26 1,57 1,88 1,91 1,93 1,105 1,117 1,126 1,127 1,137 1,143 1,153 1,155 5.1}
{0 CHEMBL1987679,6 1,13 1,18 1,20 1,23 1,25 1,26 1,67 1,77 1,103 1,107 1,126 1,127 1,137 1,155 6}
{0 CHEMBL1987756,13 1,22 1,26 1,38 1,60 1,93 1,126 1,127 1,137 1,155 5.1}
{0 CHEMBL1987793,13 1,20 1,26 1,126 1,127 1,137 1,155 5.1}
{0 CHEMBL1987910,7 1,11 1,12 1,13 1,16 1,17 1,19 1,20 1,22 1,23 1,25 1,26 1,51 1,73 1,126 1,127 1,137 1,155 5.1}
{0 CHEMBL1987948,1 1,2 1,3 1,4 1,5 1,6 1,8 1,9 1,10 1,13 1,14 1,17 1,18 1,21 1,25 1,26 1,114 1,126 1,127 1,137 1,155 6.5}
{0 CHEMBL1987982,6 1,13 1,18 1,22 1,26 1,67 1,76 1,77 1,107 1,108 1,126 1,127 1,155 5.1}
{0 CHEMBL1988075,7 1,11 1,12 1,13 1,16 1,17 1,19 1,20 1,22 1,23 1,25 1,26 1,51 1,91 1,93 1,103 1,126 1,127 1,137 1,155 6.5}
{0 CHEMBL1988076,17 1,23 1,25 1,26 1,61 1,88 1,123 1,126 1,127 1,134 1,137 1,153 1,155 6.3}
{0 CHEMBL1988153,6 1,13 1,20 1,26 1,73 1,91 1,121 1,126 1,127 1,137 1,155 5.1}
{0 CHEMBL1988163,13 1,21 1,23 1,26 1,60 1,123 1,126 1,127 1,137 1,155 7.1}
{0 CHEMBL1988173,11 1,22 1,23 1,25 1,26 1,93 1,94 1,108 1,126 1,127 1,151 1,155 5.1}
{0 CHEMBL1988300,7 1,13 1,16 1,17 1,18 1,19 1,20 1,23 1,26 1,51 1,56 1,77 1,126 1,127 1,137 1,152 1,155 5.1}
{0 CHEMBL1988370,7 1,13 1,16 1,17 1,21 1,26 1,27 1,51 1,52 1,98 1,126 1,127 1,128 1,130 1,137 1,155 5.7}
{0 CHEMBL1988387,7 1,11 1,12 1,13 1,15 1,16 1,17 1,19 1,20 1,22 1,23 1,24 1,25 1,26 1,51 1,126 1,127 1,137 1,155 7.1}
{0 CHEMBL1988437,13 1,26 1,29 1,52 1,60 1,74 1,91 1,100 1,122 1,126 1,127 1,137 1,145 1,155 6.4}
{0 CHEMBL1988537,26 1,82 1,126 1,127 1,137 1,155 6.1}
{0 CHEMBL1988594,7 1,11 1,12 1,13 1,16 1,22 1,23 1,25 1,26 1,46 1,51 1,97 1,98 1,126 1,127 1,137 1,155 6.5}
{0 CHEMBL1988608,13 1,23 1,25 1,26 1,29 1,37 1,54 1,77 1,97 1,108 1,126 1,127 1,128 1,130 1,137 1,155 5.1}
{0 CHEMBL1988717,11 1,12 1,15 1,16 1,20 1,22 1,23 1,24 1,25 1,26 1,51 1,73 1,93 1,126 1,127 1,137 1,155 6.3}
{0 CHEMBL1988838,16 1,21 1,23 1,26 1,108 1,123 1,126 1,127 1,137 1,155 5.7}
{0 CHEMBL1988995,26 1,61 1,88 1,93 1,126 1,127 1,137 1,138 1,155 5.1}
{0 CHEMBL1989029,7 1,12 1,26 1,29 1,41 1,58 1,109 1,114 1,126 1,127 1,137 1,140 1,155 5.1}
{0 CHEMBL1989265,21 1,26 1,98 1,126 1,127 1,139 1,155 5.1}
{0 CHEMBL1989474,26 1,42 1,74 1,93 1,126 1,127 1,137 1,153 1,155 5.5}
{0 CHEMBL1989518,26 1,50 1,126 1,127 1,137 1,155 5.1}
{0 CHEMBL1989646,13 1,16 1,26 1,29 1,51 1,77 1,126 1,127 1,137 1,155 5.1}
{0 CHEMBL1989708,7 1,11 1,12 1,13 1,15 1,16 1,17 1,19 1,20 1,22 1,23 1,24 1,25 1,26 1,51 1,126 1,127 1,137 1,155 7.25}
{0 CHEMBL1989805,21 1,26 1,27 1,52 1,91 1,108 1,126 1,127 1,137 1,141 1,155 5.1}
{0 CHEMBL1989856,26 1,27 1,91 1,118 1,126 1,127 1,137 1,155 5.3}
{0 CHEMBL1989957,13 1,16 1,25 1,26 1,126 1,127 1,137 1,155 5.1}
{0 CHEMBL1990162,13 1,25 1,26 1,27 1,29 1,71 1,91 1,104 1,126 1,127 1,137 1,155 5.5}
{0 CHEMBL1990212,16 1,20 1,26 1,82 1,91 1,126 1,127 1,137 1,139 1,155 5.2}
{0 CHEMBL1990254,26 1,41 1,126 1,127 1,137 1,155 5.1}
{0 CHEMBL1990288,17 1,25 1,26 1,61 1,88 1,93 1,126 1,127 1,137 1,153 1,155 5.1}
{0 CHEMBL1990415,13 1,25 1,26 1,29 1,64 1,104 1,126 1,127 1,137 1,155 5.1}
{0 CHEMBL1990482,18 1,26 1,41 1,56 1,77 1,126 1,127 1,137 1,155 5.7}
{0 CHEMBL1990496,13 1,26 1,88 1,93 1,120 1,126 1,127 1,137 1,155 5.3}
{0 CHEMBL1990583,11 1,12 1,16 1,22 1,23 1,25 1,26 1,51 1,93 1,98 1,112 1,126 1,127 1,137 1,155 7.4}
{0 CHEMBL1990635,10 1,13 1,18 1,26 1,27 1,74 1,77 1,126 1,127 1,155 5.4}
{0 CHEMBL1990821,10 1,13 1,18 1,26 1,49 1,74 1,126 1,127 1,155 5.1}
{0 CHEMBL1990884,10 1,13 1,23 1,26 1,49 1,51 1,123 1,126 1,127 1,137 1,155 5.1}
{0 CHEMBL1990885,6 1,18 1,23 1,25 1,26 1,27 1,74 1,77 1,93 1,108 1,126 1,127 1,131 1,155 7}
{0 CHEMBL1990904,17 1,25 1,26 1,42 1,88 1,93 1,105 1,126 1,127 1,137 1,153 1,155 5.1}
{0 CHEMBL1990912,13 1,16 1,20 1,25 1,26 1,103 1,126 1,127 1,137 1,155 5.1}
{0 CHEMBL1991063,13 1,20 1,26 1,29 1,74 1,93 1,103 1,126 1,127 1,137 1,155 7.2}
{0 CHEMBL1991078,13 1,25 1,26 1,29 1,71 1,82 1,104 1,126 1,127 1,137 1,155 6.1}
{0 CHEMBL1991138,16 1,26 1,27 1,51 1,88 1,126 1,127 1,128 1,130 1,137 1,155 5.2}
{0 CHEMBL1991143,26 1,93 1,109 1,126 1,127 1,137 1,155 5.1}
{0 CHEMBL1991180,16 1,26 1,51 1,62 1,111 1,125 1,126 1,127 1,130 1,137 1,145 1,155 5.3}
{0 CHEMBL1991188,26 1,41 1,82 1,126 1,127 1,132 1,137 1,145 1,155 5.1}
{0 CHEMBL1991285,11 1,12 1,16 1,22 1,25 1,26 1,27 1,91 1,126 1,127 1,137 1,155 5.8}
{0 CHEMBL1991356,23 1,25 1,26 1,82 1,103 1,126 1,127 1,137 1,155 5.1}
{0 CHEMBL1991395,17 1,25 1,26 1,42 1,57 1,88 1,93 1,105 1,126 1,127 1,137 1,153 1,155 5.1}
{0 CHEMBL1991410,1 1,2 1,3 1,4 1,5 1,6 1,8 1,10 1,13 1,16 1,18 1,21 1,25 1,26 1,92 1,93 1,126 1,127 1,137 1,141 1,155 5.5}
{0 CHEMBL1991429,17 1,21 1,23 1,25 1,26 1,48 1,61 1,88 1,108 1,123 1,126 1,127 1,137 1,153 1,155 5.2}
{0 CHEMBL1991434,26 1,32 1,51 1,82 1,93 1,126 1,127 1,145 1,155 5.1}
{0 CHEMBL1991577,26 1,37 1,126 1,127 1,137 1,155 5.1}
{0 CHEMBL1991640,10 1,21 1,25 1,26 1,33 1,108 1,126 1,127 1,144 1,155 5.9}
{0 CHEMBL1991674,1 1,2 1,3 1,4 1,5 1,6 1,8 1,10 1,13 1,16 1,18 1,20 1,21 1,25 1,26 1,39 1,64 1,126 1,127 1,137 1,155 7.3}
{0 CHEMBL1991678,17 1,25 1,26 1,57 1,88 1,91 1,93 1,105 1,117 1,126 1,127 1,137 1,143 1,153 1,155 5.1}
{0 CHEMBL1991725,6 1,13 1,18 1,20 1,26 1,27 1,67 1,77 1,103 1,107 1,108 1,126 1,127 1,137 1,138 1,140 1,155 5.1}
{0 CHEMBL1991728,11 1,22 1,25 1,26 1,32 1,49 1,70 1,76 1,126 1,127 1,137 1,155 6.3}
{0 CHEMBL1991800,17 1,25 1,26 1,57 1,88 1,91 1,93 1,105 1,117 1,126 1,127 1,136 1,137 1,153 1,155 5.1}
{0 CHEMBL1991846,26 1,50 1,126 1,127 1,137 1,155 5.1}
{0 CHEMBL1992220,1 1,2 1,3 1,4 1,5 1,6 1,8 1,9 1,10 1,13 1,14 1,17 1,18 1,21 1,22 1,25 1,26 1,85 1,126 1,127 1,137 1,155 7.3}
{0 CHEMBL1992231,21 1,23 1,26 1,40 1,93 1,123 1,126 1,127 1,134 1,137 1,155 5.5}
{0 CHEMBL1992242,11 1,12 1,13 1,22 1,23 1,25 1,26 1,49 1,66 1,126 1,127 1,137 1,155 5.1}
{0 CHEMBL1992306,11 1,12 1,22 1,23 1,25 1,26 1,60 1,73 1,91 1,100 1,126 1,127 1,137 1,155 5.1}
{0 CHEMBL1992323,13 1,26 1,93 1,126 1,127 1,137 1,155 5.1}
{0 CHEMBL1992342,13 1,16 1,23 1,25 1,26 1,29 1,51 1,77 1,126 1,127 1,137 1,155 5.1}
{0 CHEMBL1992363,13 1,25 1,26 1,29 1,71 1,104 1,126 1,127 1,137 1,155 6}
{0 CHEMBL1992536,13 1,26 1,29 1,37 1,54 1,77 1,82 1,97 1,126 1,127 1,128 1,130 1,137 1,155 5.1}
{0 CHEMBL1992555,18 1,26 1,56 1,72 1,77 1,109 1,125 1,126 1,127 1,135 1,137 1,155 5.1}
{0 CHEMBL1992634,1 1,2 1,3 1,4 1,5 1,6 1,8 1,13 1,18 1,126 1,127 1,137 1,141 1,155 6.6}
{0 CHEMBL1992645,6 1,23 1,25 1,26 1,93 1,103 1,126 1,127 1,135 1,145 1,155 5.1}
{0 CHEMBL1992732,16 1,26 1,51 1,63 1,64 1,109 1,125 1,126 1,127 1,137 1,155 5.1}
{0 CHEMBL1992740,13 1,25 1,26 1,27 1,29 1,64 1,93 1,104 1,108 1,119 1,126 1,127 1,137 1,155 5.1}
{0 CHEMBL1992796,23 1,25 1,26 1,93 1,108 1,125 1,126 1,127 1,155 5.1}
{0 CHEMBL1992922,2 1,3 1,4 1,5 1,6 1,13 1,16 1,18 1,25 1,26 1,88 1,98 1,126 1,127 1,137 1,141 1,155 6.9}
{0 CHEMBL1992937,16 1,18 1,26 1,56 1,77 1,126 1,127 1,135 1,137 1,155 5.3}
{0 CHEMBL1993166,11 1,22 1,25 1,26 1,27 1,32 1,49 1,70 1,76 1,126 1,127 1,140 1,146 1,155 6.5}
{0 CHEMBL1993243,7 1,13 1,16 1,17 1,19 1,20 1,26 1,51 1,60 1,108 1,111 1,126 1,127 1,137 1,155 5.4}
{0 CHEMBL1993413,1 1,2 1,3 1,4 1,5 1,6 1,8 1,10 1,13 1,16 1,18 1,21 1,25 1,26 1,92 1,126 1,127 1,137 1,141 1,155 5.5}
{0 CHEMBL1993424,13 1,21 1,23 1,26 1,123 1,126 1,127 1,137 1,155 6.4}
{0 CHEMBL1993548,21 1,26 1,126 1,127 1,137 1,155 5.1}
{0 CHEMBL1993584,6 1,13 1,18 1,26 1,50 1,67 1,77 1,107 1,126 1,127 1,137 1,155 5.1}
{0 CHEMBL1993661,11 1,16 1,21 1,23 1,26 1,45 1,60 1,82 1,91 1,123 1,126 1,127 1,134 1,137 1,155 8.3}
{0 CHEMBL1993722,10 1,11 1,12 1,13 1,22 1,23 1,25 1,26 1,29 1,40 1,51 1,93 1,104 1,122 1,126 1,127 1,137 1,155 6.9}
{0 CHEMBL1993781,26 1,50 1,126 1,127 1,128 1,130 1,137 1,155 5.1}
{0 CHEMBL1993941,7 1,11 1,12 1,13 1,15 1,16 1,17 1,19 1,20 1,22 1,23 1,24 1,25 1,26 1,51 1,86 1,93 1,126 1,127 1,137 1,155 7}
{0 CHEMBL1994040,17 1,25 1,26 1,88 1,91 1,93 1,105 1,117 1,126 1,127 1,136 1,137 1,153 1,155 5.1}
{0 CHEMBL1994074,13 1,29 1,77 1,93 1,126 1,127 1,137 1,155 5.1}
{0 CHEMBL1994241,12 1,18 1,26 1,27 1,56 1,77 1,82 1,126 1,127 1,137 1,155 5.4}
{0 CHEMBL1994321,7 1,11 1,12 1,13 1,16 1,17 1,19 1,20 1,22 1,23 1,25 1,26 1,51 1,59 1,126 1,127 1,137 1,155 6.3}
{0 CHEMBL1994361,6 1,13 1,18 1,20 1,23 1,26 1,31 1,51 1,67 1,77 1,93 1,103 1,107 1,126 1,127 1,137 1,155 5.7}
{0 CHEMBL1994438,1 1,2 1,3 1,4 1,5 1,6 1,8 1,9 1,10 1,13 1,14 1,17 1,18 1,21 1,25 1,26 1,125 1,126 1,127 1,137 1,155 6.8}
{0 CHEMBL1994526,25 1,26 1,59 1,106 1,108 1,126 1,127 1,137 1,155 5.1}
{0 CHEMBL1994538,11 1,12 1,13 1,16 1,19 1,22 1,25 1,26 1,73 1,88 1,126 1,127 1,137 1,155 5.4}
{0 CHEMBL1994669,11 1,15 1,16 1,23 1,26 1,123 1,126 1,127 1,134 1,137 1,152 1,155 8.5}
{0 CHEMBL1994693,7 1,11 1,12 1,13 1,16 1,22 1,23 1,25 1,26 1,46 1,51 1,52 1,98 1,126 1,127 1,137 1,155 5.4}
{0 CHEMBL1994830,6 1,13 1,20 1,51 1,91 1,93 1,121 1,126 1,127 1,137 1,155 5.1}
{0 CHEMBL1994864,26 1,37 1,97 1,126 1,127 1,128 1,130 1,137 1,155 5.5}
{0 CHEMBL1994938,7 1,13 1,16 1,17 1,19 1,20 1,26 1,51 1,60 1,74 1,76 1,88 1,93 1,108 1,126 1,127 1,137 1,155 5.1}
{0 CHEMBL1995172,6 1,26 1,29 1,93 1,126 1,127 1,137 1,155 5.1}
{0 CHEMBL1995448,16 1,21 1,23 1,26 1,51 1,126 1,127 1,137 1,155 5.1}
{0 CHEMBL1995592,16 1,26 1,51 1,93 1,104 1,109 1,126 1,127 1,137 1,145 1,155 5.5}
{0 CHEMBL1995712,1 1,2 1,3 1,4 1,5 1,6 1,8 1,9 1,10 1,13 1,14 1,17 1,18 1,21 1,25 1,26 1,27 1,108 1,114 1,126 1,127 1,137 1,138 1,140 1,155 5.8}
{0 CHEMBL1995736,18 1,26 1,56 1,77 1,126 1,127 1,137 1,155 5.1}
{0 CHEMBL1995740,23 1,25 1,26 1,82 1,126 1,127 1,134 1,135 1,155 5.1}
{0 CHEMBL1995811,13 1,25 1,26 1,29 1,71 1,93 1,104 1,126 1,127 1,137 1,155 5.5}
{0 CHEMBL1995813,1 1,2 1,3 1,4 1,5 1,6 1,8 1,13 1,17 1,18 1,25 1,26 1,125 1,126 1,127 1,137 1,153 1,155 6.6}
{0 CHEMBL1995832,17 1,25 1,26 1,57 1,88 1,93 1,105 1,109 1,126 1,127 1,137 1,153 1,155 5.1}
{0 CHEMBL1995927,16 1,25 1,26 1,36 1,82 1,126 1,127 1,137 1,155 5.1}
{0 CHEMBL1996048,13 1,18 1,23 1,25 1,26 1,43 1,126 1,127 1,155 6.6}
{0 CHEMBL1996066,26 1,27 1,51 1,62 1,91 1,126 1,127 1,137 1,155 5.1}
{0 CHEMBL1996111,13 1,26 1,29 1,54 1,77 1,126 1,127 1,137 1,155 5.1}
{0 CHEMBL1996155,26 1,27 1,69 1,126 1,127 1,137 1,140 1,155 5.8}
{0 CHEMBL1996208,16 1,26 1,31 1,41 1,91 1,93 1,109 1,126 1,127 1,137 1,155 5.1}
{0 CHEMBL1996234,13 1,16 1,26 1,51 1,88 1,121 1,126 1,127 1,137 1,155 5.1}
{0 CHEMBL1996390,6 1,13 1,17 1,20 1,26 1,126 1,127 1,137 1,155 5.1}
{0 CHEMBL1996500,17 1,25 1,26 1,88 1,91 1,93 1,105 1,117 1,126 1,127 1,137 1,143 1,153 1,155 5.1}
{0 CHEMBL1996543,6 1,13 1,18 1,20 1,26 1,67 1,77 1,93 1,103 1,107 1,126 1,127 1,137 1,155 5.1}
{0 CHEMBL1996587,26 1,93 1,126 1,127 1,137 1,155 5.1}
{0 CHEMBL1996649,7 1,11 1,12 1,13 1,16 1,17 1,19 1,20 1,22 1,23 1,25 1,26 1,27 1,51 1,76 1,93 1,126 1,127 1,137 1,146 1,155 6.9}
{0 CHEMBL1996780,5 1,26 1,41 1,59 1,126 1,127 1,137 1,145 1,155 5.1}
{0 CHEMBL1996791,7 1,13 1,16 1,21 1,26 1,51 1,98 1,126 1,137 1,152 1,155 5.3}
{0 CHEMBL1996817,2 1,3 1,4 1,5 1,6 1,13 1,18 1,26 1,109 1,126 1,127 1,137 1,141 1,155 7.1}
{0 CHEMBL1996831,13 1,26 1,40 1,63 1,126 1,127 1,137 1,155 5.1}
{0 CHEMBL1996923,36 1,110 1,126 1,127 1,137 1,155 5.1}
{0 CHEMBL1996931,25 1,26 1,41 1,93 1,126 1,127 1,137 1,155 5.1}
{0 CHEMBL1996979,1 1,2 1,3 1,4 1,5 1,6 1,8 1,13 1,18 1,25 1,26 1,93 1,126 1,127 1,137 1,141 1,155 5.2}
{0 CHEMBL1996980,1 1,2 1,3 1,4 1,5 1,6 1,8 1,9 1,10 1,13 1,14 1,17 1,18 1,21 1,25 1,26 1,60 1,108 1,126 1,127 1,137 1,155 6.8}
{0 CHEMBL1997023,13 1,18 1,25 1,26 1,66 1,108 1,126 1,127 1,137 1,155 5.1}
{0 CHEMBL1997025,18 1,26 1,56 1,76 1,77 1,126 1,127 1,137 1,155 5.1}
{0 CHEMBL1997051,17 1,23 1,25 1,26 1,27 1,61 1,82 1,88 1,93 1,123 1,126 1,127 1,137 1,140 1,153 1,155 6.6}
{0 CHEMBL1997129,18 1,26 1,41 1,52 1,74 1,91 1,126 1,127 1,137 1,155 5.8}
{0 CHEMBL1997340,13 1,26 1,29 1,54 1,77 1,123 1,126 1,127 1,137 1,155 5.1}
{0 CHEMBL1997349,26 1,27 1,63 1,93 1,126 1,127 1,135 1,137 1,151 1,155 5.1}
{0 CHEMBL1997503,20 1,23 1,25 1,26 1,91 1,126 1,127 1,137 1,155 5.1}
{0 CHEMBL1997534,13 1,26 1,29 1,77 1,82 1,119 1,126 1,127 1,137 1,155 5.2}
{0 CHEMBL1997597,13 1,16 1,23 1,25 1,26 1,29 1,51 1,77 1,126 1,127 1,137 1,155 5.1}
{0 CHEMBL1997617,7 1,13 1,16 1,17 1,26 1,27 1,51 1,52 1,98 1,126 1,127 1,137 1,140 1,155 6.6}
{0 CHEMBL1997623,11 1,12 1,13 1,22 1,23 1,25 1,26 1,29 1,51 1,73 1,104 1,126 1,127 1,137 1,155 5.1}
{0 CHEMBL1997759,23 1,25 1,26 1,82 1,114 1,126 1,127 1,137 1,153 1,155 5.1}
{0 CHEMBL1997764,1 1,2 1,3 1,4 1,5 1,6 1,8 1,13 1,18 1,25 1,26 1,82 1,126 1,127 1,137 1,141 1,155 6.5}
{0 CHEMBL1997822,7 1,10 1,13 1,16 1,17 1,18 1,19 1,20 1,26 1,31 1,51 1,74 1,77 1,126 1,127 1,137 1,155 5.4}
{0 CHEMBL1997846,1 1,2 1,3 1,4 1,5 1,6 1,8 1,10 1,13 1,16 1,18 1,20 1,21 1,25 1,26 1,39 1,64 1,126 1,127 1,137 1,155 6}
{0 CHEMBL1997872,3 1,4 1,5 1,6 1,8 1,13 1,18 1,20 1,26 1,31 1,103 1,126 1,127 1,137 1,151 1,155 5.1}
{0 CHEMBL1997909,17 1,23 1,25 1,26 1,61 1,88 1,108 1,123 1,126 1,127 1,134 1,137 1,153 1,155 6.8}
{0 CHEMBL1997924,16 1,19 1,25 1,26 1,29 1,45 1,74 1,77 1,126 1,127 1,137 1,155 8.801}
{0 CHEMBL1998112,17 1,23 1,26 1,82 1,86 1,88 1,126 1,127 1,134 1,137 1,155 5.1}
{0 CHEMBL1998121,13 1,23 1,25 1,26 1,29 1,54 1,77 1,93 1,97 1,108 1,126 1,127 1,135 1,137 1,155 5.7}
{0 CHEMBL1998159,6 1,13 1,20 1,26 1,29 1,45 1,49 1,73 1,74 1,117 1,126 1,127 1,137 1,155 7.1}
{0 CHEMBL1998193,11 1,22 1,23 1,25 1,26 1,76 1,126 1,127 1,137 1,155 5.1}
{0 CHEMBL1998414,13 1,26 1,29 1,64 1,74 1,93 1,126 1,127 1,137 1,155 5.1}
{0 CHEMBL1998432,1 1,2 1,3 1,4 1,5 1,6 1,8 1,9 1,10 1,13 1,14 1,17 1,18 1,21 1,25 1,26 1,114 1,126 1,127 1,137 1,155 7.5}
{0 CHEMBL1998435,13 1,16 1,25 1,26 1,41 1,126 1,127 1,137 1,155 5.1}
{0 CHEMBL1998470,1 1,2 1,3 1,4 1,5 1,6 1,8 1,10 1,13 1,16 1,18 1,21 1,25 1,26 1,92 1,108 1,119 1,126 1,127 1,137 1,141 1,155 5.5}
{0 CHEMBL1998545,25 1,26 1,41 1,126 1,127 1,137 1,155 5.1}
{0 CHEMBL1998551,26 1,93 1,126 1,127 1,137 1,155 5.1}
{0 CHEMBL1998585,7 1,10 1,11 1,12 1,13 1,16 1,17 1,20 1,22 1,23 1,25 1,26 1,46 1,51 1,52 1,73 1,93 1,98 1,126 1,127 1,137 1,155 6.1}
{0 CHEMBL1998611,13 1,26 1,34 1,51 1,59 1,93 1,126 1,127 1,137 1,155 5.6}
{0 CHEMBL1998829,1 1,2 1,3 1,4 1,5 1,6 1,8 1,13 1,18 1,25 1,26 1,93 1,126 1,127 1,137 1,141 1,155 5.2}
{0 CHEMBL1998953,2 1,3 1,4 1,5 1,6 1,13 1,18 1,26 1,109 1,126 1,127 1,137 1,141 1,155 6.9}
{0 CHEMBL1999112,21 1,26 1,27 1,52 1,91 1,126 1,127 1,137 1,155 5.1}
{0 CHEMBL1999126,26 1,27 1,63 1,126 1,127 1,135 1,137 1,151 1,155 5.1}
{0 CHEMBL1999321,25 1,26 1,126 1,127 1,137 1,155 5.1}
{0 CHEMBL1999414,7 1,11 1,12 1,13 1,16 1,17 1,19 1,20 1,22 1,23 1,25 1,26 1,27 1,51 1,76 1,126 1,127 1,137 1,146 1,155 7.1}
{0 CHEMBL1999428,26 1,41 1,126 1,127 1,137 1,155 5.1}
{0 CHEMBL1999496,25 1,26 1,49 1,108 1,126 1,127 1,137 1,155 5.1}
{0 CHEMBL1999556,6 1,13 1,17 1,20 1,26 1,126 1,127 1,137 1,155 5.7}
{0 CHEMBL1999590,16 1,26 1,91 1,98 1,103 1,125 1,126 1,127 1,137 1,155 5.1}
{0 CHEMBL1999714,23 1,25 1,26 1,126 1,127 1,134 1,155 5.1}
{0 CHEMBL1999718,11 1,12 1,13 1,16 1,19 1,22 1,25 1,26 1,27 1,73 1,91 1,126 1,127 1,137 1,155 5.1}
{0 CHEMBL1999749,13 1,16 1,21 1,23 1,26 1,27 1,51 1,82 1,93 1,98 1,126 1,127 1,137 1,155 5.1}
{0 CHEMBL1999774,13 1,26 1,35 1,40 1,46 1,109 1,126 1,137 1,155 5.1}
{0 CHEMBL1999811,11 1,22 1,23 1,25 1,26 1,63 1,111 1,125 1,126 1,127 1,137 1,145 1,155 5.1}
{0 CHEMBL1999918,6 1,13 1,17 1,20 1,26 1,93 1,126 1,127 1,137 1,155 5.8}
{0 CHEMBL1999931,13 1,25 1,26 1,29 1,71 1,104 1,126 1,127 1,137 1,155 6.4}
{0 CHEMBL2000071,2 1,3 1,4 1,5 1,6 1,13 1,16 1,18 1,25 1,26 1,88 1,98 1,126 1,127 1,135 1,137 1,141 1,155 6.9}
{0 CHEMBL2000078,17 1,21 1,23 1,25 1,26 1,61 1,88 1,108 1,123 1,126 1,127 1,137 1,153 1,155 7}
{0 CHEMBL2000104,6 1,13 1,17 1,20 1,26 1,126 1,127 1,137 1,154 1,155 5.1}
{0 CHEMBL2000114,3 1,4 1,5 1,6 1,13 1,16 1,18 1,25 1,26 1,82 1,98 1,126 1,135 1,137 1,155 6.2}
{0 CHEMBL2000271,13 1,20 1,26 1,29 1,74 1,89 1,103 1,126 1,127 1,137 1,155 6.6}
{0 CHEMBL2000335,7 1,11 1,12 1,13 1,16 1,17 1,20 1,22 1,23 1,25 1,26 1,46 1,51 1,52 1,98 1,126 1,127 1,137 1,155 6.7}
{0 CHEMBL2000345,12 1,18 1,26 1,27 1,56 1,77 1,82 1,126 1,127 1,137 1,155 5.2}
{0 CHEMBL2000354,26 1,82 1,90 1,108 1,117 1,126 1,127 1,155 5.1}
{0 CHEMBL2000393,25 1,26 1,36 1,93 1,109 1,121 1,126 1,127 1,137 1,153 1,155 6.6}
{0 CHEMBL2000408,17 1,25 1,26 1,57 1,93 1,105 1,117 1,123 1,126 1,127 1,137 1,143 1,153 1,155 5.1}
{0 CHEMBL2000429,17 1,25 1,26 1,57 1,88 1,93 1,105 1,109 1,126 1,127 1,137 1,153 1,155 5.1}
{0 CHEMBL2000433,16 1,26 1,27 1,91 1,126 1,127 1,137 1,155 5.1}
{0 CHEMBL2000481,1 1,23 1,25 1,26 1,38 1,49 1,125 1,126 1,127 1,155 6.3}
{0 CHEMBL2000508,41 1,61 1,88 1,93 1,126 1,127 1,137 1,155 5.1}
{0 CHEMBL2000568,3 1,4 1,5 1,6 1,8 1,13 1,18 1,20 1,26 1,31 1,74 1,103 1,126 1,127 1,137 1,151 1,155 5.3}
{0 CHEMBL2000685,22 1,25 1,26 1,32 1,49 1,70 1,126 1,127 1,155 6.8}
{0 CHEMBL2000801,11 1,12 1,13 1,22 1,23 1,25 1,26 1,66 1,73 1,93 1,126 1,127 1,137 1,155 5.1}
{0 CHEMBL2000832,23 1,25 1,26 1,82 1,93 1,126 1,127 1,134 1,155 5.5}
{0 CHEMBL2000894,5 1,26 1,41 1,59 1,108 1,126 1,127 1,137 1,145 1,155 5.4}
{0 CHEMBL2001224,11 1,12 1,16 1,22 1,25 1,26 1,27 1,91 1,126 1,127 1,137 1,155 5.1}
{0 CHEMBL2001228,17 1,21 1,23 1,25 1,26 1,61 1,88 1,93 1,123 1,126 1,127 1,137 1,153 1,155 5.5}
{0 CHEMBL2001239,21 1,26 1,51 1,93 1,108 1,123 1,126 1,127 1,137 1,155 5.4}
{0 CHEMBL2001257,7 1,11 1,12 1,13 1,16 1,17 1,19 1,20 1,22 1,23 1,25 1,26 1,27 1,51 1,126 1,127 1,137 1,155 5.7}
{0 CHEMBL2001288,7 1,13 1,16 1,21 1,26 1,51 1,54 1,98 1,121 1,126 1,130 1,137 1,144 1,155 5.1}
{0 CHEMBL2001485,7 1,11 1,12 1,13 1,15 1,16 1,17 1,19 1,20 1,22 1,23 1,24 1,25 1,26 1,51 1,126 1,127 1,137 1,155 6.7}
{0 CHEMBL2001547,17 1,25 1,26 1,88 1,91 1,93 1,105 1,117 1,126 1,127 1,136 1,137 1,153 1,155 5.1}
{0 CHEMBL2001668,26 1,62 1,126 1,127 1,137 1,155 5.1}
{0 CHEMBL2001751,6 1,13 1,18 1,20 1,23 1,25 1,26 1,31 1,52 1,67 1,77 1,91 1,103 1,107 1,108 1,126 1,127 1,137 1,155 7.9}
{0 CHEMBL2001920,23 1,25 1,26 1,93 1,108 1,117 1,126 1,127 1,155 5.7}
{0 CHEMBL2001923,3 1,6 1,13 1,17 1,23 1,25 1,26 1,126 1,127 1,134 1,137 1,155 5.1}
{0 CHEMBL2001957,17 1,25 1,26 1,57 1,88 1,93 1,105 1,109 1,126 1,127 1,137 1,153 1,155 5.1}
{0 CHEMBL2001998,20 1,26 1,27 1,29 1,31 1,60 1,84 1,91 1,126 1,127 1,137 1,155 5.1}
{0 CHEMBL2002165,7 1,11 1,12 1,13 1,15 1,16 1,17 1,19 1,20 1,22 1,23 1,24 1,25 1,26 1,51 1,93 1,126 1,127 1,137 1,155 7.5}
{0 CHEMBL2002240,13 1,16 1,25 1,26 1,27 1,51 1,91 1,108 1,126 1,127 1,137 1,155 5.1}
{0 CHEMBL2002322,6 1,13 1,17 1,20 1,26 1,31 1,49 1,73 1,126 1,127 1,137 1,155 5.1}
{0 CHEMBL2002323,26 1,31 1,51 1,86 1,93 1,103 1,126 1,127 1,137 1,155 5.1}
{0 CHEMBL2002373,26 1,41 1,126 1,127 1,135 1,137 1,155 5.1}
{0 CHEMBL2002407,12 1,16 1,26 1,27 1,29 1,51 1,74 1,82 1,91 1,115 1,126 1,127 1,137 1,155 5.1}
{0 CHEMBL2002446,20 1,26 1,27 1,29 1,49 1,84 1,91 1,93 1,126 1,127 1,137 1,140 1,155 5.1}
{0 CHEMBL2002479,21 1,23 1,26 1,36 1,93 1,123 1,126 1,127 1,135 1,137 1,155 5.2}
{0 CHEMBL2002553,13 1,26 1,39 1,40 1,126 1,137 1,155 5.1}
{0 CHEMBL2002613,13 1,25 1,26 1,29 1,71 1,82 1,104 1,126 1,127 1,137 1,139 1,155 5.5}
{0 CHEMBL2002649,6 1,18 1,23 1,25 1,26 1,82 1,108 1,126 1,127 1,137 1,155 7.5}
{0 CHEMBL2002682,10 1,13 1,18 1,26 1,74 1,93 1,126 1,127 1,155 5.4}
{0 CHEMBL2002702,6 1,18 1,23 1,25 1,26 1,74 1,108 1,126 1,127 1,131 1,155 6.2}
{0 CHEMBL2002726,13 1,20 1,26 1,29 1,74 1,103 1,126 1,127 1,137 1,155 6.2}
{0 CHEMBL2002992,3 1,4 1,5 1,6 1,8 1,13 1,18 1,25 1,26 1,59 1,106 1,108 1,126 1,127 1,137 1,151 1,155 5.6}
{0 CHEMBL2003271,13 1,25 1,26 1,93 1,126 1,127 1,137 1,155 5.5}
{0 CHEMBL2003286,26 1,82 1,108 1,117 1,126 1,127 1,155 5.1}
{0 CHEMBL2003341,26 1,41 1,126 1,127 1,137 1,155 5.1}
{0 CHEMBL2003420,22 1,26 1,76 1,126 1,127 1,137 1,155 5.1}
{0 CHEMBL2003456,11 1,12 1,16 1,20 1,22 1,25 1,26 1,103 1,126 1,127 1,137 1,155 5.3}
{0 CHEMBL2003482,25 1,26 1,29 1,64 1,93 1,104 1,108 1,126 1,127 1,137 1,155 5.1}
{0 CHEMBL2003524,13 1,26 1,82 1,104 1,123 1,126 1,127 1,137 1,155 6}
{0 CHEMBL2003638,13 1,25 1,26 1,29 1,71 1,93 1,104 1,126 1,127 1,137 1,155 5.6}
{0 CHEMBL2003657,26 1,51 1,61 1,63 1,74 1,88 1,93 1,126 1,127 1,137 1,145 1,155 5.1}
{0 CHEMBL2003768,26 1,37 1,82 1,97 1,126 1,127 1,130 1,137 1,139 1,155 5.1}
{0 CHEMBL2003817,11 1,12 1,13 1,16 1,19 1,22 1,25 1,26 1,73 1,88 1,126 1,127 1,137 1,155 5.1}
{0 CHEMBL2004072,6 1,13 1,17 1,20 1,26 1,93 1,126 1,127 1,137 1,155 5.1}
{0 CHEMBL2004290,7 1,11 1,12 1,13 1,15 1,16 1,17 1,19 1,20 1,22 1,23 1,24 1,25 1,26 1,51 1,82 1,126 1,127 1,137 1,155 7}
{0 CHEMBL2004311,11 1,12 1,22 1,23 1,25 1,26 1,49 1,126 1,127 1,155 5.4}
{0 CHEMBL2004355,26 1,27 1,51 1,91 1,109 1,114 1,126 1,127 1,137 1,155 5.1}
{0 CHEMBL2004365,21 1,26 1,52 1,91 1,108 1,126 1,127 1,137 1,141 1,155 5.1}
{0 CHEMBL2004419,26 1,34 1,51 1,61 1,63 1,74 1,88 1,93 1,126 1,127 1,137 1,155 5.1}
{0 CHEMBL2004438,11 1,12 1,19 1,22 1,23 1,25 1,26 1,32 1,51 1,73 1,88 1,126 1,127 1,137 1,155 5.1}
{0 CHEMBL2004447,26 1,27 1,29 1,41 1,74 1,93 1,109 1,126 1,127 1,137 1,155 5.1}
{0 CHEMBL2004513,23 1,25 1,26 1,126 1,127 1,134 1,155 5.1}
{0 CHEMBL2004544,13 1,23 1,25 1,26 1,111 1,126 1,127 1,155 5.1}
{0 CHEMBL2004615,16 1,26 1,39 1,51 1,109 1,126 1,127 1,137 1,155 5.4}
{0 CHEMBL2004647,13 1,26 1,40 1,46 1,60 1,109 1,126 1,137 1,155 5.1}
{0 CHEMBL2004692,16 1,26 1,51 1,91 1,125 1,126 1,127 1,137 1,155 5.1}
{0 CHEMBL2004716,7 1,11 1,12 1,13 1,16 1,17 1,19 1,20 1,22 1,23 1,25 1,26 1,27 1,51 1,60 1,108 1,126 1,127 1,137 1,155 6.4}
{0 CHEMBL2004771,21 1,23 1,26 1,123 1,126 1,127 1,137 1,155 5.1}
{0 CHEMBL2004871,26 1,41 1,93 1,126 1,127 1,135 1,137 1,155 5.1}
{0 CHEMBL2004872,26 1,74 1,82 1,126 1,127 1,137 1,153 1,155 5.1}
{0 CHEMBL2004892,13 1,16 1,23 1,25 1,26 1,29 1,51 1,77 1,126 1,127 1,137 1,155 5.1}
{0 CHEMBL2004934,26 1,41 1,82 1,126 1,127 1,137 1,155 5.1}
{0 CHEMBL2005112,26 1,27 1,63 1,93 1,126 1,127 1,135 1,137 1,151 1,155 5.1}
{0 CHEMBL2005186,8 1,13 1,16 1,20 1,21 1,23 1,26 1,29 1,54 1,62 1,77 1,108 1,126 1,127 1,137 1,155 5.6}
{0 CHEMBL2005216,1 1,2 1,3 1,4 1,5 1,6 1,8 1,10 1,13 1,16 1,18 1,20 1,21 1,25 1,26 1,39 1,64 1,126 1,127 1,137 1,155 7.4}
{0 CHEMBL2005375,23 1,26 1,42 1,82 1,109 1,123 1,126 1,127 1,137 1,155 5.1}
{0 CHEMBL2005475,13 1,26 1,29 1,64 1,84 1,126 1,127 1,137 1,155 5.5}
{0 CHEMBL2005482,10 1,17 1,21 1,23 1,25 1,26 1,61 1,88 1,93 1,108 1,123 1,126 1,127 1,137 1,153 1,155 7}
{0 CHEMBL2005509,1 1,2 1,3 1,4 1,5 1,6 1,8 1,9 1,10 1,13 1,14 1,17 1,18 1,21 1,22 1,25 1,26 1,60 1,126 1,127 1,137 1,155 7.3}
{0 CHEMBL2005528,10 1,13 1,18 1,26 1,74 1,77 1,88 1,126 1,127 1,155 5.1}
{0 CHEMBL2005548,13 1,15 1,23 1,25 1,26 1,66 1,93 1,126 1,127 1,137 1,155 5.1}
{0 CHEMBL2005631,7 1,10 1,11 1,12 1,13 1,16 1,17 1,19 1,20 1,22 1,23 1,25 1,26 1,51 1,60 1,93 1,100 1,126 1,127 1,137 1,155 7.2}
{0 CHEMBL2005718,1 1,2 1,3 1,4 1,5 1,6 1,8 1,10 1,13 1,16 1,18 1,21 1,25 1,26 1,38 1,92 1,126 1,127 1,137 1,141 1,155 6.6}
{0 CHEMBL2005792,17 1,25 1,26 1,57 1,88 1,93 1,105 1,109 1,126 1,127 1,137 1,153 1,155 5.1}
{0 CHEMBL2005828,7 1,11 1,12 1,13 1,16 1,17 1,20 1,22 1,23 1,25 1,26 1,46 1,51 1,52 1,98 1,126 1,127 1,137 1,155 6.1}
{0 CHEMBL2005886,13 1,18 1,19 1,26 1,27 1,53 1,56 1,93 1,108 1,126 1,127 1,137 1,155 7.3}
{0 CHEMBL2005899,26 1,65 1,126 1,127 1,137 1,155 5.1}
{0 CHEMBL2005936,13 1,25 1,26 1,29 1,64 1,104 1,108 1,119 1,126 1,127 1,128 1,137 1,155 5.1}
{0 CHEMBL2006010,11 1,12 1,13 1,16 1,19 1,22 1,25 1,26 1,73 1,93 1,126 1,127 1,128 1,137 1,152 1,155 5.4}
{0 CHEMBL2006156,23 1,25 1,26 1,117 1,121 1,126 1,127 1,137 1,155 5.1}
{0 CHEMBL2006188,25 1,26 1,41 1,82 1,126 1,127 1,135 1,137 1,155 5.1}
{0 CHEMBL2006237,16 1,18 1,25 1,26 1,27 1,56 1,77 1,126 1,127 1,137 1,140 1,146 1,155 5.1}
{0 CHEMBL2006263,23 1,25 1,26 1,51 1,126 1,127 1,137 1,152 1,155 5.1}
{0 CHEMBL2006276,21 1,23 1,25 1,26 1,82 1,126 1,127 1,134 1,137 1,155 5.1}
{0 CHEMBL2006439,1 1,2 1,3 1,4 1,5 1,6 1,8 1,9 1,10 1,13 1,14 1,17 1,18 1,21 1,25 1,26 1,126 1,127 1,137 1,155 5.8}
{0 CHEMBL2006450,1 1,2 1,3 1,4 1,5 1,6 1,8 1,10 1,13 1,16 1,18 1,21 1,25 1,26 1,92 1,108 1,119 1,126 1,127 1,137 1,141 1,155 5.5}
{0 CHEMBL2006456,1 1,2 1,3 1,4 1,5 1,6 1,8 1,9 1,10 1,13 1,14 1,17 1,18 1,21 1,25 1,26 1,126 1,127 1,137 1,155 6.4}
{0 CHEMBL2006481,13 1,26 1,29 1,54 1,77 1,123 1,126 1,127 1,137 1,155 5.1}
{0 CHEMBL2006493,26 1,73 1,126 1,127 1,137 1,155 5.1}
{0 CHEMBL2006567,16 1,20 1,25 1,26 1,27 1,41 1,51 1,91 1,108 1,126 1,127 1,137 1,155 5.1}
{0 CHEMBL2006580,13 1,16 1,21 1,23 1,46 1,98 1,126 1,127 1,137 1,145 1,155 5.1}
{0 CHEMBL2006581,26 1,51 1,109 1,126 1,127 1,137 1,155 5.1}
{0 CHEMBL2006631,23 1,25 1,26 1,27 1,126 1,127 1,134 1,140 1,155 5.1}
{0 CHEMBL2006715,17 1,21 1,23 1,25 1,26 1,48 1,61 1,88 1,93 1,123 1,126 1,127 1,137 1,153 1,155 6.9}
{0 CHEMBL2006778,7 1,10 1,13 1,16 1,17 1,18 1,19 1,20 1,26 1,51 1,60 1,74 1,108 1,126 1,127 1,137 1,155 7.2}
{0 CHEMBL2006785,13 1,25 1,26 1,27 1,93 1,126 1,127 1,137 1,155 5.1}
{0 CHEMBL2006836,26 1,27 1,40 1,63 1,126 1,127 1,135 1,137 1,151 1,155 5.1}
{0 CHEMBL2006933,13 1,19 1,26 1,51 1,82 1,106 1,126 1,127 1,137 1,155 5.1}
{0 CHEMBL2007002,13 1,23 1,25 1,26 1,29 1,77 1,82 1,126 1,127 1,137 1,155 5.1}
{0 CHEMBL2007044,20 1,26 1,27 1,29 1,31 1,84 1,91 1,126 1,127 1,137 1,155 5.3}
{0 CHEMBL2007064,6 1,17 1,18 1,23 1,25 1,26 1,74 1,77 1,108 1,126 1,127 1,131 1,155 6.2}
{0 CHEMBL2007151,7 1,13 1,16 1,26 1,27 1,51 1,52 1,98 1,126 1,127 1,128 1,130 1,137 1,155 5.3}
{0 CHEMBL2007296,26 1,41 1,126 1,127 1,137 1,155 5.1}
{0 CHEMBL2007372,16 1,17 1,25 1,26 1,57 1,60 1,88 1,93 1,105 1,109 1,126 1,127 1,137 1,153 1,155 5.1}
{0 CHEMBL2007592,16 1,20 1,25 1,26 1,124 1,126 1,127 1,137 1,153 1,155 5.1}
{0 CHEMBL2010872,13 1,20 1,21 1,23 1,26 1,84 1,101 1,123 1,126 1,127 1,137 1,155 7.678}
{0 CHEMBL202635,11 1,12 1,16 1,22 1,25 1,26 1,27 1,82 1,91 1,93 1,117 1,126 1,127 1,137 1,155 5.1}
{0 CHEMBL207253,24 1,26 1,51 1,62 1,93 1,109 1,126 1,127 1,137 1,155 5.1}
{0 CHEMBL207400,26 1,73 1,93 1,109 1,126 1,127 1,137 1,155 5.1}
{0 CHEMBL207995,11 1,12 1,16 1,22 1,25 1,26 1,27 1,82 1,91 1,126 1,127 1,137 1,155 5.6}
{0 CHEMBL208637,16 1,25 1,26 1,27 1,51 1,91 1,108 1,109 1,114 1,126 1,127 1,137 1,155 5.078}
{0 CHEMBL209534,26 1,27 1,51 1,91 1,109 1,114 1,126 1,127 1,137 1,155 5.1}
{0 CHEMBL210032,16 1,25 1,26 1,27 1,51 1,91 1,108 1,126 1,127 1,137 1,155 5.078}
{0 CHEMBL210618,16 1,25 1,26 1,27 1,51 1,82 1,91 1,108 1,109 1,114 1,126 1,127 1,137 1,155 5.078}
{0 CHEMBL210887,25 1,26 1,63 1,126 1,127 1,135 1,137 1,155 5.1}
{0 CHEMBL210928,16 1,25 1,26 1,51 1,82 1,108 1,109 1,126 1,127 1,137 1,155 5.078}
{0 CHEMBL210963,16 1,25 1,26 1,27 1,51 1,82 1,91 1,108 1,109 1,114 1,126 1,127 1,137 1,155 5.078}
{0 CHEMBL211378,7 1,11 1,12 1,13 1,16 1,22 1,23 1,25 1,26 1,51 1,98 1,126 1,127 1,137 1,155 5.1}
{0 CHEMBL213505,7 1,11 1,12 1,13 1,16 1,22 1,23 1,25 1,26 1,51 1,73 1,98 1,126 1,127 1,137 1,155 5.3}
{0 CHEMBL215152,13 1,16 1,23 1,25 1,26 1,27 1,29 1,74 1,93 1,98 1,108 1,126 1,127 1,137 1,155 5.05}
{0 CHEMBL219722,11 1,12 1,13 1,22 1,23 1,25 1,26 1,29 1,51 1,104 1,122 1,126 1,127 1,137 1,155 6.2}
{0 CHEMBL220057,11 1,12 1,13 1,16 1,22 1,23 1,25 1,26 1,29 1,51 1,77 1,126 1,127 1,137 1,155 6.1}
{0 CHEMBL220241,2 1,6 1,11 1,16 1,20 1,23 1,25 1,26 1,27 1,51 1,62 1,63 1,109 1,126 1,127 1,137 1,155 5.1}
{0 CHEMBL2205426,21 1,23 1,26 1,41 1,109 1,123 1,126 1,127 1,136 1,137 1,154 1,155 5.538}
{0 CHEMBL2205766,8 1,20 1,26 1,31 1,41 1,51 1,81 1,103 1,126 1,127 1,137 1,155 5}
{0 CHEMBL221959,3 1,4 1,5 1,6 1,13 1,18 1,26 1,27 1,35 1,109 1,110 1,126 1,127 1,137 1,151 1,155 5.184}
{0 CHEMBL223257,11 1,12 1,16 1,22 1,25 1,26 1,27 1,91 1,109 1,126 1,127 1,133 1,137 1,139 1,155 6.6}
{0 CHEMBL223360,10 1,11 1,12 1,13 1,16 1,22 1,23 1,25 1,26 1,29 1,51 1,77 1,93 1,126 1,127 1,137 1,155 5.712}
{0 CHEMBL223367,11 1,12 1,16 1,22 1,25 1,26 1,27 1,91 1,109 1,126 1,127 1,135 1,137 1,155 7.2}
{0 CHEMBL223460,10 1,11 1,12 1,16 1,22 1,25 1,26 1,27 1,91 1,109 1,126 1,127 1,137 1,155 6.6}
{0 CHEMBL225519,18 1,26 1,41 1,74 1,126 1,127 1,137 1,155 5.4}
{0 CHEMBL226403,13 1,18 1,19 1,20 1,26 1,41 1,74 1,117 1,126 1,127 1,137 1,155 5.1}
{0 CHEMBL226471,18 1,26 1,41 1,74 1,93 1,117 1,126 1,127 1,137 1,155 5.1}
{0 CHEMBL230011,16 1,51 1,105 1,121 1,126 1,127 1,137 1,145 1,155 5}
{0 CHEMBL2309006,13 1,20 1,26 1,32 1,68 1,84 1,126 1,127 1,132 1,134 1,137 1,155 8.62}
{0 CHEMBL2309609,13 1,20 1,26 1,33 1,68 1,84 1,126 1,127 1,134 1,137 1,155 6.658}
{0 CHEMBL231209,7 1,11 1,12 1,13 1,16 1,17 1,19 1,20 1,22 1,23 1,25 1,26 1,51 1,93 1,126 1,127 1,137 1,155 5.6}
{0 CHEMBL2312649,16 1,21 1,25 1,26 1,27 1,123 1,126 1,127 1,137 1,140 1,155 4.523}
{0 CHEMBL2312652,16 1,21 1,25 1,26 1,27 1,82 1,123 1,126 1,127 1,137 1,140 1,155 4.523}
{0 CHEMBL2312654,16 1,20 1,21 1,25 1,26 1,27 1,123 1,126 1,127 1,137 1,140 1,155 6.328}
{0 CHEMBL234085,3 1,4 1,5 1,6 1,13 1,18 1,26 1,27 1,35 1,109 1,110 1,126 1,127 1,137 1,151 1,155 5.5}
{0 CHEMBL243088,16 1,21 1,23 1,26 1,40 1,123 1,126 1,127 1,134 1,137 1,145 1,155 6.2}
{0 CHEMBL243298,16 1,21 1,23 1,26 1,40 1,93 1,123 1,126 1,127 1,134 1,137 1,155 5.5}
{0 CHEMBL244378,6 1,13 1,16 1,21 1,23 1,26 1,29 1,40 1,123 1,126 1,127 1,134 1,137 1,155 6.6}
{0 CHEMBL246970,16 1,25 1,26 1,45 1,93 1,126 1,127 1,135 1,137 1,155 6.7}
{0 CHEMBL24828,10 1,13 1,16 1,23 1,26 1,27 1,82 1,93 1,98 1,126 1,127 1,137 1,140 1,155 5}
{0 CHEMBL248757,10 1,11 1,12 1,16 1,22 1,25 1,26 1,27 1,28 1,74 1,91 1,109 1,126 1,127 1,137 1,155 7.2}
{0 CHEMBL249282,20 1,26 1,27 1,29 1,83 1,84 1,91 1,126 1,127 1,137 1,155 5.1}
{0 CHEMBL249697,16 1,25 1,26 1,109 1,126 1,127 1,137 1,155 5}
{0 CHEMBL253969,16 1,22 1,25 1,26 1,27 1,76 1,109 1,126 1,127 1,130 1,137 1,155 5.1}
{0 CHEMBL255863,17 1,20 1,25 1,26 1,73 1,123 1,126 1,127 1,134 1,137 1,153 1,155 5}
{0 CHEMBL256835,24 1,26 1,93 1,126 1,127 1,137 1,153 1,155 5.1}
{0 CHEMBL259084,17 1,21 1,23 1,26 1,40 1,93 1,97 1,117 1,123 1,126 1,127 1,130 1,137 1,155 5.1}
{0 CHEMBL259850,22 1,25 1,26 1,75 1,82 1,126 1,127 1,135 1,137 1,155 5.1}
{0 CHEMBL259922,13 1,16 1,25 1,26 1,66 1,98 1,107 1,126 1,127 1,132 1,134 1,137 1,155 5.1}
{0 CHEMBL260092,11 1,12 1,16 1,22 1,23 1,25 1,26 1,51 1,73 1,98 1,126 1,127 1,137 1,155 6.4}
{0 CHEMBL260135,13 1,29 1,51 1,64 1,104 1,126 1,127 1,137 1,155 5.1}
{0 CHEMBL261849,16 1,26 1,51 1,82 1,126 1,127 1,128 1,130 1,137 1,155 5}
{0 CHEMBL262433,7 1,10 1,11 1,12 1,13 1,16 1,22 1,23 1,25 1,26 1,51 1,93 1,98 1,126 1,127 1,137 1,155 5.3}
{0 CHEMBL271381,11 1,12 1,13 1,16 1,22 1,23 1,25 1,26 1,51 1,82 1,93 1,126 1,127 1,137 1,155 5.3}
{0 CHEMBL272453,11 1,12 1,13 1,16 1,22 1,23 1,25 1,26 1,51 1,82 1,126 1,127 1,137 1,155 5.7}
{0 CHEMBL274064,17 1,26 1,51 1,76 1,93 1,126 1,127 1,137 1,153 1,155 5.5}
{0 CHEMBL278041,18 1,41 1,49 1,93 1,124 1,126 1,127 1,137 1,141 1,145 1,155 5.3}
{0 CHEMBL288441,10 1,13 1,19 1,26 1,27 1,82 1,91 1,126 1,127 1,137 1,140 1,155 6.432}
{0 CHEMBL296468,25 1,26 1,69 1,76 1,106 1,108 1,109 1,126 1,130 1,137 1,155 5.3}
{0 CHEMBL296586,13 1,18 1,23 1,25 1,26 1,77 1,93 1,108 1,126 1,127 1,147 1,155 6.2}
{0 CHEMBL300138,7 1,13 1,20 1,26 1,27 1,91 1,93 1,108 1,126 1,127 1,137 1,155 5.721}
{0 CHEMBL306380,7 1,13 1,16 1,26 1,51 1,98 1,126 1,127 1,137 1,155 5.4}
{0 CHEMBL316264,18 1,41 1,49 1,93 1,124 1,126 1,127 1,137 1,141 1,155 5.1}
{0 CHEMBL31965,13 1,16 1,21 1,23 1,25 1,26 1,27 1,93 1,98 1,108 1,126 1,127 1,137 1,155 5}
{0 CHEMBL326282,13 1,26 1,36 1,51 1,93 1,126 1,127 1,137 1,155 5.1}
{0 CHEMBL336961,13 1,18 1,23 1,25 1,26 1,77 1,93 1,108 1,117 1,126 1,127 1,133 1,137 1,155 5.1}
{0 CHEMBL340384,5 1,26 1,41 1,59 1,108 1,126 1,127 1,137 1,145 1,149 1,155 5.7}
{0 CHEMBL340921,5 1,26 1,41 1,59 1,108 1,126 1,127 1,137 1,145 1,155 5.2}
{0 CHEMBL362558,13 1,26 1,56 1,108 1,126 1,127 1,130 1,133 1,137 1,143 1,155 5.4}
{0 CHEMBL363648,16 1,25 1,26 1,31 1,41 1,92 1,126 1,127 1,137 1,155 5.1}
{0 CHEMBL371206,7 1,11 1,12 1,13 1,16 1,22 1,23 1,25 1,26 1,46 1,49 1,51 1,52 1,98 1,126 1,127 1,137 1,155 5.4}
{0 CHEMBL373598,11 1,12 1,16 1,22 1,25 1,26 1,27 1,91 1,109 1,126 1,127 1,135 1,137 1,139 1,155 7.3}
{0 CHEMBL375284,11 1,12 1,13 1,22 1,23 1,25 1,26 1,29 1,77 1,126 1,127 1,137 1,155 6.1}
{0 CHEMBL377300,2 1,10 1,13 1,18 1,26 1,74 1,77 1,109 1,112 1,126 1,127 1,137 1,155 5}
{0 CHEMBL377383,26 1,51 1,109 1,126 1,127 1,137 1,155 5.078}
{0 CHEMBL377408,26 1,27 1,51 1,91 1,109 1,114 1,126 1,127 1,137 1,155 5.6}
{0 CHEMBL378627,16 1,25 1,26 1,27 1,51 1,82 1,91 1,108 1,109 1,114 1,126 1,127 1,137 1,155 5.078}
{0 CHEMBL379218,13 1,20 1,26 1,29 1,74 1,103 1,126 1,127 1,137 1,155 5.268}
{0 CHEMBL379835,26 1,93 1,109 1,126 1,127 1,137 1,155 5.1}
{0 CHEMBL379975,13 1,18 1,26 1,77 1,82 1,93 1,126 1,127 1,145 1,152 1,155 7.6}
{0 CHEMBL38380,13 1,26 1,27 1,43 1,76 1,126 1,127 1,130 1,137 1,146 1,155 5.1}
{0 CHEMBL384304,16 1,25 1,26 1,27 1,51 1,82 1,93 1,126 1,127 1,137 1,152 1,155 5}
{0 CHEMBL386051,12 1,21 1,23 1,26 1,82 1,93 1,109 1,123 1,126 1,127 1,137 1,138 1,155 5.824}
{0 CHEMBL387971,20 1,26 1,27 1,29 1,49 1,83 1,84 1,91 1,93 1,126 1,127 1,137 1,140 1,155 5.1}
{0 CHEMBL392642,16 1,25 1,26 1,45 1,82 1,126 1,127 1,135 1,137 1,155 6.9}
{0 CHEMBL394619,7 1,11 1,12 1,13 1,16 1,17 1,19 1,20 1,22 1,23 1,25 1,26 1,51 1,126 1,127 1,137 1,155 5.4}
{0 CHEMBL394790,7 1,11 1,12 1,13 1,16 1,17 1,19 1,20 1,22 1,23 1,25 1,26 1,51 1,93 1,126 1,127 1,137 1,155 5.7}
{0 CHEMBL396523,13 1,16 1,21 1,23 1,26 1,29 1,40 1,54 1,77 1,123 1,126 1,127 1,134 1,137 1,155 6.4}
{0 CHEMBL398951,20 1,26 1,27 1,29 1,83 1,84 1,91 1,126 1,127 1,137 1,155 5.1}
{0 CHEMBL402846,6 1,10 1,11 1,12 1,13 1,16 1,17 1,20 1,22 1,23 1,25 1,26 1,51 1,88 1,93 1,126 1,127 1,137 1,155 5.1}
{0 CHEMBL404367,6 1,11 1,12 1,13 1,16 1,17 1,20 1,22 1,23 1,25 1,26 1,51 1,88 1,126 1,127 1,137 1,155 5.2}
{0 CHEMBL406845,7 1,13 1,16 1,26 1,51 1,93 1,98 1,126 1,127 1,137 1,155 5.6}
{0 CHEMBL411903,10 1,11 1,12 1,16 1,22 1,23 1,25 1,26 1,51 1,73 1,93 1,98 1,126 1,127 1,137 1,155 6.5}
{0 CHEMBL412142,6 1,16 1,17 1,18 1,20 1,25 1,26 1,27 1,91 1,93 1,126 1,127 1,137 1,155 5.1}
{0 CHEMBL413779,11 1,12 1,16 1,22 1,25 1,26 1,27 1,91 1,109 1,126 1,127 1,137 1,139 1,155 7.3}
{0 CHEMBL415049,13 1,16 1,23 1,25 1,26 1,27 1,29 1,34 1,74 1,93 1,98 1,108 1,126 1,127 1,137 1,155 5.6}
{0 CHEMBL41783,13 1,25 1,26 1,27 1,29 1,64 1,93 1,104 1,108 1,119 1,126 1,127 1,137 1,138 1,140 1,155 5.1}
{0 CHEMBL422897,26 1,27 1,93 1,111 1,126 1,127 1,140 1,155 5.5}
{0 CHEMBL424872,26 1,27 1,51 1,91 1,109 1,114 1,126 1,127 1,137 1,155 5.3}
{0 CHEMBL428690,26 1,27 1,93 1,111 1,126 1,127 1,140 1,155 5.027}
{0 CHEMBL437747,17 1,25 1,26 1,76 1,93 1,97 1,126 1,127 1,137 1,153 1,155 5.7}
{0 CHEMBL440084,18 1,26 1,111 1,117 1,124 1,126 1,127 1,137 1,141 1,155 5}
{0 CHEMBL443962,8 1,20 1,24 1,26 1,82 1,126 1,127 1,137 1,155 5.1}
{0 CHEMBL445813,6 1,25 1,26 1,29 1,76 1,93 1,126 1,127 1,137 1,155 5}
{0 CHEMBL450786,6 1,18 1,23 1,25 1,26 1,27 1,49 1,74 1,77 1,93 1,95 1,108 1,126 1,127 1,131 1,155 5.721}
{0 CHEMBL451964,16 1,20 1,25 1,26 1,73 1,91 1,126 1,127 1,137 1,155 5.1}
{0 CHEMBL457871,3 1,4 1,5 1,6 1,13 1,18 1,26 1,27 1,35 1,109 1,110 1,126 1,127 1,137 1,151 1,155 6.347}
{0 CHEMBL458997,11 1,16 1,23 1,26 1,60 1,82 1,100 1,123 1,126 1,127 1,134 1,137 1,139 1,155 5.7}
{0 CHEMBL461876,3 1,4 1,5 1,6 1,13 1,16 1,18 1,23 1,26 1,27 1,82 1,93 1,123 1,126 1,127 1,134 1,137 1,138 1,140 1,151 1,155 5.5}
{0 CHEMBL462120,23 1,25 1,26 1,93 1,108 1,126 1,127 1,155 5.4}
{0 CHEMBL464552,3 1,4 1,5 1,6 1,13 1,16 1,18 1,23 1,26 1,27 1,60 1,82 1,93 1,100 1,123 1,126 1,127 1,134 1,137 1,138 1,140 1,151 1,155 5}
{0 CHEMBL465465,10 1,23 1,26 1,40 1,49 1,93 1,126 1,127 1,155 4.523}
{0 CHEMBL468280,5 1,20 1,26 1,109 1,126 1,127 1,137 1,155 5.1}
{0 CHEMBL474432,26 1,73 1,82 1,126 1,127 1,130 1,137 1,155 6.7}
{0 CHEMBL475251,11 1,16 1,21 1,25 1,26 1,45 1,71 1,82 1,108 1,123 1,126 1,127 1,137 1,155 5.362}
{0 CHEMBL477772,13 1,21 1,23 1,26 1,109 1,123 1,126 1,127 1,137 1,155 5}
{0 CHEMBL481491,26 1,73 1,126 1,127 1,130 1,137 1,155 5.4}
{0 CHEMBL481968,10 1,23 1,26 1,40 1,49 1,63 1,93 1,123 1,125 1,126 1,127 1,137 1,155 4.523}
{0 CHEMBL481969,10 1,23 1,26 1,40 1,49 1,63 1,93 1,108 1,125 1,126 1,127 1,154 1,155 4.523}
{0 CHEMBL482767,11 1,12 1,16 1,19 1,22 1,23 1,25 1,26 1,77 1,93 1,98 1,126 1,127 1,137 1,155 5.2}
{0 CHEMBL482967,17 1,21 1,23 1,26 1,51 1,123 1,126 1,127 1,137 1,153 1,155 6.1}
{0 CHEMBL483158,17 1,21 1,23 1,26 1,40 1,82 1,93 1,97 1,117 1,123 1,126 1,127 1,130 1,137 1,155 5.1}
{0 CHEMBL483321,13 1,16 1,18 1,21 1,22 1,23 1,26 1,60 1,88 1,91 1,98 1,108 1,122 1,126 1,127 1,137 1,155 5}
{0 CHEMBL484390,25 1,26 1,27 1,63 1,91 1,95 1,126 1,127 1,137 1,155 5.1}
{0 CHEMBL485556,25 1,26 1,27 1,33 1,63 1,91 1,95 1,108 1,118 1,126 1,127 1,137 1,155 5.1}
{0 CHEMBL49120,12 1,21 1,23 1,26 1,27 1,93 1,109 1,123 1,126 1,127 1,137 1,138 1,155 6.1}
{0 CHEMBL491473,2 1,10 1,13 1,18 1,26 1,27 1,74 1,77 1,82 1,109 1,126 1,127 1,137 1,155 5.2}
{0 CHEMBL491758,11 1,16 1,21 1,23 1,123 1,126 1,127 1,137 1,155 5.7}
{0 CHEMBL494089,16 1,20 1,26 1,51 1,62 1,76 1,85 1,91 1,126 1,137 1,155 5}
{0 CHEMBL497151,6 1,13 1,20 1,91 1,93 1,121 1,126 1,127 1,137 1,155 5.1}
{0 CHEMBL504950,13 1,16 1,26 1,46 1,51 1,77 1,98 1,119 1,126 1,127 1,137 1,155 5.3}
{0 CHEMBL507936,11 1,12 1,19 1,22 1,23 1,25 1,26 1,32 1,51 1,88 1,126 1,127 1,137 1,155 5.1}
{0 CHEMBL508928,11 1,12 1,15 1,16 1,20 1,22 1,23 1,24 1,25 1,26 1,51 1,93 1,126 1,127 1,137 1,155 6.8}
{0 CHEMBL50894,13 1,18 1,23 1,25 1,26 1,77 1,108 1,126 1,127 1,135 1,147 1,155 6.7}
{0 CHEMBL509032,11 1,16 1,23 1,26 1,27 1,82 1,123 1,126 1,127 1,134 1,137 1,139 1,140 1,155 6.705}
{0 CHEMBL513846,17 1,21 1,23 1,26 1,123 1,126 1,127 1,133 1,137 1,145 1,155 5.1}
{0 CHEMBL513909,23 1,26 1,27 1,42 1,82 1,109 1,123 1,126 1,127 1,137 1,140 1,155 5}
{0 CHEMBL514499,26 1,73 1,82 1,126 1,127 1,130 1,137 1,155 6.7}
{0 CHEMBL516312,3 1,4 1,5 1,6 1,8 1,13 1,18 1,20 1,25 1,26 1,27 1,91 1,103 1,126 1,127 1,137 1,151 1,155 7.125}
{0 CHEMBL517647,10 1,23 1,26 1,40 1,49 1,93 1,108 1,118 1,126 1,127 1,155 5.222}
{0 CHEMBL519697,25 1,26 1,27 1,63 1,91 1,95 1,126 1,127 1,137 1,155 5.1}
{0 CHEMBL521851,4 1,8 1,13 1,20 1,26 1,27 1,29 1,62 1,77 1,93 1,109 1,126 1,127 1,137 1,152 1,154 1,155 5}
{0 CHEMBL522892,18 1,23 1,25 1,26 1,27 1,56 1,77 1,93 1,105 1,108 1,126 1,127 1,137 1,140 1,155 6.51}
{0 CHEMBL523823,5 1,20 1,26 1,109 1,126 1,127 1,137 1,155 6.4}
{0 CHEMBL52387,11 1,16 1,25 1,26 1,126 1,127 1,137 1,155 5.1}
{0 CHEMBL525191,26 1,31 1,41 1,48 1,126 1,127 1,137 1,155 5}
{0 CHEMBL526133,13 1,26 1,29 1,54 1,77 1,88 1,126 1,127 1,137 1,155 5.1}
{0 CHEMBL535,6 1,18 1,23 1,25 1,26 1,27 1,74 1,77 1,93 1,108 1,126 1,127 1,131 1,155 7.252}
{0 CHEMBL535331,6 1,13 1,18 1,26 1,53 1,56 1,63 1,67 1,77 1,103 1,107 1,125 1,126 1,127 1,137 1,155 5.1}
{0 CHEMBL536151,25 1,26 1,49 1,73 1,93 1,126 1,127 1,155 5.1}
{0 CHEMBL539474,25 1,26 1,48 1,126 1,127 1,128 1,130 1,137 1,155 5.1}
{0 CHEMBL553,13 1,16 1,21 1,23 1,26 1,33 1,98 1,126 1,127 1,137 1,155 5.05}
{0 CHEMBL554,13 1,16 1,21 1,23 1,26 1,56 1,76 1,93 1,98 1,126 1,127 1,128 1,130 1,137 1,155 5.05}
{0 CHEMBL558752,6 1,18 1,21 1,23 1,25 1,26 1,63 1,73 1,100 1,117 1,126 1,127 1,137 1,155 5}
{0 CHEMBL560813,11 1,12 1,13 1,16 1,22 1,23 1,25 1,26 1,27 1,40 1,88 1,91 1,126 1,127 1,137 1,155 5.1}
{0 CHEMBL565612,6 1,13 1,18 1,26 1,27 1,67 1,77 1,107 1,108 1,126 1,127 1,137 1,140 1,155 6.9}
{0 CHEMBL572878,16 1,23 1,25 1,26 1,27 1,29 1,41 1,74 1,93 1,106 1,108 1,109 1,126 1,127 1,137 1,140 1,155 5.6}
{0 CHEMBL572881,16 1,23 1,25 1,26 1,126 1,127 1,137 1,155 5}
{0 CHEMBL573339,4 1,8 1,13 1,20 1,26 1,46 1,62 1,109 1,126 1,127 1,137 1,145 1,155 5}
{0 CHEMBL574738,2 1,11 1,12 1,16 1,22 1,23 1,25 1,26 1,27 1,41 1,60 1,73 1,93 1,98 1,109 1,126 1,127 1,137 1,155 5.6}
{0 CHEMBL576982,11 1,12 1,16 1,22 1,23 1,25 1,26 1,27 1,62 1,126 1,127 1,137 1,155 5}
{0 CHEMBL583144,13 1,26 1,34 1,59 1,93 1,126 1,127 1,137 1,155 5.1}
{0 CHEMBL590109,6 1,13 1,26 1,29 1,51 1,54 1,121 1,126 1,127 1,137 1,155 6.272}
{0 CHEMBL592030,6 1,13 1,26 1,29 1,51 1,54 1,121 1,126 1,127 1,135 1,137 1,155 6.3}
{0 CHEMBL601719,15 1,16 1,20 1,24 1,26 1,51 1,76 1,93 1,103 1,126 1,127 1,137 1,152 1,155 6.004}
{0 CHEMBL605003,6 1,18 1,23 1,25 1,26 1,27 1,49 1,74 1,108 1,126 1,127 1,140 1,155 6.959}
{0 CHEMBL607707,13 1,19 1,21 1,23 1,25 1,26 1,27 1,91 1,93 1,108 1,126 1,127 1,134 1,137 1,138 1,140 1,155 5.62}
{0 CHEMBL608154,13 1,18 1,25 1,26 1,82 1,91 1,126 1,127 1,137 1,155 5}
{0 CHEMBL7064,13 1,26 1,29 1,64 1,84 1,126 1,127 1,137 1,155 6.5}
{0 CHEMBL91829,13 1,20 1,26 1,27 1,56 1,108 1,126 1,127 1,137 1,138 1,140 1,155 6.018}
{0 CHEMBL939,13 1,16 1,21 1,23 1,26 1,27 1,82 1,93 1,98 1,126 1,127 1,137 1,155 5.05}
{0 CHEMBL941,17 1,20 1,23 1,25 1,26 1,27 1,93 1,123 1,126 1,127 1,134 1,137 1,140 1,153 1,155 5.1}
{0 CHEMBL95692,24 1,26 1,76 1,93 1,126 1,127 1,137 1,153 1,155 5.1}
