{
  "data_features": {
    "feature": [
      {
        "data_type": "nominal",
        "index": "0",
        "is_ignore": "false",
        "is_row_identifier": "true",
        "is_target": "false",
        "name": "molecule_id",
        "nominal_value": [
          "CHEMBL102",
          "CHEMBL1082",
          "CHEMBL1089781",
          "CHEMBL121924",
          "CHEMBL122209",
          "CHEMBL123481",
          "CHEMBL127",
          "CHEMBL127782",
          "CHEMBL128523",
          "CHEMBL129090",
          "CHEMBL129226",
          "CHEMBL129651",
          "CHEMBL129690",
          "CHEMBL130187",
          "CHEMBL130854",
          "CHEMBL148",
          "CHEMBL1689063",
          "CHEMBL1795563",
          "CHEMBL1795564",
          "CHEMBL1795565",
          "CHEMBL1795566",
          "CHEMBL1795567",
          "CHEMBL1795568",
          "CHEMBL1795569",
          "CHEMBL1795570",
          "CHEMBL1795571",
          "CHEMBL1795572",
          "CHEMBL1800183",
          "CHEMBL1800866",
          "CHEMBL1800867",
          "CHEMBL1800868",
          "CHEMBL1800869",
          "CHEMBL1800870",
          "CHEMBL1800871",
          "CHEMBL1800873",
          "CHEMBL1800874",
          "CHEMBL1800875",
          "CHEMBL1800876",
          "CHEMBL1800877",
          "CHEMBL1800878",
          "CHEMBL186",
          "CHEMBL2079714",
          "CHEMBL29",
          "CHEMBL316157",
          "CHEMBL332565",
          "CHEMBL333330",
          "CHEMBL336630",
          "CHEMBL338157",
          "CHEMBL338351",
          "CHEMBL338933",
          "CHEMBL339600",
          "CHEMBL340351",
          "CHEMBL340423",
          "CHEMBL340707",
          "CHEMBL340937",
          "CHEMBL341484",
          "CHEMBL341496",
          "CHEMBL403",
          "CHEMBL404",
          "CHEMBL44354",
          "CHEMBL480517",
          "CHEMBL491571",
          "CHEMBL520642",
          "CHEMBL589754",
          "CHEMBL590145",
          "CHEMBL590627",
          "CHEMBL592718",
          "CHEMBL598365",
          "CHEMBL598570",
          "CHEMBL598571",
          "CHEMBL598776",
          "CHEMBL600251",
          "CHEMBL604782",
          "CHEMBL607575",
          "CHEMBL609910",
          "CHEMBL617",
          "CHEMBL6461",
          "CHEMBL702",
          "CHEMBL777",
          "CHEMBL996"
        ],
        "number_of_missing_values": "0"
      },
      {
        "data_type": "numeric",
        "index": "1",
        "is_ignore": "false",
        "is_row_identifier": "false",
        "is_target": "false",
        "name": "Mv",
        "number_of_missing_values": "0"
      },
      {
        "data_type": "numeric",
        "index": "2",
        "is_ignore": "false",
        "is_row_identifier": "false",
        "is_target": "false",
        "name": "H.",
        "number_of_missing_values": "0"
      },
      {
        "data_type": "numeric",
        "index": "3",
        "is_ignore": "false",
        "is_row_identifier": "false",
        "is_target": "false",
        "name": "AMW",
        "number_of_missing_values": "0"
      },
      {
        "data_type": "numeric",
        "index": "4",
        "is_ignore": "false",
        "is_row_identifier": "false",
        "is_target": "false",
        "name": "C.",
        "number_of_missing_values": "0"
      },
      {
        "data_type": "numeric",
        "index": "5",
        "is_ignore": "false",
        "is_row_identifier": "false",
        "is_target": "true",
        "name": "pXC50",
        "number_of_missing_values": "0"
      }
    ]
  }
}