{
  "data_set_description": {
    "collection_date": "November 2013",
    "creator": "Dr Jeremy Besnard, Dr Ivan Olier, Dr Noureddin Sadawi, Dr Larisa Soldatova, Dr Crina Grosan, Prof Ross King, Dr Richard Bickerton, Prof Andrew Hopkins and Dr Willem van Hoorn",
    "default_target_attribute": "pXC50",
    "description": "This dataset contains QSAR data (from ChEMBL version 17) showing activity values (unit is pseudo-pCI50) of several compounds on drug target ChEMBL_ID: CHEMBL5980 (TID: 100686), and it has 197 rows and 1361 features (not including molecule IDs and class feature: molecule_id and pXC50). The features represent Molecular Descriptors which were generated from SMILES strings. Missing value imputation was applied to this dataset (By choosing the Median).",
    "description_version": "1",
    "file_id": "3568776",
    "format": "ARFF",
    "id": "35812",
    "licence": "Public",
    "md5_checksum": "9d71456c8e7d27d1054ed9c2e2baf07c",
    "minio_url": "https://data.openml.org/datasets/0003/35812/dataset_35812.pq",
    "name": "QSAR-DATASET-FOR-DRUG-TARGET-CHEMBL5980",
    "original_data_url": "https://www.ebi.ac.uk/chembl/target/inspect/CHEMBL5980",
    "parquet_url": "https://data.openml.org/datasets/0003/35812/dataset_35812.pq",
    "processing_date": "2018-10-04 04:39:39",
    "row_id_attribute": "molecule_id",
    "status": "deactivated",
    "tag": [
      "MetaQSAR",
      "study_13"
    ],
    "upload_date": "2016-07-15T19:03:23",
    "url": "https://api.openml.org/data/v1/download/3568776/QSAR-DATASET-FOR-DRUG-TARGET-CHEMBL5980.arff",
    "version": "11",
    "visibility": "public"
  }
}