{
  "data_features": {
    "feature": [
      {
        "data_type": "nominal",
        "index": "0",
        "is_ignore": "false",
        "is_row_identifier": "true",
        "is_target": "false",
        "name": "molecule_id",
        "nominal_value": [
          "CHEMBL1760000",
          "CHEMBL1762693",
          "CHEMBL1762694",
          "CHEMBL1762695",
          "CHEMBL1762696",
          "CHEMBL1762697",
          "CHEMBL1762698",
          "CHEMBL1762699",
          "CHEMBL1762700",
          "CHEMBL1762701",
          "CHEMBL1762702",
          "CHEMBL1762703",
          "CHEMBL1762704",
          "CHEMBL1762705",
          "CHEMBL1762706",
          "CHEMBL1762707",
          "CHEMBL448975",
          "CHEMBL449189",
          "CHEMBL450183",
          "CHEMBL451657",
          "CHEMBL456481",
          "CHEMBL457788",
          "CHEMBL457789",
          "CHEMBL458001",
          "CHEMBL458002",
          "CHEMBL458220",
          "CHEMBL466116",
          "CHEMBL474272",
          "CHEMBL474470",
          "CHEMBL474473",
          "CHEMBL474474",
          "CHEMBL474761",
          "CHEMBL475077",
          "CHEMBL475282",
          "CHEMBL475965",
          "CHEMBL476619",
          "CHEMBL476627",
          "CHEMBL477008",
          "CHEMBL477431",
          "CHEMBL477432",
          "CHEMBL477643",
          "CHEMBL499944",
          "CHEMBL500240",
          "CHEMBL501027",
          "CHEMBL502132",
          "CHEMBL503202",
          "CHEMBL504032",
          "CHEMBL505263",
          "CHEMBL506128",
          "CHEMBL506884",
          "CHEMBL514267",
          "CHEMBL517029"
        ],
        "number_of_missing_values": "0"
      },
      {
        "data_type": "numeric",
        "index": "1",
        "is_ignore": "false",
        "is_row_identifier": "false",
        "is_target": "false",
        "name": "AMW",
        "number_of_missing_values": "0"
      },
      {
        "data_type": "numeric",
        "index": "2",
        "is_ignore": "false",
        "is_row_identifier": "false",
        "is_target": "false",
        "name": "C.",
        "number_of_missing_values": "0"
      },
      {
        "data_type": "numeric",
        "index": "3",
        "is_ignore": "false",
        "is_row_identifier": "false",
        "is_target": "true",
        "name": "pXC50",
        "number_of_missing_values": "0"
      }
    ]
  }
}