{
  "data_features": {
    "feature": [
      {
        "data_type": "nominal",
        "index": "0",
        "is_ignore": "false",
        "is_row_identifier": "true",
        "is_target": "false",
        "name": "molecule_id",
        "nominal_value": [
          "CHEMBL1054",
          "CHEMBL1055",
          "CHEMBL1060",
          "CHEMBL107217",
          "CHEMBL1086703",
          "CHEMBL1086834",
          "CHEMBL1094898",
          "CHEMBL1095203",
          "CHEMBL1095204",
          "CHEMBL1095531",
          "CHEMBL1095855",
          "CHEMBL1095856",
          "CHEMBL1095882",
          "CHEMBL1095883",
          "CHEMBL1095884",
          "CHEMBL1096820",
          "CHEMBL1096821",
          "CHEMBL1096822",
          "CHEMBL1096823",
          "CHEMBL1098204",
          "CHEMBL1098205",
          "CHEMBL1098206",
          "CHEMBL1098207",
          "CHEMBL1098208",
          "CHEMBL1098349",
          "CHEMBL1098496",
          "CHEMBL1098526",
          "CHEMBL1098657",
          "CHEMBL1098816",
          "CHEMBL1098817",
          "CHEMBL1098839",
          "CHEMBL1099003",
          "CHEMBL1099124",
          "CHEMBL1099125",
          "CHEMBL1099137",
          "CHEMBL1099151",
          "CHEMBL1099152",
          "CHEMBL112",
          "CHEMBL1141",
          "CHEMBL116438",
          "CHEMBL11685",
          "CHEMBL118",
          "CHEMBL118903",
          "CHEMBL119296",
          "CHEMBL1200731",
          "CHEMBL1209038",
          "CHEMBL1209039",
          "CHEMBL1214193",
          "CHEMBL1214194",
          "CHEMBL1214195",
          "CHEMBL1214248",
          "CHEMBL1214323",
          "CHEMBL122708",
          "CHEMBL12567",
          "CHEMBL1340",
          "CHEMBL1355",
          "CHEMBL1356",
          "CHEMBL1356238",
          "CHEMBL1362",
          "CHEMBL13646",
          "CHEMBL1401508",
          "CHEMBL14060",
          "CHEMBL1414",
          "CHEMBL145",
          "CHEMBL145781",
          "CHEMBL153094",
          "CHEMBL154106",
          "CHEMBL15844",
          "CHEMBL1644027",
          "CHEMBL1644030",
          "CHEMBL165",
          "CHEMBL1668603",
          "CHEMBL17",
          "CHEMBL171476",
          "CHEMBL1738778",
          "CHEMBL1777820",
          "CHEMBL1778431",
          "CHEMBL1778432",
          "CHEMBL1778433",
          "CHEMBL1778434",
          "CHEMBL1778435",
          "CHEMBL1778436",
          "CHEMBL1778437",
          "CHEMBL1778438",
          "CHEMBL1778439",
          "CHEMBL1795062",
          "CHEMBL179801",
          "CHEMBL18",
          "CHEMBL181886",
          "CHEMBL1822699",
          "CHEMBL1822700",
          "CHEMBL1822701",
          "CHEMBL1822702",
          "CHEMBL182455",
          "CHEMBL182856",
          "CHEMBL182928",
          "CHEMBL185198",
          "CHEMBL185537",
          "CHEMBL186043",
          "CHEMBL186422",
          "CHEMBL189526",
          "CHEMBL19",
          "CHEMBL190447",
          "CHEMBL191045",
          "CHEMBL191528",
          "CHEMBL19429",
          "CHEMBL1946085",
          "CHEMBL1946086",
          "CHEMBL1946087",
          "CHEMBL1946088",
          "CHEMBL1946177",
          "CHEMBL1946178",
          "CHEMBL1946179",
          "CHEMBL1946180",
          "CHEMBL1946181",
          "CHEMBL1946182",
          "CHEMBL1946183",
          "CHEMBL1946184",
          "CHEMBL1955873",
          "CHEMBL1956578",
          "CHEMBL1956579",
          "CHEMBL19612",
          "CHEMBL20",
          "CHEMBL2016670",
          "CHEMBL2019140",
          "CHEMBL2019143",
          "CHEMBL2019155",
          "CHEMBL2040866",
          "CHEMBL2042368",
          "CHEMBL2042369",
          "CHEMBL2042370",
          "CHEMBL2042371",
          "CHEMBL206452",
          "CHEMBL2092896",
          "CHEMBL2092897",
          "CHEMBL21",
          "CHEMBL2111218",
          "CHEMBL2112274",
          "CHEMBL2112275",
          "CHEMBL2112276",
          "CHEMBL213348",
          "CHEMBL21485",
          "CHEMBL2179304",
          "CHEMBL2179305",
          "CHEMBL2179306",
          "CHEMBL2179307",
          "CHEMBL2179308",
          "CHEMBL218490",
          "CHEMBL220491",
          "CHEMBL220492",
          "CHEMBL23194",
          "CHEMBL232233",
          "CHEMBL2323134",
          "CHEMBL2323135",
          "CHEMBL2323136",
          "CHEMBL2323137",
          "CHEMBL2323138",
          "CHEMBL2323139",
          "CHEMBL2323140",
          "CHEMBL232616",
          "CHEMBL232617",
          "CHEMBL232816",
          "CHEMBL233019",
          "CHEMBL24261",
          "CHEMBL25101",
          "CHEMBL251680",
          "CHEMBL253691",
          "CHEMBL255863",
          "CHEMBL262389",
          "CHEMBL262628",
          "CHEMBL265674",
          "CHEMBL266026",
          "CHEMBL266240",
          "CHEMBL268177",
          "CHEMBL269628",
          "CHEMBL27601",
          "CHEMBL278024",
          "CHEMBL280998",
          "CHEMBL283695",
          "CHEMBL284398",
          "CHEMBL284617",
          "CHEMBL284694",
          "CHEMBL284831",
          "CHEMBL285516",
          "CHEMBL286297",
          "CHEMBL286449",
          "CHEMBL286549",
          "CHEMBL286586",
          "CHEMBL286738",
          "CHEMBL286862",
          "CHEMBL287117",
          "CHEMBL287145",
          "CHEMBL287316",
          "CHEMBL288114",
          "CHEMBL289672",
          "CHEMBL289888",
          "CHEMBL290348",
          "CHEMBL30168",
          "CHEMBL303004",
          "CHEMBL32096",
          "CHEMBL32160",
          "CHEMBL32208",
          "CHEMBL32606",
          "CHEMBL32732",
          "CHEMBL32749",
          "CHEMBL32836",
          "CHEMBL32982",
          "CHEMBL34317",
          "CHEMBL346691",
          "CHEMBL34768",
          "CHEMBL34852",
          "CHEMBL34974",
          "CHEMBL35",
          "CHEMBL35043",
          "CHEMBL35118",
          "CHEMBL352535",
          "CHEMBL35338",
          "CHEMBL35385",
          "CHEMBL353861",
          "CHEMBL355001",
          "CHEMBL35528",
          "CHEMBL359504",
          "CHEMBL363100",
          "CHEMBL364571",
          "CHEMBL36525",
          "CHEMBL368444",
          "CHEMBL369105",
          "CHEMBL374829",
          "CHEMBL37537",
          "CHEMBL390035",
          "CHEMBL395734",
          "CHEMBL395981",
          "CHEMBL406",
          "CHEMBL408856",
          "CHEMBL408857",
          "CHEMBL415466",
          "CHEMBL416410",
          "CHEMBL418",
          "CHEMBL419",
          "CHEMBL424",
          "CHEMBL432083",
          "CHEMBL433921",
          "CHEMBL441343",
          "CHEMBL443769",
          "CHEMBL449527",
          "CHEMBL451538",
          "CHEMBL455271",
          "CHEMBL459356",
          "CHEMBL464987",
          "CHEMBL471245",
          "CHEMBL475775",
          "CHEMBL475776",
          "CHEMBL476937",
          "CHEMBL477748",
          "CHEMBL482149",
          "CHEMBL482150",
          "CHEMBL490356",
          "CHEMBL49732",
          "CHEMBL499560",
          "CHEMBL50",
          "CHEMBL500977",
          "CHEMBL504802",
          "CHEMBL506166",
          "CHEMBL509986",
          "CHEMBL52564",
          "CHEMBL537",
          "CHEMBL550572",
          "CHEMBL560175",
          "CHEMBL567139",
          "CHEMBL567544",
          "CHEMBL568173",
          "CHEMBL568348",
          "CHEMBL568385",
          "CHEMBL568417",
          "CHEMBL568854",
          "CHEMBL570894",
          "CHEMBL571337",
          "CHEMBL571514",
          "CHEMBL571519",
          "CHEMBL571738",
          "CHEMBL572366",
          "CHEMBL577123",
          "CHEMBL578167",
          "CHEMBL58323",
          "CHEMBL584939",
          "CHEMBL585756",
          "CHEMBL593037",
          "CHEMBL593276",
          "CHEMBL593507",
          "CHEMBL593667",
          "CHEMBL593759",
          "CHEMBL593972",
          "CHEMBL594224",
          "CHEMBL594918",
          "CHEMBL595861",
          "CHEMBL596060",
          "CHEMBL596276",
          "CHEMBL596277",
          "CHEMBL607813",
          "CHEMBL607823",
          "CHEMBL607824",
          "CHEMBL608978",
          "CHEMBL609",
          "CHEMBL610454",
          "CHEMBL610455",
          "CHEMBL611502",
          "CHEMBL611504",
          "CHEMBL6246",
          "CHEMBL6466",
          "CHEMBL6685",
          "CHEMBL66879",
          "CHEMBL6705",
          "CHEMBL6724",
          "CHEMBL6753",
          "CHEMBL6784",
          "CHEMBL68253",
          "CHEMBL6852",
          "CHEMBL6853",
          "CHEMBL6919",
          "CHEMBL7087",
          "CHEMBL7092",
          "CHEMBL71611",
          "CHEMBL7204",
          "CHEMBL750",
          "CHEMBL83294",
          "CHEMBL865",
          "CHEMBL926",
          "CHEMBL941"
        ],
        "number_of_missing_values": "0"
      },
      {
        "data_type": "numeric",
        "index": "1",
        "is_ignore": "false",
        "is_row_identifier": "false",
        "is_target": "false",
        "name": "RBF",
        "number_of_missing_values": "0"
      },
      {
        "data_type": "numeric",
        "index": "2",
        "is_ignore": "false",
        "is_row_identifier": "false",
        "is_target": "false",
        "name": "SpMax8_Bh.s.",
        "number_of_missing_values": "0"
      },
      {
        "data_type": "numeric",
        "index": "3",
        "is_ignore": "false",
        "is_row_identifier": "false",
        "is_target": "false",
        "name": "SpMax7_Bh.s.",
        "number_of_missing_values": "0"
      },
      {
        "data_type": "numeric",
        "index": "4",
        "is_ignore": "false",
        "is_row_identifier": "false",
        "is_target": "false",
        "name": "ATSC4s",
        "number_of_missing_values": "0"
      },
      {
        "data_type": "numeric",
        "index": "5",
        "is_ignore": "false",
        "is_row_identifier": "false",
        "is_target": "false",
        "name": "SpMax6_Bh.s.",
        "number_of_missing_values": "0"
      },
      {
        "data_type": "numeric",
        "index": "6",
        "is_ignore": "false",
        "is_row_identifier": "false",
        "is_target": "false",
        "name": "SpMax2_Bh.s.",
        "number_of_missing_values": "0"
      },
      {
        "data_type": "numeric",
        "index": "7",
        "is_ignore": "false",
        "is_row_identifier": "false",
        "is_target": "false",
        "name": "S3K",
        "number_of_missing_values": "0"
      },
      {
        "data_type": "numeric",
        "index": "8",
        "is_ignore": "false",
        "is_row_identifier": "false",
        "is_target": "false",
        "name": "ATSC3s",
        "number_of_missing_values": "0"
      },
      {
        "data_type": "numeric",
        "index": "9",
        "is_ignore": "false",
        "is_row_identifier": "false",
        "is_target": "false",
        "name": "ZM1Kup",
        "number_of_missing_values": "0"
      },
      {
        "data_type": "numeric",
        "index": "10",
        "is_ignore": "false",
        "is_row_identifier": "false",
        "is_target": "false",
        "name": "nHet",
        "number_of_missing_values": "0"
      },
      {
        "data_type": "numeric",
        "index": "11",
        "is_ignore": "false",
        "is_row_identifier": "false",
        "is_target": "false",
        "name": "ATSC2s",
        "number_of_missing_values": "0"
      },
      {
        "data_type": "numeric",
        "index": "12",
        "is_ignore": "false",
        "is_row_identifier": "false",
        "is_target": "false",
        "name": "Eig01_AEA.bo.",
        "number_of_missing_values": "0"
      },
      {
        "data_type": "numeric",
        "index": "13",
        "is_ignore": "false",
        "is_row_identifier": "false",
        "is_target": "false",
        "name": "SpMax_AEA.bo.",
        "number_of_missing_values": "0"
      },
      {
        "data_type": "numeric",
        "index": "14",
        "is_ignore": "false",
        "is_row_identifier": "false",
        "is_target": "false",
        "name": "SpMax5_Bh.s.",
        "number_of_missing_values": "0"
      },
      {
        "data_type": "numeric",
        "index": "15",
        "is_ignore": "false",
        "is_row_identifier": "false",
        "is_target": "false",
        "name": "DLS_cons",
        "number_of_missing_values": "0"
      },
      {
        "data_type": "numeric",
        "index": "16",
        "is_ignore": "false",
        "is_row_identifier": "false",
        "is_target": "false",
        "name": "RBN",
        "number_of_missing_values": "0"
      },
      {
        "data_type": "numeric",
        "index": "17",
        "is_ignore": "false",
        "is_row_identifier": "false",
        "is_target": "false",
        "name": "NssCH2",
        "number_of_missing_values": "0"
      },
      {
        "data_type": "numeric",
        "index": "18",
        "is_ignore": "false",
        "is_row_identifier": "false",
        "is_target": "false",
        "name": "ZM1V",
        "number_of_missing_values": "0"
      },
      {
        "data_type": "numeric",
        "index": "19",
        "is_ignore": "false",
        "is_row_identifier": "false",
        "is_target": "false",
        "name": "ZM1MulPer",
        "number_of_missing_values": "0"
      },
      {
        "data_type": "numeric",
        "index": "20",
        "is_ignore": "false",
        "is_row_identifier": "false",
        "is_target": "false",
        "name": "N.",
        "number_of_missing_values": "0"
      },
      {
        "data_type": "numeric",
        "index": "21",
        "is_ignore": "false",
        "is_row_identifier": "false",
        "is_target": "false",
        "name": "CATS2D_03_PL",
        "number_of_missing_values": "0"
      },
      {
        "data_type": "numeric",
        "index": "22",
        "is_ignore": "false",
        "is_row_identifier": "false",
        "is_target": "false",
        "name": "Psi_i_s",
        "number_of_missing_values": "0"
      },
      {
        "data_type": "numeric",
        "index": "23",
        "is_ignore": "false",
        "is_row_identifier": "false",
        "is_target": "false",
        "name": "CATS2D_03_DA",
        "number_of_missing_values": "0"
      },
      {
        "data_type": "numeric",
        "index": "24",
        "is_ignore": "false",
        "is_row_identifier": "false",
        "is_target": "false",
        "name": "HVcpx",
        "number_of_missing_values": "0"
      },
      {
        "data_type": "numeric",
        "index": "25",
        "is_ignore": "false",
        "is_row_identifier": "false",
        "is_target": "false",
        "name": "SsNH2",
        "number_of_missing_values": "0"
      },
      {
        "data_type": "numeric",
        "index": "26",
        "is_ignore": "false",
        "is_row_identifier": "false",
        "is_target": "false",
        "name": "DLS_07",
        "number_of_missing_values": "0"
      },
      {
        "data_type": "numeric",
        "index": "27",
        "is_ignore": "false",
        "is_row_identifier": "false",
        "is_target": "false",
        "name": "CATS2D_09_AA",
        "number_of_missing_values": "0"
      },
      {
        "data_type": "numeric",
        "index": "28",
        "is_ignore": "false",
        "is_row_identifier": "false",
        "is_target": "false",
        "name": "nDB",
        "number_of_missing_values": "0"
      },
      {
        "data_type": "numeric",
        "index": "29",
        "is_ignore": "false",
        "is_row_identifier": "false",
        "is_target": "false",
        "name": "Eig05_EA.dm.",
        "number_of_missing_values": "0"
      },
      {
        "data_type": "numeric",
        "index": "30",
        "is_ignore": "false",
        "is_row_identifier": "false",
        "is_target": "false",
        "name": "Eig06_AEA.dm.",
        "number_of_missing_values": "0"
      },
      {
        "data_type": "numeric",
        "index": "31",
        "is_ignore": "false",
        "is_row_identifier": "false",
        "is_target": "false",
        "name": "ATSC7s",
        "number_of_missing_values": "0"
      },
      {
        "data_type": "numeric",
        "index": "32",
        "is_ignore": "false",
        "is_row_identifier": "false",
        "is_target": "false",
        "name": "Eig01_EA.bo.",
        "number_of_missing_values": "0"
      },
      {
        "data_type": "numeric",
        "index": "33",
        "is_ignore": "false",
        "is_row_identifier": "false",
        "is_target": "false",
        "name": "SM11_AEA.ri.",
        "number_of_missing_values": "0"
      },
      {
        "data_type": "numeric",
        "index": "34",
        "is_ignore": "false",
        "is_row_identifier": "false",
        "is_target": "false",
        "name": "SpMax_EA.bo.",
        "number_of_missing_values": "0"
      },
      {
        "data_type": "numeric",
        "index": "35",
        "is_ignore": "false",
        "is_row_identifier": "false",
        "is_target": "false",
        "name": "IC1",
        "number_of_missing_values": "0"
      },
      {
        "data_type": "numeric",
        "index": "36",
        "is_ignore": "false",
        "is_row_identifier": "false",
        "is_target": "false",
        "name": "Eig10_AEA.dm.",
        "number_of_missing_values": "0"
      },
      {
        "data_type": "numeric",
        "index": "37",
        "is_ignore": "false",
        "is_row_identifier": "false",
        "is_target": "false",
        "name": "ATS3s",
        "number_of_missing_values": "0"
      },
      {
        "data_type": "numeric",
        "index": "38",
        "is_ignore": "false",
        "is_row_identifier": "false",
        "is_target": "false",
        "name": "PHI",
        "number_of_missing_values": "0"
      },
      {
        "data_type": "numeric",
        "index": "39",
        "is_ignore": "false",
        "is_row_identifier": "false",
        "is_target": "false",
        "name": "C.006",
        "number_of_missing_values": "0"
      },
      {
        "data_type": "numeric",
        "index": "40",
        "is_ignore": "false",
        "is_row_identifier": "false",
        "is_target": "false",
        "name": "nHAcc",
        "number_of_missing_values": "0"
      },
      {
        "data_type": "numeric",
        "index": "41",
        "is_ignore": "false",
        "is_row_identifier": "false",
        "is_target": "false",
        "name": "P_VSA_p_2",
        "number_of_missing_values": "0"
      },
      {
        "data_type": "numeric",
        "index": "42",
        "is_ignore": "false",
        "is_row_identifier": "false",
        "is_target": "false",
        "name": "P_VSA_v_2",
        "number_of_missing_values": "0"
      },
      {
        "data_type": "numeric",
        "index": "43",
        "is_ignore": "false",
        "is_row_identifier": "false",
        "is_target": "false",
        "name": "S2K",
        "number_of_missing_values": "0"
      },
      {
        "data_type": "numeric",
        "index": "44",
        "is_ignore": "false",
        "is_row_identifier": "false",
        "is_target": "false",
        "name": "SAacc",
        "number_of_missing_values": "0"
      },
      {
        "data_type": "numeric",
        "index": "45",
        "is_ignore": "false",
        "is_row_identifier": "false",
        "is_target": "false",
        "name": "SpDiam_AEA.dm.",
        "number_of_missing_values": "0"
      },
      {
        "data_type": "numeric",
        "index": "46",
        "is_ignore": "false",
        "is_row_identifier": "false",
        "is_target": "false",
        "name": "AECC",
        "number_of_missing_values": "0"
      },
      {
        "data_type": "numeric",
        "index": "47",
        "is_ignore": "false",
        "is_row_identifier": "false",
        "is_target": "false",
        "name": "IDE",
        "number_of_missing_values": "0"
      },
      {
        "data_type": "numeric",
        "index": "48",
        "is_ignore": "false",
        "is_row_identifier": "false",
        "is_target": "false",
        "name": "MSD",
        "number_of_missing_values": "0"
      },
      {
        "data_type": "numeric",
        "index": "49",
        "is_ignore": "false",
        "is_row_identifier": "false",
        "is_target": "false",
        "name": "P_VSA_LogP_2",
        "number_of_missing_values": "0"
      },
      {
        "data_type": "numeric",
        "index": "50",
        "is_ignore": "false",
        "is_row_identifier": "false",
        "is_target": "false",
        "name": "TIE",
        "number_of_missing_values": "0"
      },
      {
        "data_type": "numeric",
        "index": "51",
        "is_ignore": "false",
        "is_row_identifier": "false",
        "is_target": "false",
        "name": "SpMax4_Bh.s.",
        "number_of_missing_values": "0"
      },
      {
        "data_type": "numeric",
        "index": "52",
        "is_ignore": "false",
        "is_row_identifier": "false",
        "is_target": "false",
        "name": "SdssC",
        "number_of_missing_values": "0"
      },
      {
        "data_type": "numeric",
        "index": "53",
        "is_ignore": "false",
        "is_row_identifier": "false",
        "is_target": "false",
        "name": "Eig03_AEA.dm.",
        "number_of_missing_values": "0"
      },
      {
        "data_type": "numeric",
        "index": "54",
        "is_ignore": "false",
        "is_row_identifier": "false",
        "is_target": "false",
        "name": "Eig07_EA.dm.",
        "number_of_missing_values": "0"
      },
      {
        "data_type": "numeric",
        "index": "55",
        "is_ignore": "false",
        "is_row_identifier": "false",
        "is_target": "false",
        "name": "ATSC6s",
        "number_of_missing_values": "0"
      },
      {
        "data_type": "numeric",
        "index": "56",
        "is_ignore": "false",
        "is_row_identifier": "false",
        "is_target": "false",
        "name": "SddssS",
        "number_of_missing_values": "0"
      },
      {
        "data_type": "numeric",
        "index": "57",
        "is_ignore": "false",
        "is_row_identifier": "false",
        "is_target": "false",
        "name": "SpMax3_Bh.i.",
        "number_of_missing_values": "0"
      },
      {
        "data_type": "numeric",
        "index": "58",
        "is_ignore": "false",
        "is_row_identifier": "false",
        "is_target": "false",
        "name": "ZM1Per",
        "number_of_missing_values": "0"
      },
      {
        "data_type": "numeric",
        "index": "59",
        "is_ignore": "false",
        "is_row_identifier": "false",
        "is_target": "false",
        "name": "N.068",
        "number_of_missing_values": "0"
      },
      {
        "data_type": "numeric",
        "index": "60",
        "is_ignore": "false",
        "is_row_identifier": "false",
        "is_target": "false",
        "name": "nRNR2",
        "number_of_missing_values": "0"
      },
      {
        "data_type": "numeric",
        "index": "61",
        "is_ignore": "false",
        "is_row_identifier": "false",
        "is_target": "false",
        "name": "Eig09_AEA.dm.",
        "number_of_missing_values": "0"
      },
      {
        "data_type": "numeric",
        "index": "62",
        "is_ignore": "false",
        "is_row_identifier": "false",
        "is_target": "false",
        "name": "BAC",
        "number_of_missing_values": "0"
      },
      {
        "data_type": "numeric",
        "index": "63",
        "is_ignore": "false",
        "is_row_identifier": "false",
        "is_target": "false",
        "name": "C.040",
        "number_of_missing_values": "0"
      },
      {
        "data_type": "numeric",
        "index": "64",
        "is_ignore": "false",
        "is_row_identifier": "false",
        "is_target": "false",
        "name": "CATS2D_03_AA",
        "number_of_missing_values": "0"
      },
      {
        "data_type": "numeric",
        "index": "65",
        "is_ignore": "false",
        "is_row_identifier": "false",
        "is_target": "false",
        "name": "CATS2D_07_NN",
        "number_of_missing_values": "0"
      },
      {
        "data_type": "numeric",
        "index": "66",
        "is_ignore": "false",
        "is_row_identifier": "false",
        "is_target": "false",
        "name": "CATS2D_08_AN",
        "number_of_missing_values": "0"
      },
      {
        "data_type": "numeric",
        "index": "67",
        "is_ignore": "false",
        "is_row_identifier": "false",
        "is_target": "false",
        "name": "CATS2D_08_DN",
        "number_of_missing_values": "0"
      },
      {
        "data_type": "numeric",
        "index": "68",
        "is_ignore": "false",
        "is_row_identifier": "false",
        "is_target": "false",
        "name": "CATS2D_09_DA",
        "number_of_missing_values": "0"
      },
      {
        "data_type": "numeric",
        "index": "69",
        "is_ignore": "false",
        "is_row_identifier": "false",
        "is_target": "true",
        "name": "pXC50",
        "number_of_missing_values": "0"
      }
    ]
  }
}