{
  "data_features": {
    "feature": [
      {
        "data_type": "nominal",
        "index": "0",
        "is_ignore": "false",
        "is_row_identifier": "true",
        "is_target": "false",
        "name": "molecule_id",
        "nominal_value": [
          "CHEMBL1008",
          "CHEMBL114272",
          "CHEMBL115145",
          "CHEMBL1161809",
          "CHEMBL1161810",
          "CHEMBL1161811",
          "CHEMBL1161812",
          "CHEMBL1161813",
          "CHEMBL1161814",
          "CHEMBL1163029",
          "CHEMBL116569",
          "CHEMBL116847",
          "CHEMBL118009",
          "CHEMBL1255962",
          "CHEMBL1255963",
          "CHEMBL1255964",
          "CHEMBL1255965",
          "CHEMBL1269054",
          "CHEMBL1269886",
          "CHEMBL1269887",
          "CHEMBL1269993",
          "CHEMBL1269994",
          "CHEMBL1270102",
          "CHEMBL1270103",
          "CHEMBL1270210",
          "CHEMBL1270211",
          "CHEMBL1270304",
          "CHEMBL1270305",
          "CHEMBL1270403",
          "CHEMBL1270404",
          "CHEMBL1270496",
          "CHEMBL1270497",
          "CHEMBL1270498",
          "CHEMBL1270598",
          "CHEMBL1270599",
          "CHEMBL1270697",
          "CHEMBL1270698",
          "CHEMBL1270801",
          "CHEMBL1270802",
          "CHEMBL1270904",
          "CHEMBL1270905",
          "CHEMBL1271003",
          "CHEMBL1271004",
          "CHEMBL1271312",
          "CHEMBL1271419",
          "CHEMBL1271420",
          "CHEMBL164837",
          "CHEMBL167448",
          "CHEMBL1760004",
          "CHEMBL1760315",
          "CHEMBL1760316",
          "CHEMBL1760317",
          "CHEMBL1760318",
          "CHEMBL1760319",
          "CHEMBL1760320",
          "CHEMBL1760321",
          "CHEMBL1760322",
          "CHEMBL1760323",
          "CHEMBL1760324",
          "CHEMBL1760325",
          "CHEMBL1760326",
          "CHEMBL1760327",
          "CHEMBL1760328",
          "CHEMBL1760329",
          "CHEMBL1760330",
          "CHEMBL1760446",
          "CHEMBL1760447",
          "CHEMBL1760448",
          "CHEMBL1760449",
          "CHEMBL1760450",
          "CHEMBL1760451",
          "CHEMBL1760452",
          "CHEMBL1760453",
          "CHEMBL1760454",
          "CHEMBL1760455",
          "CHEMBL1760456",
          "CHEMBL1760457",
          "CHEMBL1760458",
          "CHEMBL1760459",
          "CHEMBL1760460",
          "CHEMBL1760461",
          "CHEMBL1933865",
          "CHEMBL1933866",
          "CHEMBL1933867",
          "CHEMBL1933868",
          "CHEMBL1933869",
          "CHEMBL1933870",
          "CHEMBL1933871",
          "CHEMBL1933872",
          "CHEMBL1933873",
          "CHEMBL1933874",
          "CHEMBL1933875",
          "CHEMBL1933876",
          "CHEMBL1933877",
          "CHEMBL1933878",
          "CHEMBL1933880",
          "CHEMBL1933881",
          "CHEMBL1933882",
          "CHEMBL1933883",
          "CHEMBL1933884",
          "CHEMBL1933885",
          "CHEMBL1933886",
          "CHEMBL1933887",
          "CHEMBL1933889",
          "CHEMBL197764",
          "CHEMBL197810",
          "CHEMBL198289",
          "CHEMBL199390",
          "CHEMBL199465",
          "CHEMBL199584",
          "CHEMBL199659",
          "CHEMBL199772",
          "CHEMBL199941",
          "CHEMBL200013",
          "CHEMBL200022",
          "CHEMBL200192",
          "CHEMBL200222",
          "CHEMBL200384",
          "CHEMBL200421",
          "CHEMBL200605",
          "CHEMBL200716",
          "CHEMBL200850",
          "CHEMBL201020",
          "CHEMBL2010824",
          "CHEMBL2012750",
          "CHEMBL2012751",
          "CHEMBL2012752",
          "CHEMBL2012753",
          "CHEMBL2012832",
          "CHEMBL2012833",
          "CHEMBL2012834",
          "CHEMBL2012835",
          "CHEMBL2012836",
          "CHEMBL2012837",
          "CHEMBL2012838",
          "CHEMBL201404",
          "CHEMBL201413",
          "CHEMBL201564",
          "CHEMBL201620",
          "CHEMBL201674",
          "CHEMBL201675",
          "CHEMBL201677",
          "CHEMBL201868",
          "CHEMBL201967",
          "CHEMBL201968",
          "CHEMBL202104",
          "CHEMBL202393",
          "CHEMBL202416",
          "CHEMBL202453",
          "CHEMBL202483",
          "CHEMBL202508",
          "CHEMBL202623",
          "CHEMBL203163",
          "CHEMBL203460",
          "CHEMBL203510",
          "CHEMBL203538",
          "CHEMBL203539",
          "CHEMBL203703",
          "CHEMBL203745",
          "CHEMBL203756",
          "CHEMBL203848",
          "CHEMBL203980",
          "CHEMBL204070",
          "CHEMBL204073",
          "CHEMBL204291",
          "CHEMBL204316",
          "CHEMBL204593",
          "CHEMBL204647",
          "CHEMBL204699",
          "CHEMBL204806",
          "CHEMBL204807",
          "CHEMBL205203",
          "CHEMBL205548",
          "CHEMBL206323",
          "CHEMBL206411",
          "CHEMBL206437",
          "CHEMBL2088987",
          "CHEMBL2088991",
          "CHEMBL2088995",
          "CHEMBL2088996",
          "CHEMBL2088997",
          "CHEMBL209974",
          "CHEMBL211933",
          "CHEMBL212406",
          "CHEMBL212723",
          "CHEMBL212852",
          "CHEMBL213144",
          "CHEMBL213158",
          "CHEMBL213275",
          "CHEMBL213432",
          "CHEMBL213533",
          "CHEMBL213534",
          "CHEMBL213575",
          "CHEMBL214303",
          "CHEMBL214612",
          "CHEMBL214624",
          "CHEMBL214625",
          "CHEMBL214725",
          "CHEMBL215046",
          "CHEMBL215074",
          "CHEMBL215269",
          "CHEMBL215448",
          "CHEMBL215449",
          "CHEMBL215553",
          "CHEMBL215644",
          "CHEMBL215715",
          "CHEMBL215765",
          "CHEMBL215771",
          "CHEMBL215785",
          "CHEMBL215832",
          "CHEMBL215942",
          "CHEMBL215949",
          "CHEMBL216012",
          "CHEMBL216648",
          "CHEMBL250711",
          "CHEMBL251733",
          "CHEMBL251734",
          "CHEMBL271701",
          "CHEMBL276126",
          "CHEMBL322333",
          "CHEMBL354449",
          "CHEMBL371478",
          "CHEMBL372792",
          "CHEMBL373276",
          "CHEMBL378362",
          "CHEMBL378575",
          "CHEMBL378860",
          "CHEMBL379315",
          "CHEMBL379966",
          "CHEMBL380489",
          "CHEMBL380714",
          "CHEMBL380982",
          "CHEMBL381215",
          "CHEMBL381845",
          "CHEMBL382396",
          "CHEMBL382675",
          "CHEMBL382908",
          "CHEMBL383156",
          "CHEMBL383943",
          "CHEMBL384077",
          "CHEMBL384761",
          "CHEMBL385155",
          "CHEMBL385255",
          "CHEMBL385400",
          "CHEMBL385684",
          "CHEMBL385899",
          "CHEMBL386313",
          "CHEMBL386364",
          "CHEMBL386614",
          "CHEMBL386663",
          "CHEMBL399925",
          "CHEMBL403034",
          "CHEMBL410458",
          "CHEMBL414858",
          "CHEMBL426112",
          "CHEMBL427195",
          "CHEMBL427409",
          "CHEMBL432882",
          "CHEMBL437320",
          "CHEMBL437504",
          "CHEMBL438810",
          "CHEMBL438832",
          "CHEMBL439328",
          "CHEMBL439545",
          "CHEMBL441372",
          "CHEMBL446705",
          "CHEMBL449118",
          "CHEMBL466960",
          "CHEMBL514138",
          "CHEMBL538449",
          "CHEMBL538881",
          "CHEMBL540225",
          "CHEMBL541197",
          "CHEMBL541200",
          "CHEMBL549762",
          "CHEMBL549884",
          "CHEMBL550029",
          "CHEMBL550230",
          "CHEMBL550437",
          "CHEMBL550900",
          "CHEMBL551041",
          "CHEMBL551098",
          "CHEMBL551099",
          "CHEMBL551101",
          "CHEMBL551166",
          "CHEMBL551171",
          "CHEMBL551180",
          "CHEMBL551299",
          "CHEMBL551357",
          "CHEMBL551358",
          "CHEMBL551367",
          "CHEMBL551444",
          "CHEMBL551557",
          "CHEMBL551580",
          "CHEMBL552047",
          "CHEMBL552103",
          "CHEMBL552104",
          "CHEMBL552305",
          "CHEMBL552306",
          "CHEMBL552307",
          "CHEMBL552451",
          "CHEMBL552990",
          "CHEMBL554915",
          "CHEMBL554928",
          "CHEMBL555957",
          "CHEMBL556471",
          "CHEMBL556885",
          "CHEMBL556886",
          "CHEMBL556889",
          "CHEMBL557082",
          "CHEMBL557083",
          "CHEMBL557695",
          "CHEMBL558099",
          "CHEMBL558100",
          "CHEMBL558685",
          "CHEMBL559082",
          "CHEMBL559516",
          "CHEMBL559649",
          "CHEMBL559772",
          "CHEMBL559849",
          "CHEMBL559850",
          "CHEMBL559910",
          "CHEMBL559911",
          "CHEMBL560164",
          "CHEMBL560216",
          "CHEMBL560217",
          "CHEMBL560221",
          "CHEMBL560223",
          "CHEMBL560224",
          "CHEMBL560304",
          "CHEMBL560305",
          "CHEMBL560421",
          "CHEMBL560426",
          "CHEMBL560618",
          "CHEMBL560621",
          "CHEMBL560843",
          "CHEMBL560965",
          "CHEMBL560966",
          "CHEMBL560968",
          "CHEMBL560969",
          "CHEMBL561046",
          "CHEMBL561105",
          "CHEMBL561169",
          "CHEMBL561305",
          "CHEMBL561365",
          "CHEMBL561366",
          "CHEMBL561506",
          "CHEMBL561772",
          "CHEMBL562245",
          "CHEMBL562309",
          "CHEMBL562418",
          "CHEMBL562420",
          "CHEMBL562423",
          "CHEMBL562428",
          "CHEMBL562564",
          "CHEMBL562582",
          "CHEMBL562599",
          "CHEMBL562697",
          "CHEMBL562700",
          "CHEMBL562778",
          "CHEMBL562914",
          "CHEMBL562992",
          "CHEMBL563193",
          "CHEMBL563358",
          "CHEMBL563486",
          "CHEMBL563556",
          "CHEMBL563584",
          "CHEMBL563720",
          "CHEMBL563723",
          "CHEMBL563737",
          "CHEMBL563808",
          "CHEMBL563882",
          "CHEMBL563891",
          "CHEMBL563947",
          "CHEMBL564053",
          "CHEMBL564208",
          "CHEMBL564218",
          "CHEMBL564281",
          "CHEMBL564557",
          "CHEMBL564574",
          "CHEMBL564671",
          "CHEMBL564771",
          "CHEMBL564869",
          "CHEMBL564951",
          "CHEMBL564956",
          "CHEMBL564957",
          "CHEMBL565138",
          "CHEMBL569369",
          "CHEMBL569370",
          "CHEMBL569602",
          "CHEMBL570079",
          "CHEMBL597398",
          "CHEMBL597587",
          "CHEMBL597610",
          "CHEMBL597791",
          "CHEMBL597792",
          "CHEMBL597802",
          "CHEMBL598001",
          "CHEMBL598002",
          "CHEMBL598230",
          "CHEMBL598433",
          "CHEMBL598622",
          "CHEMBL598634",
          "CHEMBL599053",
          "CHEMBL599111",
          "CHEMBL599436",
          "CHEMBL599518",
          "CHEMBL599856",
          "CHEMBL603247",
          "CHEMBL603251",
          "CHEMBL603312",
          "CHEMBL603464",
          "CHEMBL604103",
          "CHEMBL604498",
          "CHEMBL605845",
          "CHEMBL606405",
          "CHEMBL609039",
          "CHEMBL611079",
          "CHEMBL633",
          "CHEMBL7463"
        ],
        "number_of_missing_values": "0"
      },
      {
        "data_type": "numeric",
        "index": "1",
        "is_ignore": "false",
        "is_row_identifier": "false",
        "is_target": "false",
        "name": "FCFP4_1024b89",
        "number_of_missing_values": "0"
      },
      {
        "data_type": "numeric",
        "index": "2",
        "is_ignore": "false",
        "is_row_identifier": "false",
        "is_target": "false",
        "name": "FCFP4_1024b645",
        "number_of_missing_values": "0"
      },
      {
        "data_type": "numeric",
        "index": "3",
        "is_ignore": "false",
        "is_row_identifier": "false",
        "is_target": "false",
        "name": "FCFP4_1024b380",
        "number_of_missing_values": "0"
      },
      {
        "data_type": "numeric",
        "index": "4",
        "is_ignore": "false",
        "is_row_identifier": "false",
        "is_target": "false",
        "name": "FCFP4_1024b122",
        "number_of_missing_values": "0"
      },
      {
        "data_type": "numeric",
        "index": "5",
        "is_ignore": "false",
        "is_row_identifier": "false",
        "is_target": "false",
        "name": "FCFP4_1024b9",
        "number_of_missing_values": "0"
      },
      {
        "data_type": "numeric",
        "index": "6",
        "is_ignore": "false",
        "is_row_identifier": "false",
        "is_target": "false",
        "name": "FCFP4_1024b305",
        "number_of_missing_values": "0"
      },
      {
        "data_type": "numeric",
        "index": "7",
        "is_ignore": "false",
        "is_row_identifier": "false",
        "is_target": "false",
        "name": "FCFP4_1024b152",
        "number_of_missing_values": "0"
      },
      {
        "data_type": "numeric",
        "index": "8",
        "is_ignore": "false",
        "is_row_identifier": "false",
        "is_target": "false",
        "name": "FCFP4_1024b183",
        "number_of_missing_values": "0"
      },
      {
        "data_type": "numeric",
        "index": "9",
        "is_ignore": "false",
        "is_row_identifier": "false",
        "is_target": "false",
        "name": "FCFP4_1024b574",
        "number_of_missing_values": "0"
      },
      {
        "data_type": "numeric",
        "index": "10",
        "is_ignore": "false",
        "is_row_identifier": "false",
        "is_target": "false",
        "name": "FCFP4_1024b794",
        "number_of_missing_values": "0"
      },
      {
        "data_type": "numeric",
        "index": "11",
        "is_ignore": "false",
        "is_row_identifier": "false",
        "is_target": "false",
        "name": "FCFP4_1024b8",
        "number_of_missing_values": "0"
      },
      {
        "data_type": "numeric",
        "index": "12",
        "is_ignore": "false",
        "is_row_identifier": "false",
        "is_target": "false",
        "name": "FCFP4_1024b925",
        "number_of_missing_values": "0"
      },
      {
        "data_type": "numeric",
        "index": "13",
        "is_ignore": "false",
        "is_row_identifier": "false",
        "is_target": "false",
        "name": "FCFP4_1024b199",
        "number_of_missing_values": "0"
      },
      {
        "data_type": "numeric",
        "index": "14",
        "is_ignore": "false",
        "is_row_identifier": "false",
        "is_target": "false",
        "name": "FCFP4_1024b521",
        "number_of_missing_values": "0"
      },
      {
        "data_type": "numeric",
        "index": "15",
        "is_ignore": "false",
        "is_row_identifier": "false",
        "is_target": "false",
        "name": "FCFP4_1024b859",
        "number_of_missing_values": "0"
      },
      {
        "data_type": "numeric",
        "index": "16",
        "is_ignore": "false",
        "is_row_identifier": "false",
        "is_target": "false",
        "name": "FCFP4_1024b264",
        "number_of_missing_values": "0"
      },
      {
        "data_type": "numeric",
        "index": "17",
        "is_ignore": "false",
        "is_row_identifier": "false",
        "is_target": "false",
        "name": "FCFP4_1024b817",
        "number_of_missing_values": "0"
      },
      {
        "data_type": "numeric",
        "index": "18",
        "is_ignore": "false",
        "is_row_identifier": "false",
        "is_target": "false",
        "name": "FCFP4_1024b928",
        "number_of_missing_values": "0"
      },
      {
        "data_type": "numeric",
        "index": "19",
        "is_ignore": "false",
        "is_row_identifier": "false",
        "is_target": "false",
        "name": "FCFP4_1024b632",
        "number_of_missing_values": "0"
      },
      {
        "data_type": "numeric",
        "index": "20",
        "is_ignore": "false",
        "is_row_identifier": "false",
        "is_target": "false",
        "name": "FCFP4_1024b139",
        "number_of_missing_values": "0"
      },
      {
        "data_type": "numeric",
        "index": "21",
        "is_ignore": "false",
        "is_row_identifier": "false",
        "is_target": "false",
        "name": "FCFP4_1024b363",
        "number_of_missing_values": "0"
      },
      {
        "data_type": "numeric",
        "index": "22",
        "is_ignore": "false",
        "is_row_identifier": "false",
        "is_target": "false",
        "name": "FCFP4_1024b408",
        "number_of_missing_values": "0"
      },
      {
        "data_type": "numeric",
        "index": "23",
        "is_ignore": "false",
        "is_row_identifier": "false",
        "is_target": "false",
        "name": "FCFP4_1024b57",
        "number_of_missing_values": "0"
      },
      {
        "data_type": "numeric",
        "index": "24",
        "is_ignore": "false",
        "is_row_identifier": "false",
        "is_target": "false",
        "name": "FCFP4_1024b319",
        "number_of_missing_values": "0"
      },
      {
        "data_type": "numeric",
        "index": "25",
        "is_ignore": "false",
        "is_row_identifier": "false",
        "is_target": "false",
        "name": "FCFP4_1024b103",
        "number_of_missing_values": "0"
      },
      {
        "data_type": "numeric",
        "index": "26",
        "is_ignore": "false",
        "is_row_identifier": "false",
        "is_target": "false",
        "name": "FCFP4_1024b472",
        "number_of_missing_values": "0"
      },
      {
        "data_type": "numeric",
        "index": "27",
        "is_ignore": "false",
        "is_row_identifier": "false",
        "is_target": "false",
        "name": "FCFP4_1024b258",
        "number_of_missing_values": "0"
      },
      {
        "data_type": "numeric",
        "index": "28",
        "is_ignore": "false",
        "is_row_identifier": "false",
        "is_target": "false",
        "name": "FCFP4_1024b701",
        "number_of_missing_values": "0"
      },
      {
        "data_type": "numeric",
        "index": "29",
        "is_ignore": "false",
        "is_row_identifier": "false",
        "is_target": "false",
        "name": "FCFP4_1024b855",
        "number_of_missing_values": "0"
      },
      {
        "data_type": "numeric",
        "index": "30",
        "is_ignore": "false",
        "is_row_identifier": "false",
        "is_target": "false",
        "name": "FCFP4_1024b20",
        "number_of_missing_values": "0"
      },
      {
        "data_type": "numeric",
        "index": "31",
        "is_ignore": "false",
        "is_row_identifier": "false",
        "is_target": "false",
        "name": "FCFP4_1024b553",
        "number_of_missing_values": "0"
      },
      {
        "data_type": "numeric",
        "index": "32",
        "is_ignore": "false",
        "is_row_identifier": "false",
        "is_target": "false",
        "name": "FCFP4_1024b610",
        "number_of_missing_values": "0"
      },
      {
        "data_type": "numeric",
        "index": "33",
        "is_ignore": "false",
        "is_row_identifier": "false",
        "is_target": "false",
        "name": "FCFP4_1024b310",
        "number_of_missing_values": "0"
      },
      {
        "data_type": "numeric",
        "index": "34",
        "is_ignore": "false",
        "is_row_identifier": "false",
        "is_target": "false",
        "name": "FCFP4_1024b96",
        "number_of_missing_values": "0"
      },
      {
        "data_type": "numeric",
        "index": "35",
        "is_ignore": "false",
        "is_row_identifier": "false",
        "is_target": "false",
        "name": "FCFP4_1024b974",
        "number_of_missing_values": "0"
      },
      {
        "data_type": "numeric",
        "index": "36",
        "is_ignore": "false",
        "is_row_identifier": "false",
        "is_target": "false",
        "name": "FCFP4_1024b415",
        "number_of_missing_values": "0"
      },
      {
        "data_type": "numeric",
        "index": "37",
        "is_ignore": "false",
        "is_row_identifier": "false",
        "is_target": "false",
        "name": "FCFP4_1024b971",
        "number_of_missing_values": "0"
      },
      {
        "data_type": "numeric",
        "index": "38",
        "is_ignore": "false",
        "is_row_identifier": "false",
        "is_target": "false",
        "name": "FCFP4_1024b900",
        "number_of_missing_values": "0"
      },
      {
        "data_type": "numeric",
        "index": "39",
        "is_ignore": "false",
        "is_row_identifier": "false",
        "is_target": "false",
        "name": "FCFP4_1024b461",
        "number_of_missing_values": "0"
      },
      {
        "data_type": "numeric",
        "index": "40",
        "is_ignore": "false",
        "is_row_identifier": "false",
        "is_target": "false",
        "name": "FCFP4_1024b54",
        "number_of_missing_values": "0"
      },
      {
        "data_type": "numeric",
        "index": "41",
        "is_ignore": "false",
        "is_row_identifier": "false",
        "is_target": "false",
        "name": "FCFP4_1024b387",
        "number_of_missing_values": "0"
      },
      {
        "data_type": "numeric",
        "index": "42",
        "is_ignore": "false",
        "is_row_identifier": "false",
        "is_target": "false",
        "name": "FCFP4_1024b921",
        "number_of_missing_values": "0"
      },
      {
        "data_type": "numeric",
        "index": "43",
        "is_ignore": "false",
        "is_row_identifier": "false",
        "is_target": "false",
        "name": "FCFP4_1024b11",
        "number_of_missing_values": "0"
      },
      {
        "data_type": "numeric",
        "index": "44",
        "is_ignore": "false",
        "is_row_identifier": "false",
        "is_target": "false",
        "name": "FCFP4_1024b150",
        "number_of_missing_values": "0"
      },
      {
        "data_type": "numeric",
        "index": "45",
        "is_ignore": "false",
        "is_row_identifier": "false",
        "is_target": "false",
        "name": "FCFP4_1024b28",
        "number_of_missing_values": "0"
      },
      {
        "data_type": "numeric",
        "index": "46",
        "is_ignore": "false",
        "is_row_identifier": "false",
        "is_target": "false",
        "name": "FCFP4_1024b434",
        "number_of_missing_values": "0"
      },
      {
        "data_type": "numeric",
        "index": "47",
        "is_ignore": "false",
        "is_row_identifier": "false",
        "is_target": "false",
        "name": "FCFP4_1024b123",
        "number_of_missing_values": "0"
      },
      {
        "data_type": "numeric",
        "index": "48",
        "is_ignore": "false",
        "is_row_identifier": "false",
        "is_target": "false",
        "name": "FCFP4_1024b603",
        "number_of_missing_values": "0"
      },
      {
        "data_type": "numeric",
        "index": "49",
        "is_ignore": "false",
        "is_row_identifier": "false",
        "is_target": "false",
        "name": "FCFP4_1024b235",
        "number_of_missing_values": "0"
      },
      {
        "data_type": "numeric",
        "index": "50",
        "is_ignore": "false",
        "is_row_identifier": "false",
        "is_target": "false",
        "name": "FCFP4_1024b44",
        "number_of_missing_values": "0"
      },
      {
        "data_type": "numeric",
        "index": "51",
        "is_ignore": "false",
        "is_row_identifier": "false",
        "is_target": "false",
        "name": "FCFP4_1024b357",
        "number_of_missing_values": "0"
      },
      {
        "data_type": "numeric",
        "index": "52",
        "is_ignore": "false",
        "is_row_identifier": "false",
        "is_target": "false",
        "name": "FCFP4_1024b702",
        "number_of_missing_values": "0"
      },
      {
        "data_type": "numeric",
        "index": "53",
        "is_ignore": "false",
        "is_row_identifier": "false",
        "is_target": "false",
        "name": "FCFP4_1024b351",
        "number_of_missing_values": "0"
      },
      {
        "data_type": "numeric",
        "index": "54",
        "is_ignore": "false",
        "is_row_identifier": "false",
        "is_target": "false",
        "name": "FCFP4_1024b1019",
        "number_of_missing_values": "0"
      },
      {
        "data_type": "numeric",
        "index": "55",
        "is_ignore": "false",
        "is_row_identifier": "false",
        "is_target": "false",
        "name": "FCFP4_1024b100",
        "number_of_missing_values": "0"
      },
      {
        "data_type": "numeric",
        "index": "56",
        "is_ignore": "false",
        "is_row_identifier": "false",
        "is_target": "false",
        "name": "FCFP4_1024b237",
        "number_of_missing_values": "0"
      },
      {
        "data_type": "numeric",
        "index": "57",
        "is_ignore": "false",
        "is_row_identifier": "false",
        "is_target": "false",
        "name": "FCFP4_1024b1011",
        "number_of_missing_values": "0"
      },
      {
        "data_type": "numeric",
        "index": "58",
        "is_ignore": "false",
        "is_row_identifier": "false",
        "is_target": "false",
        "name": "FCFP4_1024b473",
        "number_of_missing_values": "0"
      },
      {
        "data_type": "numeric",
        "index": "59",
        "is_ignore": "false",
        "is_row_identifier": "false",
        "is_target": "false",
        "name": "FCFP4_1024b33",
        "number_of_missing_values": "0"
      },
      {
        "data_type": "numeric",
        "index": "60",
        "is_ignore": "false",
        "is_row_identifier": "false",
        "is_target": "false",
        "name": "FCFP4_1024b649",
        "number_of_missing_values": "0"
      },
      {
        "data_type": "numeric",
        "index": "61",
        "is_ignore": "false",
        "is_row_identifier": "false",
        "is_target": "false",
        "name": "FCFP4_1024b86",
        "number_of_missing_values": "0"
      },
      {
        "data_type": "numeric",
        "index": "62",
        "is_ignore": "false",
        "is_row_identifier": "false",
        "is_target": "false",
        "name": "FCFP4_1024b953",
        "number_of_missing_values": "0"
      },
      {
        "data_type": "numeric",
        "index": "63",
        "is_ignore": "false",
        "is_row_identifier": "false",
        "is_target": "false",
        "name": "FCFP4_1024b409",
        "number_of_missing_values": "0"
      },
      {
        "data_type": "numeric",
        "index": "64",
        "is_ignore": "false",
        "is_row_identifier": "false",
        "is_target": "false",
        "name": "FCFP4_1024b882",
        "number_of_missing_values": "0"
      },
      {
        "data_type": "numeric",
        "index": "65",
        "is_ignore": "false",
        "is_row_identifier": "false",
        "is_target": "false",
        "name": "FCFP4_1024b429",
        "number_of_missing_values": "0"
      },
      {
        "data_type": "numeric",
        "index": "66",
        "is_ignore": "false",
        "is_row_identifier": "false",
        "is_target": "false",
        "name": "FCFP4_1024b135",
        "number_of_missing_values": "0"
      },
      {
        "data_type": "numeric",
        "index": "67",
        "is_ignore": "false",
        "is_row_identifier": "false",
        "is_target": "false",
        "name": "FCFP4_1024b63",
        "number_of_missing_values": "0"
      },
      {
        "data_type": "numeric",
        "index": "68",
        "is_ignore": "false",
        "is_row_identifier": "false",
        "is_target": "false",
        "name": "FCFP4_1024b365",
        "number_of_missing_values": "0"
      },
      {
        "data_type": "numeric",
        "index": "69",
        "is_ignore": "false",
        "is_row_identifier": "false",
        "is_target": "false",
        "name": "FCFP4_1024b95",
        "number_of_missing_values": "0"
      },
      {
        "data_type": "numeric",
        "index": "70",
        "is_ignore": "false",
        "is_row_identifier": "false",
        "is_target": "false",
        "name": "FCFP4_1024b4",
        "number_of_missing_values": "0"
      },
      {
        "data_type": "numeric",
        "index": "71",
        "is_ignore": "false",
        "is_row_identifier": "false",
        "is_target": "false",
        "name": "FCFP4_1024b61",
        "number_of_missing_values": "0"
      },
      {
        "data_type": "numeric",
        "index": "72",
        "is_ignore": "false",
        "is_row_identifier": "false",
        "is_target": "false",
        "name": "FCFP4_1024b685",
        "number_of_missing_values": "0"
      },
      {
        "data_type": "numeric",
        "index": "73",
        "is_ignore": "false",
        "is_row_identifier": "false",
        "is_target": "false",
        "name": "FCFP4_1024b804",
        "number_of_missing_values": "0"
      },
      {
        "data_type": "numeric",
        "index": "74",
        "is_ignore": "false",
        "is_row_identifier": "false",
        "is_target": "false",
        "name": "FCFP4_1024b728",
        "number_of_missing_values": "0"
      },
      {
        "data_type": "numeric",
        "index": "75",
        "is_ignore": "false",
        "is_row_identifier": "false",
        "is_target": "false",
        "name": "FCFP4_1024b78",
        "number_of_missing_values": "0"
      },
      {
        "data_type": "numeric",
        "index": "76",
        "is_ignore": "false",
        "is_row_identifier": "false",
        "is_target": "false",
        "name": "FCFP4_1024b90",
        "number_of_missing_values": "0"
      },
      {
        "data_type": "numeric",
        "index": "77",
        "is_ignore": "false",
        "is_row_identifier": "false",
        "is_target": "false",
        "name": "FCFP4_1024b31",
        "number_of_missing_values": "0"
      },
      {
        "data_type": "numeric",
        "index": "78",
        "is_ignore": "false",
        "is_row_identifier": "false",
        "is_target": "false",
        "name": "FCFP4_1024b612",
        "number_of_missing_values": "0"
      },
      {
        "data_type": "numeric",
        "index": "79",
        "is_ignore": "false",
        "is_row_identifier": "false",
        "is_target": "false",
        "name": "FCFP4_1024b973",
        "number_of_missing_values": "0"
      },
      {
        "data_type": "numeric",
        "index": "80",
        "is_ignore": "false",
        "is_row_identifier": "false",
        "is_target": "false",
        "name": "FCFP4_1024b25",
        "number_of_missing_values": "0"
      },
      {
        "data_type": "numeric",
        "index": "81",
        "is_ignore": "false",
        "is_row_identifier": "false",
        "is_target": "false",
        "name": "FCFP4_1024b947",
        "number_of_missing_values": "0"
      },
      {
        "data_type": "numeric",
        "index": "82",
        "is_ignore": "false",
        "is_row_identifier": "false",
        "is_target": "false",
        "name": "FCFP4_1024b107",
        "number_of_missing_values": "0"
      },
      {
        "data_type": "numeric",
        "index": "83",
        "is_ignore": "false",
        "is_row_identifier": "false",
        "is_target": "false",
        "name": "FCFP4_1024b283",
        "number_of_missing_values": "0"
      },
      {
        "data_type": "numeric",
        "index": "84",
        "is_ignore": "false",
        "is_row_identifier": "false",
        "is_target": "false",
        "name": "FCFP4_1024b43",
        "number_of_missing_values": "0"
      },
      {
        "data_type": "numeric",
        "index": "85",
        "is_ignore": "false",
        "is_row_identifier": "false",
        "is_target": "false",
        "name": "FCFP4_1024b933",
        "number_of_missing_values": "0"
      },
      {
        "data_type": "numeric",
        "index": "86",
        "is_ignore": "false",
        "is_row_identifier": "false",
        "is_target": "false",
        "name": "FCFP4_1024b983",
        "number_of_missing_values": "0"
      },
      {
        "data_type": "numeric",
        "index": "87",
        "is_ignore": "false",
        "is_row_identifier": "false",
        "is_target": "false",
        "name": "FCFP4_1024b714",
        "number_of_missing_values": "0"
      },
      {
        "data_type": "numeric",
        "index": "88",
        "is_ignore": "false",
        "is_row_identifier": "false",
        "is_target": "false",
        "name": "FCFP4_1024b846",
        "number_of_missing_values": "0"
      },
      {
        "data_type": "numeric",
        "index": "89",
        "is_ignore": "false",
        "is_row_identifier": "false",
        "is_target": "false",
        "name": "FCFP4_1024b218",
        "number_of_missing_values": "0"
      },
      {
        "data_type": "numeric",
        "index": "90",
        "is_ignore": "false",
        "is_row_identifier": "false",
        "is_target": "false",
        "name": "FCFP4_1024b459",
        "number_of_missing_values": "0"
      },
      {
        "data_type": "numeric",
        "index": "91",
        "is_ignore": "false",
        "is_row_identifier": "false",
        "is_target": "false",
        "name": "FCFP4_1024b338",
        "number_of_missing_values": "0"
      },
      {
        "data_type": "numeric",
        "index": "92",
        "is_ignore": "false",
        "is_row_identifier": "false",
        "is_target": "false",
        "name": "FCFP4_1024b957",
        "number_of_missing_values": "0"
      },
      {
        "data_type": "numeric",
        "index": "93",
        "is_ignore": "false",
        "is_row_identifier": "false",
        "is_target": "false",
        "name": "FCFP4_1024b91",
        "number_of_missing_values": "0"
      },
      {
        "data_type": "numeric",
        "index": "94",
        "is_ignore": "false",
        "is_row_identifier": "false",
        "is_target": "false",
        "name": "FCFP4_1024b382",
        "number_of_missing_values": "0"
      },
      {
        "data_type": "numeric",
        "index": "95",
        "is_ignore": "false",
        "is_row_identifier": "false",
        "is_target": "false",
        "name": "FCFP4_1024b71",
        "number_of_missing_values": "0"
      },
      {
        "data_type": "numeric",
        "index": "96",
        "is_ignore": "false",
        "is_row_identifier": "false",
        "is_target": "false",
        "name": "FCFP4_1024b451",
        "number_of_missing_values": "0"
      },
      {
        "data_type": "numeric",
        "index": "97",
        "is_ignore": "false",
        "is_row_identifier": "false",
        "is_target": "false",
        "name": "FCFP4_1024b908",
        "number_of_missing_values": "0"
      },
      {
        "data_type": "numeric",
        "index": "98",
        "is_ignore": "false",
        "is_row_identifier": "false",
        "is_target": "false",
        "name": "FCFP4_1024b2",
        "number_of_missing_values": "0"
      },
      {
        "data_type": "numeric",
        "index": "99",
        "is_ignore": "false",
        "is_row_identifier": "false",
        "is_target": "false",
        "name": "FCFP4_1024b655",
        "number_of_missing_values": "0"
      },
      {
        "data_type": "numeric",
        "index": "100",
        "is_ignore": "false",
        "is_row_identifier": "false",
        "is_target": "false",
        "name": "FCFP4_1024b742",
        "number_of_missing_values": "0"
      },
      {
        "data_type": "numeric",
        "index": "101",
        "is_ignore": "false",
        "is_row_identifier": "false",
        "is_target": "false",
        "name": "FCFP4_1024b787",
        "number_of_missing_values": "0"
      },
      {
        "data_type": "numeric",
        "index": "102",
        "is_ignore": "false",
        "is_row_identifier": "false",
        "is_target": "false",
        "name": "FCFP4_1024b1001",
        "number_of_missing_values": "0"
      },
      {
        "data_type": "numeric",
        "index": "103",
        "is_ignore": "false",
        "is_row_identifier": "false",
        "is_target": "true",
        "name": "pXC50",
        "number_of_missing_values": "0"
      }
    ]
  }
}