{
  "data_features": {
    "feature": [
      {
        "data_type": "nominal",
        "index": "0",
        "is_ignore": "false",
        "is_row_identifier": "true",
        "is_target": "false",
        "name": "molecule_id",
        "nominal_value": [
          "CHEMBL108721",
          "CHEMBL116605",
          "CHEMBL116692",
          "CHEMBL116744",
          "CHEMBL116901",
          "CHEMBL117496",
          "CHEMBL117699",
          "CHEMBL1253274",
          "CHEMBL1253292",
          "CHEMBL1253293",
          "CHEMBL1253313",
          "CHEMBL1253341",
          "CHEMBL1253342",
          "CHEMBL1253920",
          "CHEMBL1254103",
          "CHEMBL1254283",
          "CHEMBL1254362",
          "CHEMBL138025",
          "CHEMBL138106",
          "CHEMBL138659",
          "CHEMBL139423",
          "CHEMBL139923",
          "CHEMBL168",
          "CHEMBL169",
          "CHEMBL1773168",
          "CHEMBL1773180",
          "CHEMBL1773181",
          "CHEMBL211369",
          "CHEMBL2316902",
          "CHEMBL2316906",
          "CHEMBL2316907",
          "CHEMBL303333",
          "CHEMBL324232",
          "CHEMBL325029",
          "CHEMBL326115",
          "CHEMBL326829",
          "CHEMBL326830",
          "CHEMBL336435",
          "CHEMBL336908",
          "CHEMBL343979",
          "CHEMBL379000",
          "CHEMBL391533",
          "CHEMBL420456",
          "CHEMBL449613",
          "CHEMBL472400",
          "CHEMBL472401",
          "CHEMBL499413",
          "CHEMBL507502",
          "CHEMBL508831",
          "CHEMBL509443",
          "CHEMBL55243",
          "CHEMBL55799",
          "CHEMBL590043",
          "CHEMBL63738",
          "CHEMBL64917",
          "CHEMBL65097",
          "CHEMBL67303",
          "CHEMBL67740",
          "CHEMBL68125",
          "CHEMBL95255",
          "CHEMBL96952"
        ],
        "number_of_missing_values": "0"
      },
      {
        "data_type": "numeric",
        "index": "1",
        "is_ignore": "false",
        "is_row_identifier": "false",
        "is_target": "false",
        "name": "RBN",
        "number_of_missing_values": "0"
      },
      {
        "data_type": "numeric",
        "index": "2",
        "is_ignore": "false",
        "is_row_identifier": "false",
        "is_target": "false",
        "name": "nHet",
        "number_of_missing_values": "0"
      },
      {
        "data_type": "numeric",
        "index": "3",
        "is_ignore": "false",
        "is_row_identifier": "false",
        "is_target": "true",
        "name": "pXC50",
        "number_of_missing_values": "0"
      }
    ]
  }
}