{
  "data_features": {
    "feature": [
      {
        "data_type": "nominal",
        "index": "0",
        "is_ignore": "false",
        "is_row_identifier": "true",
        "is_target": "false",
        "name": "molecule_id",
        "nominal_value": [
          "CHEMBL1231506",
          "CHEMBL1231507",
          "CHEMBL1232077",
          "CHEMBL129918",
          "CHEMBL179241",
          "CHEMBL203266",
          "CHEMBL2114397",
          "CHEMBL2216768",
          "CHEMBL2216769",
          "CHEMBL2216771",
          "CHEMBL2216774",
          "CHEMBL2216775",
          "CHEMBL2216776",
          "CHEMBL2216777",
          "CHEMBL2216778",
          "CHEMBL2216779",
          "CHEMBL2216780",
          "CHEMBL2216781",
          "CHEMBL2216782",
          "CHEMBL2216785",
          "CHEMBL75880"
        ],
        "number_of_missing_values": "0"
      },
      {
        "data_type": "numeric",
        "index": "1",
        "is_ignore": "false",
        "is_row_identifier": "false",
        "is_target": "false",
        "name": "RBF",
        "number_of_missing_values": "0"
      },
      {
        "data_type": "numeric",
        "index": "2",
        "is_ignore": "false",
        "is_row_identifier": "false",
        "is_target": "false",
        "name": "nAB",
        "number_of_missing_values": "0"
      },
      {
        "data_type": "numeric",
        "index": "3",
        "is_ignore": "false",
        "is_row_identifier": "false",
        "is_target": "true",
        "name": "pXC50",
        "number_of_missing_values": "0"
      }
    ]
  }
}