"molecule_id","AMW","C.","H.","Me","Mi","Mp","Mv","MW","N.","nAB","nAT","nB","nBM","nBO","nBR","nBT","nC","nCL","nCsp","nCsp2","nCsp3","nDB","nF","nH","nHet","nHM","nI","nN","nO","nP","nS","nSK","nTB","nX","O.","RBF","RBN","SCBO","Se","Si","Sp","Sv","X.","pXC50"
{1 8.147,2 43.8,3 41.1,4 1.008,5 1.12,6 0.694,7 0.664,8 594.75,9 8.2,10 32,11 73,13 33,14 48,16 78,17 32,20 25,21 7,22 1,24 30,25 11,26 1,28 6,29 4,31 1,32 43,35 5.5,36 0.154,37 12,38 65,39 73.6,40 81.73,41 50.637,42 48.496,44 5.996}
{0 CHEMBL10014,1 8.038,2 45.1,3 42.3,4 1.009,5 1.112,6 0.691,7 0.66,8 570.71,9 2.8,10 27,11 71,13 29,14 45,16 75,17 32,20 25,21 7,22 2,24 30,25 9,26 1,28 2,29 6,31 1,32 41,35 8.5,36 0.16,37 12,38 60.5,39 71.614,40 78.986,41 49.046,42 46.894,44 6.301}
{0 CHEMBL10062,1 7.968,2 43.1,3 43.1,4 1.01,5 1.118,6 0.681,7 0.652,8 573.72,9 4.2,10 17,11 72,13 23,14 44,16 75,17 31,20 24,21 7,22 6,24 31,25 10,26 1,28 3,29 6,31 1,32 41,35 8.3,36 0.173,37 13,38 58.5,39 72.716,40 80.484,41 49.051,42 46.915,44 6.496}
{0 CHEMBL10076,1 7.631,2 45.9,3 43.2,4 1.006,5 1.115,6 0.678,7 0.652,8 564.68,9 2.7,10 28,11 74,13 30,14 46,16 78,17 34,20 27,21 7,22 2,24 32,25 8,28 2,29 6,32 42,35 8.1,36 0.154,37 12,38 62,39 74.421,40 82.481,41 50.159,42 48.234,44 4.301}
{0 CHEMBL10081,1 7.29,2 40.6,3 46.9,4 1.008,5 1.126,6 0.647,7 0.62,8 466.58,9 3.1,10 12,11 64,13 16,14 36,16 66,17 26,20 17,21 9,22 4,24 30,25 8,28 2,29 6,32 34,35 9.4,36 0.197,37 13,38 46,39 64.538,40 72.066,41 41.398,42 39.707,44 4.301}
{0 CHEMBL10116,1 7.419,2 41,3 45.9,4 1.011,5 1.125,6 0.65,7 0.626,8 452.55,9 3.3,10 12,11 61,13 16,14 35,16 63,17 25,20 17,21 8,22 4,24 28,25 8,28 2,29 6,32 33,35 9.8,36 0.19,37 12,38 45,39 61.654,40 68.651,41 39.637,42 38.18,44 4.31}
{0 CHEMBL10120,1 7.424,2 40,3 46.2,4 1.013,5 1.127,6 0.644,7 0.622,8 482.58,9 3.1,10 12,11 65,13 16,14 37,16 67,17 26,20 17,21 9,22 4,24 30,25 9,28 2,29 7,32 35,35 10.8,36 0.194,37 13,38 47,39 65.865,40 73.275,41 41.852,42 40.422,44 4.301}
{0 CHEMBL10122,1 7.565,2 43.1,3 44.4,4 1.01,5 1.121,6 0.661,7 0.638,8 544.65,9 2.8,10 23,11 72,13 25,14 43,16 75,17 31,20 23,21 8,22 2,24 32,25 9,28 2,29 7,32 40,35 9.7,36 0.173,37 13,38 56.5,39 72.749,40 80.69,41 47.614,42 45.948,44 4.523}
{0 CHEMBL10126,1 7.559,2 40,3 45,4 1.015,5 1.129,6 0.648,7 0.628,8 453.54,9 5,10 17,11 60,13 19,14 35,16 62,17 24,20 17,21 7,22 2,24 27,25 9,28 3,29 6,32 33,35 10,36 0.177,37 11,38 45.5,39 60.872,40 67.734,41 38.881,42 37.675,44 4.699}
{0 CHEMBL10133,1 9.731,2 41.4,3 43.1,4 1.014,5 1.12,6 0.699,7 0.655,8 564.41,9 3.4,10 17,11 58,13 19,14 35,16 60,17 24,20 17,21 7,22 2,24 25,25 9,26 1,27 1,28 2,29 6,32 33,34 1,35 10.3,36 0.183,37 11,38 45.5,39 58.84,40 64.956,41 40.534,42 37.97,43 1.7,44 5.658}
{0 CHEMBL10135,1 7.434,2 39.4,3 45.5,4 1.008,5 1.133,6 0.651,7 0.626,8 490.62,9 9.1,10 17,11 66,13 20,14 39,16 69,17 26,20 17,21 9,22 3,24 30,25 10,28 6,29 4,32 36,35 6.1,36 0.174,37 12,38 50.5,39 66.523,40 74.81,41 42.989,42 41.309,44 6.066}
{0 CHEMBL10139,1 7.29,2 40.6,3 46.9,4 1.008,5 1.126,6 0.647,7 0.62,8 466.58,9 3.1,10 12,11 64,13 16,14 36,16 66,17 26,20 17,21 9,22 4,24 30,25 8,28 2,29 6,32 34,35 9.4,36 0.182,37 12,38 46,39 64.538,40 72.066,41 41.398,42 39.707,44 4.301}
{0 CHEMBL10140,1 8.154,2 41.4,3 43.1,4 1.019,5 1.124,6 0.668,7 0.646,8 472.96,9 3.4,10 17,11 58,13 19,14 35,16 60,17 24,18 1,20 17,21 7,22 2,24 25,25 9,26 1,28 2,29 6,32 33,34 1,35 10.3,36 0.183,37 11,38 45.5,39 59.094,40 65.179,41 38.733,42 37.481,43 1.7,44 5.71}
{0 CHEMBL10168,1 7.424,2 40,3 46.2,4 1.013,5 1.127,6 0.644,7 0.622,8 482.58,9 3.1,10 12,11 65,13 16,14 37,16 67,17 26,20 17,21 9,22 4,24 30,25 9,28 2,29 7,32 35,35 10.8,36 0.194,37 13,38 47,39 65.865,40 73.275,41 41.852,42 40.422,44 4.301}
{0 CHEMBL10181,1 8.038,2 45.1,3 42.3,4 1.009,5 1.112,6 0.691,7 0.66,8 570.71,9 2.8,10 27,11 71,13 29,14 45,16 75,17 32,20 25,21 7,22 2,24 30,25 9,26 1,28 2,29 6,31 1,32 41,35 8.5,36 0.16,37 12,38 60.5,39 71.614,40 78.986,41 49.046,42 46.894,44 6.523}
{0 CHEMBL10212,1 7.561,2 41.4,3 44.8,4 1.013,5 1.125,6 0.653,7 0.632,8 438.52,9 3.4,10 17,11 58,13 19,14 34,16 60,17 24,20 17,21 7,22 2,24 26,25 8,28 2,29 6,32 32,35 10.3,36 0.183,37 11,38 44.5,39 58.771,40 65.235,41 37.875,42 36.653,44 5.733}
{0 CHEMBL10213,1 7.983,2 41,3 44.3,4 1.016,5 1.125,6 0.664,7 0.639,8 486.99,9 3.3,10 12,11 61,13 16,14 36,16 63,17 25,18 1,20 17,21 8,22 4,24 27,25 9,26 1,28 2,29 6,32 34,34 1,35 9.8,36 0.19,37 12,38 46,39 61.978,40 68.595,41 40.494,42 39.007,43 1.6,44 5.301}
{0 CHEMBL10230,1 7.856,2 42.4,3 42.4,4 1.017,5 1.124,6 0.663,7 0.647,8 463.53,9 5.1,10 17,11 59,13 20,14 36,16 61,17 25,19 1,20 17,21 7,22 2,24 25,25 9,28 3,29 6,32 34,33 1,35 10.2,36 0.18,37 11,38 48.5,39 59.989,40 66.319,41 39.119,42 38.148,44 6.046}
{0 CHEMBL10233,1 8.548,2 41,3 42.6,4 1.021,5 1.124,6 0.678,7 0.653,8 521.43,9 3.3,10 12,11 61,13 16,14 37,16 63,17 25,18 2,20 17,21 8,22 4,24 26,25 10,26 2,28 2,29 6,32 35,34 2,35 9.8,36 0.19,37 12,38 47,39 62.302,40 68.539,41 41.352,42 39.835,43 3.3,44 4.886}
{0 CHEMBL10240,1 8.038,2 45.1,3 42.3,4 1.009,5 1.112,6 0.691,7 0.66,8 570.71,9 2.8,10 27,11 71,13 29,14 45,16 75,17 32,20 25,21 7,22 2,24 30,25 9,26 1,28 2,29 6,31 1,32 41,35 8.5,36 0.16,37 12,38 60.5,39 71.614,40 78.986,41 49.046,42 46.894,44 6.16}
{0 CHEMBL10263,1 7.631,2 45.9,3 43.2,4 1.006,5 1.115,6 0.678,7 0.652,8 564.68,9 2.7,10 28,11 74,13 30,14 46,16 78,17 34,20 27,21 7,22 2,24 32,25 8,28 2,29 6,32 42,35 8.1,36 0.154,37 12,38 62,39 74.421,40 82.481,41 50.159,42 48.234,44 6.174}
{0 CHEMBL10267,1 7.828,2 40.6,3 45.3,4 1.013,5 1.125,6 0.66,7 0.633,8 501.02,9 3.1,10 12,11 64,13 16,14 37,16 66,17 26,18 1,20 17,21 9,22 4,24 29,25 9,26 1,28 2,29 6,32 35,34 1,35 9.4,36 0.197,37 13,38 47,39 64.862,40 72.01,41 42.256,42 40.534,43 1.6,44 4.301}
{0 CHEMBL10273,1 7.424,2 40,3 46.2,4 1.013,5 1.127,6 0.644,7 0.622,8 482.58,9 3.1,10 12,11 65,13 16,14 37,16 67,17 26,20 17,21 9,22 4,24 30,25 9,28 2,29 7,32 35,35 10.8,36 0.194,37 13,38 47,39 65.865,40 73.275,41 41.852,42 40.422,44 5.437}
{0 CHEMBL10292,1 8.059,2 40,3 41.7,4 1.027,5 1.129,6 0.65,7 0.643,8 483.52,9 5,10 17,11 60,13 21,14 37,16 62,17 24,20 17,21 7,22 4,24 25,25 11,28 3,29 8,32 35,35 13.3,36 0.194,37 12,38 49.5,39 61.643,40 67.737,41 39.028,42 38.577,44 5.444}
{0 CHEMBL10356,1 7.502,2 43.3,3 44.8,4 1.008,5 1.12,6 0.663,7 0.637,8 502.61,9 3,10 17,11 67,13 21,14 40,16 70,17 29,20 21,21 8,22 4,24 30,25 8,28 2,29 6,32 37,35 9,36 0.171,37 12,38 52.5,39 67.538,40 75.066,41 44.398,42 42.707,44 5.398}
{0 CHEMBL10357,1 7.29,2 40.6,3 46.9,4 1.008,5 1.126,6 0.647,7 0.62,8 466.58,9 3.1,10 12,11 64,13 16,14 36,16 66,17 26,20 17,21 9,22 4,24 30,25 8,28 2,29 6,32 34,35 9.4,36 0.182,37 12,38 46,39 64.538,40 72.066,41 41.398,42 39.707,44 5.71}
{0 CHEMBL10358,1 8.154,2 41.4,3 43.1,4 1.019,5 1.124,6 0.668,7 0.646,8 472.96,9 3.4,10 17,11 58,13 19,14 35,16 60,17 24,18 1,20 17,21 7,22 2,24 25,25 9,26 1,28 2,29 6,32 33,34 1,35 10.3,36 0.183,37 11,38 45.5,39 59.094,40 65.179,41 38.733,42 37.481,43 1.7,44 5.523}
{0 CHEMBL10424,1 8.074,2 44.1,3 42.6,4 1.013,5 1.118,6 0.68,7 0.655,8 549.06,9 2.9,10 23,11 68,13 25,14 42,16 71,17 30,18 1,20 23,21 7,22 2,24 29,25 9,26 1,28 2,29 6,32 39,34 1,35 8.8,36 0.169,37 12,38 55.5,39 68.862,40 76.01,41 46.256,42 44.534,43 1.5,44 5.699}
{0 CHEMBL10462,1 9.731,2 41.4,3 43.1,4 1.014,5 1.12,6 0.699,7 0.655,8 564.41,9 3.4,10 17,11 58,13 19,14 35,16 60,17 24,20 17,21 7,22 2,24 25,25 9,26 1,27 1,28 2,29 6,32 33,34 1,35 10.3,36 0.183,37 11,38 45.5,39 58.84,40 64.956,41 40.534,42 37.97,43 1.7,44 5.155}
{0 CHEMBL10463,1 7.419,2 41,3 45.9,4 1.011,5 1.125,6 0.65,7 0.626,8 452.55,9 3.3,10 12,11 61,13 16,14 35,16 63,17 25,20 17,21 8,22 4,24 28,25 8,28 2,29 6,32 33,35 9.8,36 0.19,37 12,38 45,39 61.654,40 68.651,41 39.637,42 38.18,44 4.678}
{0 CHEMBL10509,1 7.559,2 40,3 45,4 1.015,5 1.129,6 0.648,7 0.628,8 453.54,9 5,10 17,11 60,13 19,14 35,16 62,17 24,20 17,21 7,22 2,24 27,25 9,28 3,29 6,32 33,35 10,36 0.177,37 11,38 45.5,39 60.872,40 67.734,41 38.881,42 37.675,44 4.523}
{0 CHEMBL10543,1 8.059,2 40,3 41.7,4 1.027,5 1.129,6 0.65,7 0.643,8 483.52,9 5,10 17,11 60,13 21,14 37,16 62,17 24,20 17,21 7,22 4,24 25,25 11,28 3,29 8,32 35,35 13.3,36 0.194,37 12,38 49.5,39 61.643,40 67.737,41 39.028,42 38.577,44 5.102}
{0 CHEMBL10558,1 6.968,2 39.7,3 49.3,4 1.003,5 1.128,6 0.639,7 0.607,8 508.67,9 2.7,10 17,11 73,13 19,14 39,16 75,17 29,20 17,21 12,22 2,24 36,25 8,28 2,29 6,32 37,35 8.2,36 0.2,37 15,38 49.5,39 73.189,40 82.311,41 46.682,42 44.287,44 5.745}
{0 CHEMBL10614,1 8.304,2 41,3 41,4 1.036,5 1.142,6 0.647,7 0.645,8 506.52,9 3.3,10 17,11 61,13 19,14 38,16 63,17 25,20 17,21 8,22 2,23 3,24 25,25 11,28 2,29 6,32 36,34 3,35 9.8,36 0.175,37 11,38 48.5,39 63.192,40 69.67,41 39.449,42 39.33,43 4.9,44 5.987}
{0 CHEMBL10666,1 8.712,2 41,3 44.3,4 1.014,5 1.123,6 0.672,7 0.643,8 531.44,9 3.3,10 12,11 61,13 16,14 36,15 1,16 63,17 25,20 17,21 8,22 4,24 27,25 9,26 1,28 2,29 6,32 34,34 1,35 9.8,36 0.19,37 12,38 46,39 61.883,40 68.492,41 40.989,42 39.205,43 1.6,44 5.701}
{0 CHEMBL10667,1 7.871,2 41.4,3 43.1,4 1.022,5 1.131,6 0.652,7 0.639,8 456.51,9 3.4,10 17,11 58,13 19,14 35,16 60,17 24,20 17,21 7,22 2,23 1,24 25,25 9,28 2,29 6,32 33,34 1,35 10.3,36 0.183,37 11,38 45.5,39 59.283,40 65.575,41 37.813,42 37.036,43 1.7,44 5.31}
{0 CHEMBL110963,1 6.886,2 35.4,3 50.8,4 1.008,5 1.138,6 0.618,7 0.589,8 447.59,9 4.6,10 6,11 65,13 10,14 34,16 67,17 23,20 8,21 15,22 4,24 33,25 9,28 3,29 6,32 32,35 9.2,36 0.119,37 8,38 41,39 65.523,40 73.979,41 40.165,42 38.255,44 5.658}
{0 CHEMBL111721,1 6.967,2 38.9,3 49.5,4 1.004,5 1.13,6 0.636,7 0.604,8 661.87,9 3.2,10 18,11 95,13 21,14 51,16 98,17 37,20 21,21 16,22 3,24 47,25 11,28 3,29 8,32 48,35 8.4,36 0.143,37 14,38 63,39 95.363,40 107.305,41 60.404,42 57.372,44 6.222}
{0 CHEMBL111847,1 6.937,2 39.8,3 49.4,4 1.001,5 1.128,6 0.641,7 0.607,8 575.77,9 3.6,10 18,11 83,13 20,14 45,16 86,17 33,20 19,21 14,22 2,24 41,25 9,28 3,29 6,32 42,35 7.2,36 0.151,37 13,38 56,39 83.058,40 93.64,41 53.211,42 50.362,44 6.301}
{0 CHEMBL112156,1 6.806,2 37.7,3 50.7,4 1.001,5 1.133,6 0.63,7 0.595,8 469.64,9 4.3,10 12,11 69,13 15,14 36,16 71,17 26,20 13,21 13,22 3,24 35,25 8,28 3,29 5,32 34,35 7.2,36 0.141,37 10,38 45,39 69.08,40 78.185,41 43.472,42 41.067,44 5.569}
{0 CHEMBL112242,1 6.789,2 35.3,3 51.5,4 1.006,5 1.138,6 0.617,7 0.585,8 461.62,9 4.4,10 6,11 68,13 10,14 35,16 70,17 24,20 8,21 16,22 4,24 35,25 9,28 3,29 6,32 33,35 8.8,36 0.114,37 8,38 42,39 68.407,40 77.395,41 41.926,42 39.782,44 6.027}
{0 CHEMBL112371,1 7.207,2 39.5,3 47.7,4 1.008,5 1.129,6 0.641,7 0.614,8 619.78,9 3.5,10 18,11 86,13 22,14 48,16 89,17 34,20 20,21 14,22 4,24 41,25 11,28 3,29 8,32 45,35 9.3,36 0.157,37 14,38 61,39 86.712,40 97.059,41 55.12,42 52.792,44 5.921}
{0 CHEMBL112664,1 6.993,2 35.5,3 50,4 1.01,5 1.138,6 0.619,7 0.592,8 433.56,9 4.8,10 6,11 62,13 10,14 33,16 64,17 22,20 8,21 14,22 4,24 31,25 9,28 3,29 6,32 31,35 9.7,36 0.125,37 8,38 40,39 62.64,40 70.564,41 38.404,42 36.728,44 5.538}
{0 CHEMBL112871,1 7.146,2 38.9,3 48.4,4 1.01,5 1.129,6 0.635,7 0.608,8 678.85,9 2.1,10 18,11 95,13 21,14 52,16 98,17 37,20 21,21 16,22 3,24 46,25 12,28 2,29 10,32 49,35 10.5,36 0.143,37 14,38 64,39 95.916,40 107.225,41 60.307,42 57.78,44 5.745}
{0 CHEMBL113249,1 7.361,2 39.8,3 46.6,4 1.012,5 1.128,6 0.643,7 0.619,8 647.79,9 3.4,10 18,11 88,13 21,14 51,16 92,17 35,20 20,21 15,22 3,24 41,25 12,28 3,29 9,32 47,35 10.2,36 0.109,37 10,38 63,39 89.04,40 99.268,41 56.574,42 54.507,44 6.276}
{0 CHEMBL113522,1 7.104,2 40,3 48.4,4 1.006,5 1.126,6 0.641,7 0.611,8 674.86,9 2.1,10 18,11 95,13 21,14 53,16 99,17 38,20 21,21 17,22 3,24 46,25 11,28 2,29 9,32 49,35 9.5,36 0.121,37 12,38 65,39 95.589,40 107.016,41 60.853,42 58.066,44 5.409}
{0 CHEMBL114144,1 7.353,2 39.1,3 46.9,4 1.014,5 1.129,6 0.638,7 0.616,8 470.57,9 3.1,10 12,11 64,13 16,14 36,16 66,17 25,20 14,21 11,22 4,24 30,25 9,28 2,29 7,32 34,35 10.9,36 0.136,37 9,38 46,39 64.865,40 72.275,41 40.852,42 39.422,44 6.398}
{0 CHEMBL114769,1 6.192,2 39.4,3 54.5,4 0.983,5 1.128,6 0.634,7 0.582,8 408.64,9 3,10 12,11 66,13 13,14 32,16 68,17 26,20 13,21 13,22 1,24 36,25 4,28 2,29 2,32 30,35 3,36 0.132,37 9,38 39,39 64.879,40 74.474,41 41.864,42 38.428,44 4.824}
{0 CHEMBL114806,1 6.503,2 41.6,3 51.9,4 0.987,5 1.124,6 0.647,7 0.6,8 500.74,9 2.6,10 18,11 77,13 19,14 40,16 80,17 32,20 19,21 13,22 1,24 40,25 5,28 2,29 3,32 37,35 3.9,36 0.138,37 11,38 50,39 75.974,40 86.514,41 49.841,42 46.196,44 4.824}
{0 CHEMBL114811,1 6.302,2 38.5,3 53.8,4 0.986,5 1.132,6 0.632,7 0.583,8 409.63,9 4.6,10 12,11 65,13 13,14 32,16 67,17 25,20 12,21 13,22 1,24 35,25 5,28 3,29 2,32 30,35 3.1,36 0.134,37 9,38 39,39 64.098,40 73.557,41 41.108,42 37.923,44 4.824}
{0 CHEMBL114953,1 7.145,2 40.7,3 48.1,4 1.006,5 1.129,6 0.644,7 0.614,8 578.74,9 2.5,10 18,11 81,13 20,14 45,16 84,17 33,20 20,21 13,22 2,23 1,24 39,25 9,28 2,29 6,32 42,34 1,35 7.4,36 0.143,37 12,38 56,39 81.469,40 91.482,41 52.142,42 49.724,43 1.2,44 6.149}
{0 CHEMBL115358,1 6.96,2 39.6,3 49.5,4 1.004,5 1.127,6 0.637,7 0.605,8 702.92,9 2,10 18,11 101,13 21,14 55,16 105,17 40,20 21,21 19,22 3,24 50,25 11,28 2,29 9,32 51,35 8.9,36 0.124,37 13,38 67,39 101.356,40 113.846,41 64.375,42 61.119,44 5.301}
{0 CHEMBL115866,1 6.877,2 45.6,3 48.5,4 0.989,5 1.114,6 0.67,7 0.626,8 467.65,9 1.5,10 22,11 68,13 24,14 38,16 71,17 31,20 22,21 9,22 2,24 33,25 4,28 1,29 3,32 35,35 4.4,36 0.099,37 7,38 51,39 67.221,40 75.77,41 45.552,42 42.595,44 5}
{0 CHEMBL116340,1 7.947,2 52.1,3 39.6,4 1.001,5 1.101,6 0.713,7 0.686,8 381.45,9 2.1,10 23,11 48,13 24,14 33,16 52,17 25,20 23,21 2,22 1,24 19,25 4,28 1,29 3,32 29,35 6.3,36 0.058,37 3,38 45.5,39 48.036,40 52.863,41 34.222,42 32.907,44 4.886}
{0 CHEMBL117099,1 9.154,2 50,3 33.3,4 1.04,5 1.127,6 0.698,7 0.704,8 439.41,9 2.1,10 22,11 48,13 24,14 35,16 51,17 24,20 22,21 2,22 2,23 3,24 16,25 8,28 1,29 4,32 32,34 3,35 8.3,36 0.118,37 6,38 48,39 49.902,40 54.092,41 33.489,42 33.772,43 6.3,44 4.77}
{0 CHEMBL117359,1 7.359,2 46.7,3 45,4 0.998,5 1.112,6 0.679,7 0.645,8 441.56,9 1.7,10 22,11 60,13 24,14 36,16 63,17 28,20 22,21 6,22 2,24 27,25 5,28 1,29 4,32 33,35 6.7,36 0.111,37 7,38 49,39 59.898,40 66.734,41 40.722,42 38.729,44 4.678}
{0 CHEMBL117520,1 10.006,2 45.7,3 32.6,4 1.039,5 1.116,6 0.725,7 0.717,8 460.29,9 6.5,10 18,11 46,13 22,14 33,16 48,17 21,18 2,20 20,21 1,22 4,24 15,25 10,26 2,28 3,29 5,32 31,34 2,35 10.9,36 0.146,37 7,38 46,39 47.775,40 51.336,41 33.335,42 32.981,43 4.3,44 4.818}
{0 CHEMBL117713,1 8.259,2 46.7,3 40,4 1.024,5 1.129,6 0.676,7 0.665,8 495.53,9 1.7,10 22,11 60,13 24,14 39,16 63,17 28,20 22,21 6,22 2,23 3,24 24,25 8,28 1,29 4,32 36,34 3,35 6.7,36 0.111,37 7,38 52,39 61.436,40 67.753,41 40.534,42 39.879,43 5,44 4.796}
{0 CHEMBL119346,1 9.154,2 50,3 33.3,4 1.04,5 1.127,6 0.698,7 0.704,8 439.41,9 2.1,10 22,11 48,13 24,14 35,16 51,17 24,20 22,21 2,22 2,23 3,24 16,25 8,28 1,29 4,32 32,34 3,35 8.3,36 0.118,37 6,38 48,39 49.902,40 54.092,41 33.489,42 33.772,43 6.3,44 5}
{0 CHEMBL119611,1 9.154,2 50,3 33.3,4 1.04,5 1.127,6 0.698,7 0.704,8 439.41,9 2.1,10 22,11 48,13 24,14 35,16 51,17 24,20 22,21 2,22 2,23 3,24 16,25 8,28 1,29 4,32 32,34 3,35 8.3,36 0.118,37 6,38 48,39 49.902,40 54.092,41 33.489,42 33.772,43 6.3,44 5.009}
{0 CHEMBL119712,1 8.077,2 52.3,3 38.6,4 1.003,5 1.101,6 0.715,7 0.69,8 355.41,9 2.3,10 22,11 44,13 24,14 30,16 47,17 23,20 22,21 1,22 2,24 17,25 4,28 1,29 3,32 27,35 6.8,36 0.106,37 5,38 43,39 44.153,40 48.448,41 31.46,42 30.38,44 4.585}
{0 CHEMBL163080,1 8.483,2 42.4,3 39,4 1.033,5 1.143,6 0.662,7 0.659,8 500.52,9 6.8,10 18,11 59,13 21,14 39,16 62,17 25,20 19,21 6,22 3,23 3,24 23,25 11,28 4,29 4,32 36,34 3,35 6.8,36 0.113,37 7,38 51,39 60.974,40 67.417,41 39.029,42 38.889,43 5.1,44 5.174}
{0 CHEMBL164345,1 9.577,2 43.1,3 32.8,4 1.064,5 1.158,6 0.66,7 0.685,8 555.47,9 5.2,10 18,11 58,13 21,14 42,16 61,17 25,20 19,21 6,22 3,23 6,24 19,25 14,28 3,29 5,32 39,34 6,35 8.6,36 0.098,37 6,38 54,39 61.738,40 67.147,41 38.29,42 39.733,43 10.3,44 5.678}
{0 CHEMBL164443,1 9.577,2 43.1,3 32.8,4 1.064,5 1.158,6 0.66,7 0.685,8 555.47,9 5.2,10 18,11 58,13 21,14 42,16 61,17 25,20 19,21 6,22 3,23 6,24 19,25 14,28 3,29 5,32 39,34 6,35 8.6,36 0.098,37 6,38 54,39 61.738,40 67.147,41 38.29,42 39.733,43 10.3,44 5.432}
{0 CHEMBL164678,1 9.05,2 43.8,3 35.6,4 1.048,5 1.149,6 0.665,7 0.676,8 660.62,9 5.5,10 24,11 73,13 27,14 51,16 77,17 32,20 25,21 7,22 3,23 6,24 26,25 15,28 4,29 5,32 47,34 6,35 6.8,36 0.117,37 9,38 66,39 76.49,40 83.891,41 48.58,42 49.335,43 8.2,44 6}
{0 CHEMBL164688,1 8.815,2 38.7,3 38.7,4 1.053,5 1.166,6 0.635,7 0.647,8 546.52,9 6.5,10 12,11 62,13 15,14 41,16 65,17 24,20 13,21 11,22 3,23 6,24 24,25 14,28 4,29 4,32 38,34 6,35 6.5,36 0.077,37 5,38 50,39 65.279,40 72.267,41 39.364,42 40.093,43 9.7,44 5.959}
{0 CHEMBL164702,1 8.976,2 37.7,3 37.7,4 1.057,5 1.17,6 0.633,7 0.649,8 547.51,9 8.2,10 12,11 61,13 15,14 41,16 64,17 23,20 12,21 11,22 3,23 6,24 23,25 15,28 5,29 4,32 38,34 6,35 6.6,36 0.078,37 5,38 50,39 64.498,40 71.35,41 38.608,42 39.588,43 9.8,44 5.495}
{0 CHEMBL164953,1 7.214,2 34.9,3 49.4,4 1.019,5 1.151,6 0.612,7 0.591,8 598.74,9 4.8,10 6,11 83,13 10,14 45,16 86,17 29,20 8,21 21,22 4,23 3,24 41,25 13,28 4,29 6,32 42,34 3,35 7.2,36 0.093,37 8,38 52,39 84.581,40 95.573,41 50.79,42 49.06,43 3.6,44 4.824}
{0 CHEMBL165205,1 9.208,2 38.2,3 36.4,4 1.064,5 1.172,6 0.633,7 0.655,8 506.45,9 7.3,10 12,11 55,13 15,14 37,16 57,17 21,20 13,21 8,22 3,23 6,24 20,25 14,28 4,29 4,32 35,34 6,35 7.3,36 0.123,37 7,38 46,39 58.512,40 64.436,41 34.841,42 36.039,43 10.9,44 6.046}
{0 CHEMBL165341,1 8.977,2 39.1,3 37.5,4 1.056,5 1.164,6 0.638,7 0.653,8 574.53,9 6.3,10 12,11 64,13 16,14 43,16 67,17 25,20 14,21 11,22 4,23 6,24 24,25 15,28 4,29 5,32 40,34 6,35 7.8,36 0.075,37 5,38 53,39 67.607,40 74.476,41 40.818,42 41.808,43 9.4,44 5.301}
{0 CHEMBL165461,1 8.624,2 38.5,3 40,4 1.049,5 1.164,6 0.633,7 0.64,8 560.55,9 6.2,10 12,11 65,13 15,14 42,16 68,17 25,20 13,21 12,22 3,23 6,24 26,25 14,28 4,29 4,32 39,34 6,35 6.2,36 0.088,37 6,38 51,39 68.163,40 75.682,41 41.125,42 41.62,43 9.2,44 5.367}
{0 CHEMBL165559,1 8.329,2 41.3,3 41.3,4 1.036,5 1.158,6 0.646,7 0.642,8 624.66,9 5.3,10 18,11 75,13 19,14 48,16 79,17 31,20 19,21 12,22 1,23 7,24 31,25 13,28 4,29 2,32 44,34 7,35 2.7,36 0.089,37 7,38 58,39 77.672,40 86.848,41 48.438,42 48.154,43 9.3,44 6}
{0 CHEMBL165675,1 8.725,2 43.3,3 38.3,4 1.042,5 1.156,6 0.657,7 0.661,8 523.52,9 5,10 18,11 60,13 19,14 40,16 63,17 26,20 19,21 7,22 1,23 6,24 23,25 11,28 3,29 2,32 37,34 6,35 3.3,36 0.095,37 6,38 50,39 62.523,40 69.35,41 39.449,42 39.642,43 10,44 5.77}
{0 CHEMBL165724,1 8.933,2 37.9,3 37.9,4 1.056,5 1.166,6 0.634,7 0.649,8 589.55,9 7.6,10 12,11 66,13 16,14 44,16 69,17 25,20 14,21 11,22 4,23 6,24 25,25 16,28 5,29 5,32 41,34 6,35 7.6,36 0.072,37 5,38 54,39 69.709,40 76.974,41 41.824,42 42.829,43 9.1,44 5.456}
{0 CHEMBL165793,1 8.647,2 41.4,3 37.9,4 1.038,5 1.147,6 0.66,7 0.662,8 501.51,9 8.6,10 18,11 58,13 21,14 39,16 61,17 24,20 18,21 6,22 3,23 3,24 22,25 12,28 5,29 4,32 36,34 3,35 6.9,36 0.115,37 7,38 51,39 60.192,40 66.5,41 38.273,42 38.384,43 5.2,44 5.469}
{0 CHEMBL165851,1 8.65,2 41,3 39.7,4 1.046,5 1.166,6 0.642,7 0.647,8 674.67,9 5.1,10 18,11 78,13 19,14 51,16 82,17 32,20 19,21 13,22 1,23 9,24 31,25 15,28 4,29 2,32 47,34 9,35 2.6,36 0.085,37 7,38 61,39 81.581,40 90.943,41 50.074,42 50.447,43 11.5,44 5.77}
{0 CHEMBL166177,1 8.943,2 41,3 36.1,4 1.047,5 1.146,6 0.659,7 0.669,8 545.52,9 8.2,10 18,11 61,13 23,14 42,16 64,17 25,20 19,21 6,22 5,23 3,24 22,25 14,28 5,29 6,32 39,34 3,35 9.8,36 0.125,37 8,38 56,39 63.847,40 69.919,41 40.182,42 40.814,43 4.9,44 5.854}
{0 CHEMBL166195,1 8.647,2 41.4,3 37.9,4 1.038,5 1.147,6 0.66,7 0.662,8 501.51,9 8.6,10 18,11 58,13 21,14 39,16 61,17 24,20 18,21 6,22 3,23 3,24 22,25 12,28 5,29 4,32 36,34 3,35 6.9,36 0.115,37 7,38 51,39 60.192,40 66.5,41 38.273,42 38.384,43 5.2,44 5.215}
{0 CHEMBL166203,1 8.86,2 40.5,3 37.8,4 1.049,5 1.161,6 0.646,7 0.656,8 655.63,9 6.8,10 18,11 74,13 21,14 50,16 78,17 30,20 19,21 11,22 3,23 7,24 28,25 16,28 5,29 4,32 46,34 7,35 5.4,36 0.103,37 8,38 62,39 77.661,40 85.935,41 47.83,42 48.551,43 9.5,44 5.854}
{0 CHEMBL167680,1 9.785,2 35.2,3 35.2,4 1.071,5 1.174,6 0.648,7 0.661,8 528.39,9 7.4,10 12,11 54,13 15,14 37,16 56,17 19,20 12,21 7,22 3,23 6,24 19,25 16,26 1,28 4,29 5,30 1,32 35,34 6,35 9.3,36 0.107,37 6,38 46,39 57.814,40 63.369,41 34.978,42 35.678,43 11.1,44 5.745}
{0 CHEMBL168014,1 8.815,2 38.7,3 38.7,4 1.053,5 1.166,6 0.635,7 0.647,8 546.52,9 6.5,10 12,11 62,13 15,14 41,16 65,17 24,20 13,21 11,22 3,23 6,24 24,25 14,28 4,29 4,32 38,34 6,35 6.5,36 0.077,37 5,38 50,39 65.279,40 72.267,41 39.364,42 40.093,43 9.7,44 5.553}
{0 CHEMBL1834489,1 9.183,2 47.6,3 33.3,4 1.044,5 1.128,6 0.689,7 0.698,8 578.53,9 3.2,10 28,11 63,13 31,14 46,16 67,17 30,20 27,21 3,22 3,23 3,24 21,25 12,28 2,29 7,32 42,34 3,35 11.1,36 0.134,37 9,38 63,39 65.752,40 71.049,41 43.381,42 43.991,43 4.8,44 5.469}
{0 CHEMBL1834490,1 9.297,2 49.2,3 32.2,4 1.043,5 1.126,6 0.698,7 0.708,8 548.5,9 3.4,10 28,11 59,13 31,14 44,16 63,17 29,20 27,21 2,22 3,23 3,24 19,25 11,28 2,29 6,32 40,34 3,35 10.2,36 0.127,37 8,38 61,39 61.542,40 66.424,41 41.165,42 41.749,43 5.1,44 5.31}
{0 CHEMBL1834491,1 8.382,2 49.2,3 37.3,4 1.017,5 1.109,6 0.701,7 0.688,8 494.53,9 3.4,10 28,11 59,13 31,14 41,16 63,17 29,20 27,21 2,22 3,24 22,25 8,28 2,29 6,32 37,35 10.2,36 0.127,37 8,38 58,39 60.003,40 65.405,41 41.352,42 40.6,44 4.009}
{0 CHEMBL1834492,1 8.36,2 44.6,3 39.2,4 1.026,5 1.133,6 0.673,7 0.665,8 618.66,9 5.4,10 24,11 74,13 27,14 50,16 79,17 33,20 25,21 8,22 3,23 3,24 29,25 12,28 4,29 5,32 45,34 3,35 6.8,36 0.101,37 8,38 65,39 75.952,40 83.872,41 49.767,42 49.185,43 4.1,44 4.538}
{0 CHEMBL1834493,1 8.217,2 44.2,3 40.3,4 1.024,5 1.134,6 0.669,7 0.659,8 632.69,9 5.2,10 24,11 77,13 27,14 51,16 82,17 34,20 25,21 9,22 3,23 3,24 31,25 12,28 4,29 5,32 46,34 3,35 6.5,36 0.098,37 8,38 66,39 78.836,40 87.287,41 51.529,42 50.711,43 3.9,44 4.195}
{0 CHEMBL1834494,1 8.564,2 45.8,3 37.5,4 1.029,5 1.131,6 0.681,7 0.676,8 616.64,9 5.6,10 28,11 72,13 31,14 50,16 77,17 33,20 27,21 6,22 3,23 3,24 27,25 12,28 4,29 5,32 45,34 3,35 6.9,36 0.104,37 8,38 67,39 74.069,40 81.457,41 49.006,42 48.658,43 4.2,44 5.495}
{0 CHEMBL1834495,1 8.699,2 45.1,3 36.6,4 1.032,5 1.134,6 0.68,7 0.678,8 617.63,9 7,10 28,11 71,13 31,14 50,16 76,17 32,20 26,21 6,22 3,23 3,24 26,25 13,28 5,29 5,32 45,34 3,35 7,36 0.105,37 8,38 67,39 73.287,40 80.54,41 48.25,42 48.152,43 4.2,44 4.836}
{0 CHEMBL1834496,1 8.509,2 44.7,3 38.2,4 1.03,5 1.133,6 0.674,7 0.67,8 646.67,9 5.3,10 28,11 76,13 31,14 52,16 81,17 34,20 27,21 7,22 3,23 3,24 29,25 13,28 4,29 6,32 47,34 3,35 7.9,36 0.111,37 9,38 69,39 78.28,40 86.082,41 51.222,42 50.899,43 3.9,44 5.62}
{0 CHEMBL1834497,1 8.509,2 44.7,3 38.2,4 1.03,5 1.133,6 0.674,7 0.67,8 646.67,9 5.3,10 28,11 76,13 31,14 52,16 81,17 34,20 27,21 7,22 3,23 3,24 29,25 13,28 4,29 6,32 47,34 3,35 7.9,36 0.111,37 9,38 69,39 78.28,40 86.082,41 51.222,42 50.899,43 3.9,44 4.658}
{0 CHEMBL186301,1 8.466,2 49.1,3 38.6,4 1.007,5 1.104,6 0.721,7 0.69,8 482.59,9 3.5,10 28,11 57,13 31,14 39,16 61,17 28,20 27,21 1,22 3,24 22,25 7,26 1,28 2,29 4,31 1,32 35,35 7,36 0.115,37 7,38 56,39 57.425,40 62.906,41 41.091,42 39.357,44 4.2}
{0 CHEMBL187535,1 9.288,2 47.5,3 34.4,4 1.036,5 1.124,6 0.707,7 0.701,8 566.59,9 3.3,10 28,11 61,13 31,14 44,16 65,17 29,20 27,21 2,22 3,23 3,24 21,25 11,26 1,28 2,29 5,31 1,32 40,34 3,35 8.2,36 0.123,37 8,38 61,39 63.174,40 68.55,41 43.119,42 42.749,43 4.9,44 5.081}
{0 CHEMBL188875,1 7.247,2 50,3 44.7,4 0.987,5 1.106,6 0.699,7 0.657,8 550.74,9 2.6,10 34,11 76,13 35,14 47,16 81,17 38,20 33,21 5,22 1,24 34,25 4,28 2,29 2,32 42,35 2.6,36 0.099,37 8,38 65,39 74.996,40 84.059,41 53.103,42 49.901,44 4.921}
{0 CHEMBL268752,1 7.559,2 40,3 45,4 1.015,5 1.129,6 0.648,7 0.628,8 453.54,9 5,10 17,11 60,13 19,14 35,16 62,17 24,20 17,21 7,22 2,24 27,25 9,28 3,29 6,32 33,35 10,36 0.177,37 11,38 45.5,39 60.872,40 67.734,41 38.881,42 37.675,44 5.372}
{0 CHEMBL274603,1 7.554,2 39.4,3 45.5,4 1.018,5 1.129,6 0.641,7 0.623,8 498.58,9 3,10 17,11 66,13 19,14 38,16 68,17 26,20 17,21 9,22 2,24 30,25 10,28 2,29 8,32 36,35 12.1,36 0.191,37 13,38 48.5,39 67.192,40 74.485,41 42.307,42 41.136,44 5.783}
{0 CHEMBL275249,1 7.621,2 40.3,3 44.8,4 1.018,5 1.127,6 0.646,7 0.629,8 510.59,9 3,10 12,11 67,13 17,14 39,16 69,17 27,20 18,21 9,22 5,24 30,25 10,28 2,29 8,32 37,35 11.9,36 0.203,37 14,38 50,39 68.192,40 75.485,41 43.307,42 42.136,44 4.747}
{0 CHEMBL275779,1 8.112,2 39.7,3 42.9,4 1.015,5 1.132,6 0.668,7 0.645,8 511.03,9 9.5,10 17,11 63,13 20,14 39,16 66,17 25,18 1,20 17,21 8,22 3,24 27,25 11,26 1,28 6,29 4,32 36,34 1,35 6.3,36 0.182,37 12,38 50.5,39 63.963,40 71.339,41 42.085,42 40.61,43 1.6,44 6.342}
{0 CHEMBL275903,1 7.983,2 41,3 44.3,4 1.016,5 1.125,6 0.664,7 0.639,8 486.99,9 3.3,10 12,11 61,13 16,14 36,16 63,17 25,18 1,20 17,21 8,22 4,24 27,25 9,26 1,28 2,29 6,32 34,34 1,35 9.8,36 0.19,37 12,38 46,39 61.978,40 68.595,41 40.494,42 39.007,43 1.6,44 4.301}
{0 CHEMBL276212,1 7.494,2 39.7,3 45.6,4 1.014,5 1.129,6 0.645,7 0.624,8 509.61,9 4.4,10 12,11 68,13 17,14 39,16 70,17 27,20 18,21 9,22 5,24 31,25 10,28 3,29 7,32 37,35 10.3,36 0.186,37 13,38 50,39 68.967,40 76.774,41 43.858,42 42.443,44 4.301}
{0 CHEMBL288977,1 9.38,2 50,3 35.4,4 1.017,5 1.095,6 0.748,7 0.717,8 900.49,9 1,10 46,11 96,13 52,14 69,16 103,17 48,18 1,20 46,21 2,22 6,24 34,25 14,26 4,28 1,29 9,31 3,32 62,34 1,35 9.4,36 0.146,37 15,38 98,39 97.622,40 105.145,41 71.841,42 68.799,43 1,44 6.114}
{0 CHEMBL289200,1 8.582,2 53.3,3 37.8,4 1.002,5 1.094,6 0.741,7 0.706,8 772.35,9 1.1,10 46,11 90,13 48,14 63,16 97,17 48,18 1,20 46,21 2,22 2,24 34,25 8,26 2,28 1,29 5,31 1,32 56,34 1,35 5.6,36 0.134,37 13,38 88,39 90.16,40 98.468,41 66.728,42 63.566,43 1.1,44 4.967}
{0 CHEMBL295222,1 8.494,2 51,3 38.8,4 1.006,5 1.099,6 0.726,7 0.694,8 832.41,9 1,10 46,11 98,13 48,14 67,16 105,17 50,18 1,20 46,21 4,22 2,24 38,25 10,26 2,28 1,29 7,31 1,32 60,34 1,35 7.1,36 0.143,37 15,38 92,39 98.581,40 107.717,41 71.159,42 68.049,43 1,44 6.854}
{0 CHEMBL295452,1 8.338,2 52.1,3 39.6,4 0.999,5 1.097,6 0.732,7 0.694,8 800.41,9 1,10 46,11 96,13 48,14 65,16 103,17 50,18 1,20 46,21 4,22 2,24 38,25 8,26 2,28 1,29 5,31 1,32 58,34 1,35 5.2,36 0.126,37 13,38 90,39 95.927,40 105.298,41 70.25,42 66.619,43 1,44 5.963}
{0 CHEMBL295776,1 8.199,2 53.3,3 38.9,4 0.998,5 1.095,6 0.732,7 0.697,8 737.91,9 1.1,10 46,11 90,13 48,14 62,16 97,17 48,20 46,21 2,22 2,24 35,25 7,26 1,28 1,29 5,31 1,32 55,35 5.6,36 0.134,37 13,38 87,39 89.836,40 98.524,41 65.87,42 62.738,44 7}
{0 CHEMBL295987,1 9.092,2 52.2,3 37,4 1.003,5 1.09,6 0.761,7 0.717,8 836.49,9 1.1,10 46,11 92,13 48,14 65,16 99,17 48,18 1,20 46,21 2,22 2,24 34,25 10,26 4,28 1,29 5,31 3,32 58,34 1,35 5.4,36 0.152,37 15,38 90,39 92.312,40 100.308,41 70.023,42 65.94,43 1.1,44 7.409}
{0 CHEMBL296520,1 8.456,2 52.7,3 38.7,4 1,5 1.096,6 0.736,7 0.7,8 786.38,9 1.1,10 46,11 93,13 48,14 64,16 100,17 49,18 1,20 46,21 3,22 2,24 36,25 8,26 2,28 1,29 5,31 1,32 57,34 1,35 5.4,36 0.13,37 13,38 89,39 93.043,40 101.883,41 68.489,42 65.092,43 1.1,44 6.319}
{0 CHEMBL296661,1 8.31,2 53,3 38,4 1.001,5 1.096,6 0.731,7 0.7,8 831,9 2,10 52,11 100,13 54,14 70,16 108,17 53,20 51,21 2,22 2,24 38,25 9,26 1,28 2,29 6,31 1,32 62,35 6,36 0.139,37 15,38 98,39 100.149,40 109.647,41 73.091,42 70.001,44 4.971}
{0 CHEMBL298263,1 8.582,2 53.3,3 37.8,4 1.002,5 1.094,6 0.741,7 0.706,8 772.35,9 1.1,10 46,11 90,13 48,14 63,16 97,17 48,18 1,20 46,21 2,22 2,24 34,25 8,26 2,28 1,29 5,31 1,32 56,34 1,35 5.6,36 0.134,37 13,38 88,39 90.16,40 98.468,41 66.728,42 63.566,43 1.1,44 6.658}
{0 CHEMBL300075,1 8.338,2 52.1,3 39.6,4 0.999,5 1.097,6 0.732,7 0.694,8 800.41,9 1,10 46,11 96,13 48,14 65,16 103,17 50,18 1,20 46,21 4,22 2,24 38,25 8,26 2,28 1,29 5,31 1,32 58,34 1,35 5.2,36 0.146,37 15,38 90,39 95.927,40 105.298,41 70.25,42 66.619,43 1,44 6.569}
{0 CHEMBL306589,1 9.133,2 51.2,3 34.1,4 1.014,5 1.098,6 0.746,7 0.72,8 374.44,9 4.9,10 17,11 41,13 21,14 30,16 44,17 21,20 21,22 4,24 14,25 6,26 1,28 2,29 3,31 1,32 27,35 7.3,36 0.068,37 3,38 42.5,39 41.564,40 45.036,41 30.591,42 29.535,44 5.398}
{0 CHEMBL307255,1 8.1,2 48.5,3 39.4,4 1.012,5 1.11,6 0.695,7 0.677,8 267.3,9 3,10 17,11 33,13 17,14 22,16 35,17 16,20 15,21 1,24 13,25 4,28 1,29 3,32 20,35 9.1,36 0.057,37 2,38 30.5,39 33.385,40 36.618,41 22.938,42 22.327,44 5.009}
{0 CHEMBL308386,1 9.369,2 51.7,3 34.5,4 1.017,5 1.101,6 0.744,7 0.721,8 271.71,9 3.4,10 17,11 29,13 17,14 21,16 31,17 15,18 1,20 15,24 10,25 4,26 1,28 1,29 2,32 19,34 1,35 6.9,36 0.032,37 1,38 29.5,39 29.498,40 31.937,41 21.58,42 20.913,43 3.4,44 4.627}
{0 CHEMBL311452,1 8.481,2 45.1,3 39.2,4 1.01,5 1.115,6 0.708,7 0.679,8 432.54,9 7.8,10 17,11 51,13 21,14 34,16 54,17 23,20 20,21 3,22 4,24 20,25 8,26 1,28 4,29 3,31 1,32 31,35 5.9,36 0.13,37 7,38 46.5,39 51.534,40 56.863,41 36.125,42 34.631,44 6.222}
{0 CHEMBL312842,1 8.366,2 43.5,3 41.9,4 1.004,5 1.113,6 0.711,7 0.668,8 518.71,9 6.5,10 17,11 62,13 22,14 39,16 65,17 27,20 23,21 4,22 5,24 26,25 9,26 2,28 4,29 3,31 2,32 36,35 4.8,36 0.123,37 8,38 52.5,39 62.262,40 69.029,41 44.057,42 41.399,44 5.215}
{0 CHEMBL313059,1 7.837,2 42.7,3 44,4 1.008,5 1.119,6 0.678,7 0.646,8 587.75,9 4,10 17,11 75,13 23,14 45,16 78,17 32,20 24,21 8,22 6,24 33,25 10,26 1,28 3,29 6,31 1,32 42,35 8,36 0.179,37 14,38 59.5,39 75.6,40 83.899,41 50.813,42 48.442,44 5.714}
{0 CHEMBL313933,1 8.439,2 44.4,3 39.7,4 1.017,5 1.115,6 0.695,7 0.672,8 531.63,9 4.8,10 17,11 63,13 23,14 41,16 66,17 28,20 24,21 4,22 6,24 25,25 10,26 1,28 3,29 6,31 1,32 38,35 9.5,36 0.152,37 10,38 55.5,39 64.065,40 70.239,41 43.767,42 42.335,44 5.757}
{0 CHEMBL314194,1 8.573,2 48.7,3 35.9,4 1.021,5 1.111,6 0.703,7 0.694,8 334.35,9 5.1,10 12,11 39,13 17,14 27,16 41,17 19,20 19,22 5,24 14,25 6,28 2,29 4,32 25,35 10.3,36 0.073,37 3,38 38,39 39.814,40 43.325,41 27.398,42 27.063,44 4.602}
{0 CHEMBL314374,1 8.11,2 41.2,3 45.1,4 0.999,5 1.116,6 0.703,7 0.65,8 413.61,9 5.9,10 11,11 51,13 15,14 30,16 53,17 21,20 16,21 5,22 4,24 23,25 7,26 2,28 3,29 2,31 2,32 28,35 3.9,36 0.113,37 6,38 39.5,39 50.949,40 56.906,41 35.836,42 33.136,44 4.907}
{0 CHEMBL315106,1 7.905,2 39.3,3 46.4,4 0.999,5 1.122,6 0.689,7 0.637,8 442.66,9 7.1,10 11,11 56,13 15,14 32,16 58,17 22,20 16,21 6,22 4,24 26,25 8,26 2,28 4,29 2,31 2,32 30,35 3.6,36 0.121,37 7,38 41.5,39 55.934,40 62.819,41 38.603,42 35.684,44 4.602}
{0 CHEMBL316054,1 7.919,2 40.7,3 46.3,4 0.997,5 1.117,6 0.696,7 0.642,8 427.64,9 5.6,10 11,11 54,13 15,14 31,16 56,17 22,20 16,21 6,22 4,24 25,25 7,26 2,28 3,29 2,31 2,32 29,35 3.7,36 0.143,37 8,38 40.5,39 53.832,40 60.321,41 37.597,42 34.663,44 4.602}
{0 CHEMBL321224,1 6.699,2 35.2,3 52.1,4 1.004,5 1.138,6 0.615,7 0.582,8 475.65,9 4.2,10 6,11 71,13 10,14 36,16 73,17 25,20 8,21 17,22 4,24 37,25 9,28 3,29 6,32 34,35 8.5,36 0.123,37 9,38 43,39 71.29,40 80.81,41 43.688,42 41.309,44 6.046}
{0 CHEMBL321247,1 6.843,2 40.5,3 50,4 0.998,5 1.126,6 0.642,7 0.606,8 574.78,9 2.4,10 18,11 84,13 20,14 45,16 87,17 34,20 20,21 14,22 2,24 42,25 8,28 2,29 6,32 42,35 7.1,36 0.149,37 13,38 56,39 83.839,40 94.557,41 53.966,42 50.868,44 5.854}
{0 CHEMBL321424,1 6.699,2 35.2,3 52.1,4 1.004,5 1.138,6 0.615,7 0.582,8 475.65,9 4.2,10 6,11 71,13 10,14 36,16 73,17 25,20 8,21 17,22 4,24 37,25 9,28 3,29 6,32 34,35 8.5,36 0.123,37 9,38 43,39 71.29,40 80.81,41 43.688,42 41.309,44 5.959}
{0 CHEMBL324330,1 6.858,2 39.5,3 50,4 0.999,5 1.129,6 0.639,7 0.603,8 589.8,9 3.5,10 18,11 86,13 20,14 46,16 89,17 34,20 20,21 14,22 2,24 43,25 9,28 3,29 6,32 43,35 7,36 0.146,37 13,38 57,39 85.941,40 97.055,41 54.972,42 51.889,44 6.155}
{0 CHEMBL324813,1 7.183,2 40.2,3 47.8,4 1.008,5 1.126,6 0.642,7 0.615,8 660.83,9 2.2,10 18,11 92,13 21,14 52,16 96,17 37,20 21,21 16,22 3,24 44,25 11,28 2,29 9,32 48,35 9.8,36 0.115,37 11,38 64,39 92.705,40 103.6,41 59.091,42 56.539,44 5.854}
{0 CHEMBL324919,1 6.789,2 35.3,3 51.5,4 1.006,5 1.138,6 0.617,7 0.585,8 461.62,9 4.4,10 6,11 68,13 10,14 35,16 70,17 24,20 8,21 16,22 4,24 35,25 9,28 3,29 6,32 33,35 8.8,36 0.114,37 8,38 42,39 68.407,40 77.395,41 41.926,42 39.782,44 6.051}
{0 CHEMBL325164,1 7.183,2 40.2,3 47.8,4 1.008,5 1.126,6 0.642,7 0.615,8 660.83,9 2.2,10 18,11 92,13 21,14 52,16 96,17 37,20 21,21 16,22 3,24 44,25 11,28 2,29 9,32 48,35 9.8,36 0.115,37 11,38 64,39 92.705,40 103.6,41 59.091,42 56.539,44 5.854}
{0 CHEMBL325206,1 8.486,2 52.3,3 36.4,4 1.015,5 1.109,6 0.714,7 0.699,8 373.4,9 2.3,10 22,11 44,13 24,14 31,16 47,17 23,20 22,21 1,22 2,23 1,24 16,25 5,28 1,29 3,32 28,34 1,35 6.8,36 0.106,37 5,38 44,39 44.665,40 48.788,41 31.398,42 30.764,43 2.3,44 4.456}
{0 CHEMBL325424,1 7.213,2 47.5,3 45.8,4 0.993,5 1.111,6 0.682,7 0.644,8 425.56,9 1.7,10 22,11 59,13 24,14 35,16 62,17 28,20 22,21 6,22 2,24 27,25 4,28 1,29 3,32 32,35 5.1,36 0.097,37 6,38 48,39 58.571,40 65.524,41 40.267,42 38.014,44 5.066}
{0 CHEMBL325441,1 9.154,2 50,3 33.3,4 1.04,5 1.127,6 0.698,7 0.704,8 439.41,9 2.1,10 22,11 48,13 24,14 35,16 51,17 24,20 22,21 2,22 2,23 3,24 16,25 8,28 1,29 4,32 32,34 3,35 8.3,36 0.118,37 6,38 48,39 49.902,40 54.092,41 33.489,42 33.772,43 6.3,44 4.886}
{0 CHEMBL325642,1 7.332,2 41.9,3 46.2,4 1.006,5 1.123,6 0.655,7 0.627,8 681.85,9 3.2,10 24,11 93,13 28,14 54,16 97,17 39,20 26,21 13,22 4,24 43,25 11,28 3,29 8,32 50,35 8.6,36 0.155,37 15,38 70,39 93.596,40 104.474,41 60.881,42 58.319,44 5.585}
{0 CHEMBL325696,1 8.259,2 46.7,3 40,4 1.024,5 1.129,6 0.676,7 0.665,8 495.53,9 1.7,10 22,11 60,13 24,14 39,16 63,17 28,20 22,21 6,22 2,23 3,24 24,25 8,28 1,29 4,32 36,34 3,35 6.7,36 0.111,37 7,38 52,39 61.436,40 67.753,41 40.534,42 39.879,43 5,44 4.301}
{0 CHEMBL326126,1 7.267,2 40.4,3 47.2,4 1.009,5 1.126,6 0.644,7 0.618,8 646.8,9 2.2,10 18,11 89,13 21,14 51,16 93,17 36,20 21,21 15,22 3,24 42,25 11,28 2,29 9,32 47,35 10.1,36 0.108,37 10,38 63,39 89.821,40 100.185,41 57.33,42 55.012,44 5.959}
{0 CHEMBL326325,1 6.944,2 38,3 50,4 1.006,5 1.131,6 0.629,7 0.599,8 638.83,9 2.2,10 12,11 92,13 15,14 50,16 96,17 35,20 15,21 20,22 3,24 46,25 11,28 2,29 9,32 46,35 9.8,36 0.094,37 9,38 59,39 92.589,40 104.016,41 57.853,42 55.066,44 4.824}
{0 CHEMBL326348,1 7.192,2 40.2,3 47.6,4 1.006,5 1.127,6 0.645,7 0.616,8 589.75,9 3.7,10 18,11 82,13 22,14 46,16 85,17 33,20 20,21 13,22 4,24 39,25 10,28 3,29 7,32 43,35 8.5,36 0.153,37 13,38 59,39 82.501,40 92.434,41 52.904,42 50.55,44 6.149}
{0 CHEMBL327050,1 6.789,2 35.3,3 51.5,4 1.006,5 1.138,6 0.617,7 0.585,8 461.62,9 4.4,10 6,11 68,13 10,14 35,16 70,17 24,20 8,21 16,22 4,24 35,25 9,28 3,29 6,32 33,35 8.8,36 0.114,37 8,38 42,39 68.407,40 77.395,41 41.926,42 39.782,44 5.538}
{0 CHEMBL330904,1 6.56,2 39.1,3 52.2,4 0.993,5 1.129,6 0.634,7 0.592,8 452.65,9 2.9,10 12,11 69,13 14,14 35,16 71,17 27,20 14,21 13,22 2,24 36,25 6,28 2,29 4,32 33,35 5.8,36 0.141,37 10,38 43,39 68.534,40 77.893,41 43.773,42 40.858,44 5.108}
{0 CHEMBL331377,1 6.982,2 37.1,3 51.4,4 0.999,5 1.129,6 0.641,7 0.597,8 488.71,9 2.9,10 12,11 70,13 15,14 36,16 72,17 26,20 13,21 13,22 3,24 36,25 8,26 1,28 2,29 5,31 1,32 34,35 7.1,36 0.139,37 10,38 45,39 69.938,40 79.022,41 44.875,42 41.759,44 4.824}
{0 CHEMBL332886,1 9.154,2 50,3 33.3,4 1.04,5 1.127,6 0.698,7 0.704,8 439.41,9 2.1,10 22,11 48,13 24,14 35,16 51,17 24,20 22,21 2,22 2,23 3,24 16,25 8,28 1,29 4,32 32,34 3,35 8.3,36 0.118,37 6,38 48,39 49.902,40 54.092,41 33.489,42 33.772,43 6.3,44 4.301}
{0 CHEMBL349130,1 8.969,2 42.9,3 36.4,4 1.048,5 1.15,6 0.66,7 0.67,8 690.65,9 5.2,10 24,11 77,13 27,14 53,16 81,17 33,20 25,21 8,22 3,23 6,24 28,25 16,28 4,29 6,32 49,34 6,35 7.8,36 0.123,37 10,38 68,39 80.701,40 88.516,41 50.796,42 51.576,43 7.8,44 6.301}
{0 CHEMBL349156,1 8.738,2 43.2,3 37.8,4 1.041,5 1.15,6 0.661,7 0.664,8 646.64,9 5.4,10 24,11 74,13 25,14 50,16 78,17 32,20 24,21 8,22 1,23 6,24 28,25 14,28 4,29 4,32 46,34 6,35 5.4,36 0.115,37 9,38 63,39 77.047,40 85.097,41 48.887,42 49.147,43 8.1,44 6.046}
{0 CHEMBL349207,1 9.417,2 42.9,3 35.1,4 1.052,5 1.149,6 0.671,7 0.681,8 725.09,9 5.2,10 24,11 77,13 27,14 54,16 81,17 33,18 1,20 25,21 8,22 3,23 6,24 27,25 17,26 1,28 4,29 6,32 50,34 7,35 7.8,36 0.123,37 10,38 69,39 81.025,40 88.46,41 51.654,42 52.404,43 9.1,44 6.046}
{0 CHEMBL349467,1 9.17,2 41.9,3 35.5,4 1.055,5 1.159,6 0.655,7 0.67,8 568.52,9 6.5,10 18,11 62,13 21,14 43,16 65,17 26,20 19,21 7,22 3,23 6,24 22,25 14,28 4,29 4,32 40,34 6,35 6.5,36 0.108,37 7,38 55,39 65.396,40 71.851,41 40.603,42 41.566,43 9.7,44 5.824}
{0 CHEMBL350294,1 8.329,2 41.3,3 41.3,4 1.036,5 1.158,6 0.646,7 0.642,8 624.66,9 5.3,10 18,11 75,13 19,14 48,16 79,17 31,20 19,21 12,22 1,23 7,24 31,25 13,28 4,29 2,32 44,34 7,35 2.7,36 0.089,37 7,38 58,39 77.672,40 86.848,41 48.438,42 48.154,43 9.3,44 5.77}
{0 CHEMBL350324,1 8.593,2 41.5,3 38.5,4 1.039,5 1.142,6 0.657,7 0.659,8 558.56,9 6.2,10 18,11 65,13 22,14 43,16 68,17 27,20 20,21 7,22 4,23 3,24 25,25 13,28 4,29 6,32 40,34 3,35 9.2,36 0.132,37 9,38 56,39 67.512,40 74.251,41 42.699,42 42.846,43 4.6,44 4.824}
{0 CHEMBL350937,1 8.697,2 40.3,3 39,4 1.046,5 1.16,6 0.644,7 0.65,8 669.66,9 6.5,10 18,11 77,13 21,14 51,16 81,17 31,20 19,21 12,22 3,23 7,24 30,25 16,28 5,29 4,32 47,34 7,35 5.2,36 0.099,37 8,38 63,39 80.545,40 89.35,41 49.591,42 50.078,43 9.1,44 6.155}
{0 CHEMBL350971,1 9.025,2 39,3 37.3,4 1.058,5 1.167,6 0.637,7 0.654,8 532.49,9 6.8,10 12,11 59,13 15,14 40,16 62,17 23,20 13,21 10,22 3,23 6,24 22,25 14,28 4,29 4,32 37,34 6,35 6.8,36 0.081,37 5,38 49,39 62.396,40 68.851,41 37.603,42 38.566,43 10.2,44 5.102}
{0 CHEMBL351225,1 10.035,2 45.1,3 35.2,4 1.047,5 1.149,6 0.686,7 0.688,8 712.5,9 4.2,10 24,11 71,13 25,14 50,15 1,16 75,17 32,20 25,21 7,22 1,23 7,24 25,25 14,26 1,28 3,29 3,32 46,34 8,35 4.2,36 0.107,37 8,38 63,39 74.359,40 81.571,41 48.716,42 48.819,43 11.3,44 6.097}
{0 CHEMBL352133,1 8.815,2 38.7,3 38.7,4 1.053,5 1.166,6 0.635,7 0.647,8 546.52,9 6.5,10 12,11 62,13 15,14 41,16 65,17 24,20 13,21 11,22 3,23 6,24 24,25 14,28 4,29 4,32 38,34 6,35 6.5,36 0.077,37 5,38 50,39 65.279,40 72.267,41 39.364,42 40.093,43 9.7,44 6.041}
{0 CHEMBL354960,1 10.873,2 43.2,3 27,4 1.094,5 1.171,6 0.669,7 0.713,8 804.61,9 2.7,10 24,11 74,13 28,14 57,16 77,17 32,20 26,21 6,22 4,23 12,24 20,25 22,26 1,28 2,29 7,31 1,32 54,34 12,35 9.5,36 0.143,37 11,38 73,39 80.978,40 86.687,41 49.512,42 52.735,43 16.2,44 5.071}
{0 CHEMBL355605,1 9.644,2 36.4,3 33.3,4 1.076,5 1.171,6 0.631,7 0.666,8 636.52,9 9.1,10 12,11 66,13 19,14 47,16 69,17 24,20 13,21 11,22 7,23 6,24 22,25 20,28 6,29 8,32 44,34 6,35 12.1,36 0.101,37 7,38 60,39 71.025,40 77.27,41 41.671,42 43.941,43 9.1,44 4.824}
{0 CHEMBL363545,1 8.339,2 50.7,3 38.8,4 1.003,5 1.101,6 0.726,7 0.693,8 558.69,9 3,10 34,11 67,13 37,14 46,16 72,17 34,20 33,21 1,22 3,24 26,25 7,26 1,28 2,29 4,31 1,32 41,35 6,36 0.111,37 8,38 66,39 67.192,40 73.737,41 48.614,42 46.411,44 4.553}
{0 CHEMBL363774,1 8.339,2 50.7,3 38.8,4 1.003,5 1.101,6 0.726,7 0.693,8 558.69,9 3,10 34,11 67,13 37,14 46,16 72,17 34,20 33,21 1,22 3,24 26,25 7,26 1,28 2,29 4,31 1,32 41,35 6,36 0.111,37 8,38 66,39 67.192,40 73.737,41 48.614,42 46.411,44 4.638}
{0 CHEMBL365025,1 7.807,2 46.4,3 43.5,4 0.999,5 1.11,6 0.698,7 0.659,8 538.71,9 2.9,10 28,11 69,13 31,14 43,16 73,17 32,20 27,21 5,22 3,24 30,25 7,26 1,28 2,29 4,31 1,32 39,35 5.8,36 0.11,37 8,38 60,39 68.96,40 76.567,41 48.137,42 45.464,44 4.542}
{0 CHEMBL399203,1 9.692,2 43.2,3 31.8,4 1.042,5 1.119,6 0.709,7 0.709,8 426.44,9 9.1,10 18,11 44,13 23,14 33,16 47,17 19,20 19,22 5,24 14,25 11,26 1,28 4,29 6,31 1,32 30,35 13.6,36 0.106,37 5,38 47,39 45.865,40 49.246,41 31.205,42 31.196,44 5.102}
{0 CHEMBL40180,1 8.325,2 41.7,3 43.8,4 1.001,5 1.114,6 0.71,7 0.659,8 399.58,9 6.3,10 11,11 48,13 15,14 29,16 50,17 20,20 16,21 4,22 4,24 21,25 7,26 2,28 3,29 2,31 2,32 27,35 4.2,36 0.12,37 6,38 38.5,39 48.065,40 53.491,41 34.074,42 31.609,44 5.097}
{0 CHEMBL407783,1 8.305,2 53.7,3 37.9,4 0.999,5 1.095,6 0.736,7 0.703,8 788.96,9 2.1,10 51,11 95,13 53,14 67,16 103,17 51,20 49,21 2,22 2,24 36,25 8,26 1,28 2,29 5,31 1,32 59,35 5.3,36 0.126,37 13,38 94.5,39 94.938,40 104.022,41 69.875,42 66.76,44 5.218}
{0 CHEMBL416333,1 7.066,2 40,3 48.6,4 1.004,5 1.127,6 0.642,7 0.611,8 494.64,9 2.9,10 12,11 70,13 16,14 38,16 72,17 28,20 17,21 11,22 4,24 34,25 8,28 2,29 6,32 36,35 8.6,36 0.181,37 13,38 48,39 70.305,40 78.896,41 44.921,42 42.76,44 5.629}
{0 CHEMBL419579,1 7.485,2 38.1,3 46,4 1.017,5 1.133,6 0.636,7 0.618,8 471.56,9 4.8,10 12,11 63,13 16,14 36,16 65,17 24,20 13,21 11,22 4,24 29,25 10,28 3,29 7,32 34,35 11.1,36 0.138,37 9,38 46,39 64.083,40 71.358,41 40.097,42 38.916,44 5.585}
{0 CHEMBL419935,1 7.353,2 39.1,3 46.9,4 1.014,5 1.129,6 0.638,7 0.616,8 470.57,9 3.1,10 12,11 64,13 16,14 36,16 66,17 25,20 14,21 11,22 4,24 30,25 9,28 2,29 7,32 34,35 10.9,36 0.136,37 9,38 46,39 64.865,40 72.275,41 40.852,42 39.422,44 6.42}
{0 CHEMBL420373,1 10.674,2 46.2,3 25.6,4 1.088,5 1.168,6 0.675,7 0.722,8 416.3,9 5.1,10 17,11 39,13 18,14 31,16 41,17 18,20 16,21 2,22 1,23 6,24 10,25 11,28 2,29 3,32 29,34 6,35 7.7,36 0.049,37 2,38 40.5,39 42.447,40 45.569,41 26.33,42 28.175,43 15.4,44 4.863}
{0 CHEMBL421503,1 8.373,2 52.3,3 36.4,4 1.008,5 1.103,6 0.721,7 0.702,8 368.41,9 4.5,10 18,11 44,13 22,14 31,16 47,17 23,20 23,22 4,24 16,25 5,28 2,29 3,32 28,35 6.8,36 0.064,37 3,38 44,39 44.371,40 48.531,41 31.705,42 30.875,44 5.066}
{0 CHEMBL423105,1 8.483,2 42.4,3 39,4 1.033,5 1.143,6 0.662,7 0.659,8 500.52,9 6.8,10 18,11 59,13 21,14 39,16 62,17 25,20 19,21 6,22 3,23 3,24 23,25 11,28 4,29 4,32 36,34 3,35 6.8,36 0.113,37 7,38 51,39 60.974,40 67.417,41 39.029,42 38.889,43 5.1,44 5.553}
{0 CHEMBL432430,1 6.56,2 39.1,3 52.2,4 0.993,5 1.129,6 0.634,7 0.592,8 452.65,9 2.9,10 12,11 69,13 14,14 35,16 71,17 27,20 14,21 13,22 2,24 36,25 6,28 2,29 4,32 33,35 5.8,36 0.141,37 10,38 43,39 68.534,40 77.893,41 43.773,42 40.858,44 5.495}
{0 CHEMBL432438,1 7.057,2 40.5,3 48.8,4 1.004,5 1.13,6 0.642,7 0.61,8 592.77,9 2.4,10 18,11 84,13 20,14 46,16 87,17 34,20 20,21 14,22 2,23 1,24 41,25 9,28 2,29 6,32 43,34 1,35 7.1,36 0.149,37 13,38 57,39 84.352,40 94.897,41 53.904,42 51.251,43 1.2,44 5.854}
{0 CHEMBL43826,1 8.399,2 53.3,3 37.8,4 1.004,5 1.098,6 0.731,7 0.701,8 755.9,9 1.1,10 46,11 90,13 48,14 63,16 97,17 48,20 46,21 2,22 2,23 1,24 34,25 8,26 1,28 1,29 5,31 1,32 56,34 1,35 5.6,36 0.134,37 13,38 88,39 90.349,40 98.863,41 65.807,42 63.121,43 1.1,44 6.62}
{0 CHEMBL442138,1 7.502,2 43.3,3 44.8,4 1.008,5 1.12,6 0.663,7 0.637,8 502.61,9 3,10 17,11 67,13 21,14 40,16 70,17 29,20 21,21 8,22 4,24 30,25 8,28 2,29 6,32 37,35 9,36 0.171,37 12,38 52.5,39 67.538,40 75.066,41 44.398,42 42.707,44 4.301}
{0 CHEMBL443700,1 10.948,2 42.4,3 27.3,4 1.098,5 1.18,6 0.664,7 0.709,8 722.55,9 3,10 18,11 66,13 23,14 50,16 68,17 28,20 22,21 6,22 5,23 12,24 18,25 20,26 1,28 2,29 5,31 1,32 48,34 12,35 7.6,36 0.132,37 9,38 64,39 72.439,40 77.853,41 43.841,42 46.779,43 18.2,44 4.893}
{0 CHEMBL444564,1 10.742,2 41.7,3 28.3,4 1.091,5 1.17,6 0.666,7 0.705,8 644.51,9 3.3,10 18,11 60,13 22,14 45,16 62,17 25,20 20,21 5,22 4,23 9,24 17,25 18,26 1,28 2,29 6,31 1,32 43,34 9,35 10,36 0.129,37 8,38 58,39 65.461,40 70.213,41 39.96,42 42.29,43 15,44 4.602}
{0 CHEMBL445317,1 8.815,2 38.7,3 38.7,4 1.053,5 1.166,6 0.635,7 0.647,8 546.52,9 6.5,10 12,11 62,13 15,14 41,16 65,17 24,20 13,21 11,22 3,23 6,24 24,25 14,28 4,29 4,32 38,34 6,35 6.5,36 0.077,37 5,38 50,39 65.279,40 72.267,41 39.364,42 40.093,43 9.7,44 6.056}
{0 CHEMBL44584,1 8.599,2 53.3,3 36.7,4 1.01,5 1.102,6 0.73,7 0.706,8 773.89,9 1.1,10 46,11 90,13 48,14 64,16 97,17 48,20 46,21 2,22 2,23 2,24 33,25 9,26 1,28 1,29 5,31 1,32 57,34 2,35 5.6,36 0.134,37 13,38 89,39 90.861,40 99.203,41 65.745,42 63.505,43 2.2,44 6.229}
{0 CHEMBL44639,1 8.302,2 52.8,3 38.2,4 1.001,5 1.097,6 0.732,7 0.699,8 738.9,9 2.2,10 46,11 89,13 48,14 62,16 96,17 47,20 45,21 2,22 2,24 34,25 8,26 1,28 2,29 5,31 1,32 55,35 5.6,36 0.135,37 13,38 87,39 89.054,40 97.607,41 65.114,42 62.233,44 5.62}
{0 CHEMBL447160,1 11.061,2 42.1,3 26.3,4 1.098,5 1.172,6 0.67,7 0.715,8 630.48,9 3.5,10 18,11 57,13 22,14 44,16 59,17 24,20 20,21 4,22 4,23 9,24 15,25 18,26 1,28 2,29 6,31 1,32 42,34 9,35 10.5,36 0.136,37 8,38 57,39 62.578,40 66.798,41 38.199,42 40.763,43 15.8,44 5.032}
{0 CHEMBL44779,1 8.184,2 52.2,3 39.1,4 0.999,5 1.098,6 0.727,7 0.693,8 752.93,9 2.2,10 46,11 92,13 48,14 63,16 99,17 48,20 45,21 3,22 2,24 36,25 8,26 1,28 2,29 5,31 1,32 56,35 5.4,36 0.131,37 13,38 88,39 91.938,40 101.022,41 66.875,42 63.759,44 5.606}
{0 CHEMBL44823,1 8.689,2 52.8,3 37.1,4 1.004,5 1.096,6 0.741,7 0.709,8 773.34,9 2.2,10 46,11 89,13 48,14 63,16 96,17 47,18 1,20 45,21 2,22 2,24 33,25 9,26 2,28 2,29 5,31 1,32 56,34 1,35 5.6,36 0.135,37 13,38 88,39 89.378,40 97.551,41 65.972,42 63.06,43 1.1,44 5.684}
{0 CHEMBL451106,1 10.653,2 42.4,3 28.8,4 1.087,5 1.17,6 0.67,7 0.705,8 628.51,9 3.4,10 18,11 59,13 22,14 44,16 61,17 25,20 20,21 5,22 4,23 9,24 17,25 17,26 1,28 2,29 5,31 1,32 42,34 9,35 8.5,36 0.115,37 7,38 57,39 64.134,40 69.003,41 39.506,42 41.575,43 15.3,44 4.215}
{0 CHEMBL452681,1 10.294,2 44.3,3 30,4 1.075,5 1.158,6 0.678,7 0.705,8 720.61,9 2.9,10 24,11 70,13 28,14 52,16 73,17 31,20 26,21 5,22 4,23 9,24 21,25 18,26 1,28 2,29 6,31 1,32 49,34 9,35 8.6,36 0.137,37 10,38 68,39 75.229,40 81.043,41 47.483,42 49.344,43 12.9,44 4.367}
{0 CHEMBL453012,1 7.821,2 40.6,3 43.8,4 1.026,5 1.124,6 0.644,7 0.633,8 500.54,10 12,11 64,13 16,14 38,16 66,17 26,20 16,21 10,22 4,24 28,25 10,29 10,32 36,35 15.6,36 0.121,37 8,38 48,39 65.643,40 71.907,41 41.205,42 40.523,44 5.481}
{0 CHEMBL453538,1 7.821,2 40.6,3 43.8,4 1.026,5 1.124,6 0.644,7 0.633,8 500.54,10 12,11 64,13 16,14 38,16 66,17 26,20 16,21 10,22 4,24 28,25 10,29 10,32 36,35 15.6,36 0.121,37 8,38 48,39 65.643,40 71.907,41 41.205,42 40.523,44 5.328}
{0 CHEMBL453706,1 10.19,2 40.9,3 31.8,4 1.079,5 1.167,6 0.659,7 0.687,8 672.57,9 3,10 18,11 66,13 22,14 47,16 68,17 27,20 20,21 7,22 4,23 9,24 21,25 18,26 1,28 2,29 6,31 1,32 45,34 9,35 9.1,36 0.147,37 10,38 60,39 71.229,40 77.043,41 43.483,42 45.344,43 13.6,44 4.678}
{0 CHEMBL453985,1 10.39,2 42.9,3 30.2,4 1.08,5 1.165,6 0.671,7 0.7,8 654.55,9 3.2,10 18,11 63,13 23,14 46,16 65,17 27,20 22,21 5,22 5,23 9,24 19,25 17,26 1,28 2,29 5,31 1,32 44,34 9,35 7.9,36 0.138,37 9,38 60,39 68.018,40 73.419,41 42.267,42 44.102,43 14.3,44 4.959}
{0 CHEMBL45498,1 8.582,2 53.3,3 37.8,4 1.002,5 1.094,6 0.741,7 0.706,8 772.35,9 1.1,10 46,11 90,13 48,14 63,16 97,17 48,18 1,20 46,21 2,22 2,24 34,25 8,26 2,28 1,29 5,31 1,32 56,34 1,35 5.6,36 0.134,37 13,38 88,39 90.16,40 98.468,41 66.728,42 63.566,43 1.1,44 6.886}
{0 CHEMBL455030,1 10.477,2 42.2,3 29.7,4 1.084,5 1.166,6 0.668,7 0.7,8 670.55,9 3.1,10 18,11 64,13 23,14 47,16 66,17 27,20 22,21 5,22 5,23 9,24 19,25 18,26 1,28 2,29 6,31 1,32 45,34 9,35 9.4,36 0.152,37 10,38 61,39 69.345,40 74.628,41 42.722,42 44.817,43 14.1,44 4.876}
{0 CHEMBL456532,1 11.234,2 41.9,3 25.8,4 1.106,5 1.184,6 0.663,7 0.714,8 696.51,9 3.2,10 18,11 62,13 22,14 48,16 64,17 26,20 20,21 6,22 4,23 12,24 16,25 20,26 1,28 2,29 5,31 1,32 46,34 12,35 8.1,36 0.109,37 7,38 61,39 68.556,40 73.438,41 41.08,42 44.252,43 19.4,44 5.301}
{0 CHEMBL45689,1 8.782,2 53.3,3 36.7,4 1.007,5 1.098,6 0.741,7 0.711,8 790.34,9 1.1,10 46,11 90,13 48,14 64,16 97,17 48,18 1,20 46,21 2,22 2,23 1,24 33,25 9,26 2,28 1,29 5,31 1,32 57,34 2,35 5.6,36 0.134,37 13,38 89,39 90.672,40 98.807,41 66.665,42 63.949,43 2.2,44 5.642}
{0 CHEMBL45789,1 8.288,2 52.6,3 38.1,4 1,5 1.098,6 0.731,7 0.699,8 803.98,9 3.1,10 51,11 97,13 53,14 68,16 105,17 51,20 49,21 2,22 2,24 37,25 9,26 1,28 3,29 5,31 1,32 60,35 5.2,36 0.133,37 14,38 95.5,39 97.04,40 106.52,41 70.881,42 67.781,44 5.536}
{0 CHEMBL459636,1 9.03,2 47.8,3 34.8,4 1.041,5 1.132,6 0.685,7 0.691,8 415.39,9 2.2,10 18,11 46,13 20,14 32,16 48,17 22,20 20,21 2,22 2,23 3,24 16,25 8,28 1,29 4,32 30,34 3,35 8.7,36 0.125,37 6,38 43,39 47.902,40 52.092,41 31.489,42 31.772,43 6.5,44 4.018}
{0 CHEMBL459846,1 10.114,2 42.1,3 31.6,4 1.071,5 1.154,6 0.673,7 0.695,8 576.51,9 3.5,10 18,11 57,13 22,14 41,16 59,17 24,20 20,21 4,22 4,23 6,24 18,25 15,26 1,28 2,29 6,31 1,32 39,34 6,35 10.5,36 0.136,37 8,38 54,39 61.04,40 65.778,41 38.386,42 39.613,43 10.5,44 4.097}
{0 CHEMBL460053,1 9.865,2 46.9,3 30.6,4 1.068,5 1.154,6 0.675,7 0.703,8 483.39,9 2,10 18,11 49,13 20,14 36,16 51,17 23,20 20,21 3,22 2,23 6,24 15,25 11,28 1,29 4,32 34,34 6,35 8.2,36 0.118,37 6,38 47,39 52.323,40 56.526,41 33.063,42 34.448,43 12.2,44 4.638}
{0 CHEMBL460054,1 10.604,2 46.2,3 26.9,4 1.091,5 1.172,6 0.666,7 0.714,8 551.39,9 1.9,10 18,11 52,13 20,14 40,16 54,17 24,20 20,21 4,22 2,23 9,24 14,25 14,28 1,29 4,32 38,34 9,35 7.7,36 0.111,37 6,38 51,39 56.745,40 60.96,41 34.637,42 37.125,43 17.3,44 4.842}
{0 CHEMBL460253,1 10.973,2 42.9,3 26.8,4 1.094,5 1.171,6 0.674,7 0.715,8 614.48,9 3.6,10 18,11 56,13 22,14 43,16 58,17 24,20 20,21 4,22 4,23 9,24 15,25 17,26 1,28 2,29 5,31 1,32 41,34 9,35 8.9,36 0.121,37 7,38 56,39 61.25,40 65.588,41 37.744,42 40.048,43 16.1,44 4.066}
{0 CHEMBL47330,1 8.743,2 52.2,3 37,4 1.009,5 1.097,6 0.735,7 0.706,8 804.35,9 1.1,10 46,11 92,13 48,14 65,16 99,17 48,18 1,20 46,21 2,22 2,24 34,25 10,26 2,28 1,29 7,31 1,32 58,34 1,35 7.6,36 0.152,37 15,38 90,39 92.814,40 100.887,41 67.637,42 64.995,43 1.1,44 7}
{0 CHEMBL47879,1 8.687,2 50.7,3 38.4,4 1.007,5 1.099,6 0.732,7 0.698,8 634.18,9 1.4,10 34,11 73,13 36,14 50,16 78,17 37,18 1,20 34,21 3,22 2,24 28,25 8,26 2,28 1,29 5,31 1,32 45,34 1,35 6.8,36 0.154,37 12,38 69,39 73.509,40 80.222,41 53.443,42 50.985,43 1.4,44 6.328}
{0 CHEMBL48336,1 7.717,2 43.1,3 45.1,4 0.997,5 1.117,6 0.69,7 0.646,8 393.55,9 5.9,10 12,11 51,13 16,14 30,16 53,17 22,20 18,21 4,22 4,24 23,25 6,26 1,28 3,29 2,31 1,32 28,35 3.9,36 0.113,37 6,38 40,39 50.872,40 56.986,41 35.188,42 32.949,44 4.292}
{0 CHEMBL49073,1 8.009,2 47.5,3 40,4 1.009,5 1.113,6 0.693,7 0.672,8 320.37,9 5,10 12,11 40,13 16,14 26,16 42,17 19,20 18,21 1,22 4,24 16,25 5,28 2,29 3,32 24,35 7.5,36 0.071,37 3,38 36,39 40.371,40 44.531,41 27.705,42 26.875,44 4.226}
{0 CHEMBL501289,1 10.655,2 41.2,3 29.4,4 1.093,5 1.18,6 0.656,7 0.696,8 724.57,9 2.9,10 18,11 68,13 22,14 50,16 70,17 28,20 20,21 8,22 4,23 12,24 20,25 20,26 1,28 2,29 5,31 1,32 48,34 12,35 7.4,36 0.129,37 9,38 63,39 74.323,40 80.268,41 44.603,42 47.305,43 17.6,44 5.076}
{0 CHEMBL503344,1 9.731,2 40.3,3 34.7,4 1.069,5 1.165,6 0.653,7 0.672,8 700.63,9 2.8,10 18,11 72,13 22,14 49,16 74,17 29,20 20,21 9,22 4,23 9,24 25,25 18,26 1,28 2,29 6,31 1,32 47,34 9,35 8.3,36 0.162,37 12,38 62,39 76.996,40 83.874,41 47.006,42 48.397,43 12.5,44 4.827}
{0 CHEMBL503437,1 11.061,2 42.1,3 26.3,4 1.098,5 1.172,6 0.67,7 0.715,8 630.48,9 3.5,10 18,11 57,13 22,14 44,16 59,17 24,20 20,21 4,22 4,23 9,24 15,25 18,26 1,28 2,29 6,31 1,32 42,34 9,35 10.5,36 0.136,37 8,38 57,39 62.578,40 66.798,41 38.199,42 40.763,43 15.8,44 4.812}
{0 CHEMBL506887,1 10.731,2 44.4,3 27.8,4 1.088,5 1.17,6 0.675,7 0.713,8 772.61,9 2.8,10 24,11 72,13 28,14 55,16 75,17 32,20 26,21 6,22 4,23 12,24 20,25 20,26 1,28 2,29 5,31 1,32 52,34 12,35 6.9,36 0.12,37 9,38 71,39 78.323,40 84.268,41 48.603,42 51.305,43 16.7,44 5.268}
{0 CHEMBL509880,1 7.821,2 40.6,3 43.8,4 1.026,5 1.124,6 0.644,7 0.633,8 500.54,10 12,11 64,13 16,14 38,16 66,17 26,20 16,21 10,22 4,24 28,25 10,29 10,32 36,35 15.6,36 0.121,37 8,38 48,39 65.643,40 71.907,41 41.205,42 40.523,44 5.276}
{0 CHEMBL518173,1 10.973,2 42.9,3 26.8,4 1.094,5 1.171,6 0.674,7 0.715,8 614.48,9 3.6,10 18,11 56,13 22,14 43,16 58,17 24,20 20,21 4,22 4,23 9,24 15,25 17,26 1,28 2,29 5,31 1,32 41,34 9,35 8.9,36 0.121,37 7,38 56,39 61.25,40 65.588,41 37.744,42 40.048,43 16.1,44 5.347}
{0 CHEMBL518322,1 10.99,2 43.4,3 26.4,4 1.092,5 1.167,6 0.68,7 0.72,8 582.46,9 3.8,10 18,11 53,13 22,14 41,16 55,17 23,20 20,21 3,22 4,23 8,24 14,25 16,26 1,28 2,29 5,31 1,32 39,34 8,35 9.4,36 0.127,37 7,38 54,39 57.854,40 61.833,41 36.046,42 38.138,43 15.1,44 4.524}
{0 CHEMBL518778,1 10.961,2 43.4,3 28.3,4 1.078,5 1.153,6 0.699,7 0.721,8 580.92,9 3.8,10 18,11 53,13 22,14 40,16 55,17 23,18 1,20 20,21 3,22 4,23 6,24 15,25 15,26 2,28 2,29 5,31 1,32 38,34 7,35 9.4,36 0.127,37 7,38 53,39 57.152,40 61.098,41 37.028,42 38.199,43 13.2,44 4.125}
{0 CHEMBL544314,1 8.325,2 41.7,3 43.8,4 1.001,5 1.114,6 0.71,7 0.659,8 399.58,9 6.3,10 11,11 48,13 15,14 29,16 50,17 20,20 16,21 4,22 4,24 21,25 7,26 2,28 3,29 2,31 2,32 27,35 4.2,36 0.12,37 6,38 38.5,39 48.065,40 53.491,41 34.074,42 31.609,44 5.456}
{0 CHEMBL593180,1 8.499,2 47.1,3 37.3,4 1.026,5 1.112,6 0.687,7 0.682,8 433.44,9 2,10 16,11 51,13 21,14 35,16 54,17 24,20 22,21 2,22 5,24 19,25 8,28 1,29 7,32 32,35 13.7,36 0.13,37 7,38 48,39 52.345,40 56.701,41 35.04,42 34.766,44 5.959}
{0 CHEMBL593190,1 8.269,2 50,3 38,4 1.014,5 1.106,6 0.703,7 0.687,8 413.45,9 2,10 17,11 50,13 22,14 34,16 53,17 25,20 24,21 1,22 5,24 19,25 6,28 1,29 5,32 31,35 10,36 0.113,37 6,38 47.5,39 50.691,40 55.282,41 35.131,42 34.337,44 6.187}
{0 CHEMBL595029,1 8.643,2 53.7,3 34.1,4 1.012,5 1.1,6 0.73,7 0.716,8 354.38,9 4.9,10 16,11 41,13 21,14 30,16 44,17 22,19 1,20 21,22 4,24 14,25 5,28 2,29 3,32 27,33 1,35 7.3,36 0.091,37 4,38 44,39 41.487,40 45.116,41 29.943,42 29.348,44 5.921}
{0 CHEMBL595873,1 8.14,2 47.8,3 39.1,4 1.013,5 1.112,6 0.694,7 0.676,8 374.42,9 4.3,10 17,11 46,13 20,14 31,16 49,17 22,20 20,21 2,22 3,24 18,25 6,28 2,29 4,32 28,35 8.7,36 0.102,37 5,38 42.5,39 46.582,40 51.156,41 31.921,42 31.116,44 5.108}
{0 CHEMBL595977,1 7.77,2 50,3 41.3,4 1.001,5 1.106,6 0.7,7 0.672,8 357.43,9 2.2,10 17,11 46,13 20,14 30,16 49,17 23,20 21,21 2,22 3,24 19,25 4,28 1,29 3,32 27,35 6.5,36 0.082,37 4,38 41.5,39 46.036,40 50.863,41 32.222,42 30.907,44 6.027}
{0 CHEMBL596879,1 8.568,2 34.6,3 44.2,4 1.031,5 1.127,6 0.66,7 0.633,8 445.56,9 1.9,10 12,11 52,13 16,14 30,16 53,17 18,20 12,21 6,22 4,24 23,25 11,26 2,28 1,29 8,31 2,32 29,35 15.4,36 0.17,37 9,38 40,39 53.593,40 58.581,41 34.313,42 32.909,44 6.547}
{0 CHEMBL596880,1 9.607,2 40.4,3 36.2,4 1.041,5 1.114,6 0.703,7 0.688,8 451.51,9 2.1,10 18,11 47,13 22,14 32,16 49,17 19,20 18,21 1,22 4,24 17,25 11,26 2,28 1,29 8,31 2,32 30,35 17,36 0.122,37 6,38 45,39 48.942,40 52.335,41 33.028,42 32.328,44 5.317}
{0 CHEMBL597478,1 9.383,2 34.9,3 39.5,4 1.045,5 1.124,6 0.675,7 0.659,8 403.47,9 2.3,10 12,11 43,13 16,14 27,16 44,17 15,20 12,21 3,22 4,24 17,25 11,26 2,28 1,29 8,31 2,32 26,35 18.6,36 0.136,37 6,38 37,39 44.942,40 48.335,41 29.028,42 28.328,44 5.573}
{0 CHEMBL599742,1 8.529,2 33.3,3 44.4,4 1.031,5 1.131,6 0.654,7 0.628,8 460.58,9 3.7,10 12,11 54,13 16,14 31,16 55,17 18,20 12,21 6,22 4,24 24,25 12,26 2,28 2,29 8,31 2,32 30,35 14.8,36 0.164,37 9,38 41,39 55.694,40 61.079,41 35.318,42 33.93,44 5.031}
{0 CHEMBL601265,1 8.871,2 36,3 42,4 1.034,5 1.123,6 0.671,7 0.648,8 443.54,9 2,10 12,11 50,13 16,14 31,16 52,17 18,20 12,21 6,22 4,24 21,25 11,26 2,28 1,29 8,31 2,32 29,35 16,36 0.096,37 5,38 41,39 51.709,40 56.166,41 33.551,42 32.382,44 6.226}
{0 CHEMBL603204,1 8.111,2 51,3 38.8,4 1.007,5 1.104,6 0.708,7 0.686,8 397.45,9 2,10 18,11 49,13 22,14 33,16 52,17 25,20 24,21 1,22 4,24 19,25 5,28 1,29 4,32 30,35 8.2,36 0.115,37 6,38 46,39 49.363,40 54.073,41 34.676,42 33.622,44 5.018}
{0 CHEMBL604256,1 8.683,2 51.2,3 34.9,4 1.021,5 1.104,6 0.712,7 0.704,8 373.38,9 2.3,10 16,11 43,13 21,14 31,16 46,17 22,20 22,22 5,24 15,25 6,28 1,29 5,32 28,35 11.6,36 0.109,37 5,38 44,39 43.924,40 47.452,41 30.608,42 30.283,44 5.824}
{0 CHEMBL605291,1 8.814,2 47.1,3 37.3,4 1.021,5 1.106,6 0.71,7 0.691,8 449.51,9 2,10 16,11 51,13 21,14 35,16 54,17 24,20 22,21 2,22 5,24 19,25 8,26 1,28 1,29 6,31 1,32 32,35 11.8,36 0.13,37 7,38 48,39 52.094,40 56.412,41 36.233,42 35.238,44 6.161}
{0 CHEMBL73874,1 9.508,2 47.9,3 31.3,4 1.051,5 1.133,6 0.691,7 0.708,8 456.4,9 4.2,10 23,11 48,13 24,14 36,16 51,17 23,20 22,21 1,22 1,23 3,24 15,25 10,28 2,29 5,32 33,34 3,35 10.4,36 0.098,37 5,38 48.5,39 50.447,40 54.384,41 33.188,42 33.981,43 6.3,44 6}
{0 CHEMBL74798,1 8.741,2 51.2,3 34.1,4 1.02,5 1.105,6 0.717,7 0.709,8 358.37,9 4.9,10 17,11 41,13 21,14 30,16 44,17 21,20 21,22 4,24 14,25 6,28 2,29 4,32 27,35 9.8,36 0.068,37 3,38 42.5,39 41.814,40 45.325,41 29.398,42 29.063,44 5.721}
{0 CHEMBL76247,1 7.846,2 49,3 40.8,4 1.003,5 1.109,6 0.699,7 0.672,8 384.46,9 4.1,10 18,11 49,13 21,14 32,16 52,17 24,20 21,21 3,22 3,24 20,25 5,28 2,29 3,32 29,35 6.1,36 0.115,37 6,38 44,39 49.138,40 54.362,41 34.228,42 32.928,44 4.745}
{0 CHEMBL76315,1 8.182,2 51.7,3 37.9,4 1.006,5 1.103,6 0.715,7 0.693,8 237.27,9 3.4,10 17,11 29,13 17,14 20,16 31,17 15,20 15,24 11,25 3,28 1,29 2,32 18,35 6.9,36 0.032,37 1,38 28.5,39 29.174,40 31.993,41 20.722,42 20.085,44 4.301}
{0 CHEMBL76604,1 7.737,2 47.3,3 41.8,4 1.002,5 1.114,6 0.691,7 0.663,8 425.52,9 5.5,10 18,11 55,13 22,14 35,16 58,17 26,20 23,21 3,22 4,24 23,25 6,28 3,29 3,32 32,35 5.5,36 0.121,37 7,38 48,39 55.123,40 61.275,41 37.995,42 36.477,44 6}
{0 CHEMBL76862,1 8.802,2 51.7,3 34.5,4 1.024,5 1.115,6 0.712,7 0.706,8 255.26,9 3.4,10 17,11 29,13 17,14 21,16 31,17 15,20 15,23 1,24 10,25 4,28 1,29 2,32 19,34 1,35 6.9,36 0.032,37 1,38 29.5,39 29.687,40 32.333,41 20.659,42 20.468,43 3.4,44 4.403}
{0 CHEMBL77246,1 7.898,2 46.3,3 40.7,4 1.006,5 1.118,6 0.69,7 0.666,8 426.51,9 7.4,10 18,11 54,13 22,14 35,16 57,17 25,20 22,21 3,22 4,24 22,25 7,28 4,29 3,32 32,35 5.6,36 0.123,37 7,38 48,39 54.342,40 60.358,41 37.239,42 35.971,44 6.523}
{0 CHEMBL77248,1 7.898,2 46.3,3 40.7,4 1.006,5 1.118,6 0.69,7 0.666,8 426.51,9 7.4,10 18,11 54,13 22,14 35,16 57,17 25,20 22,21 3,22 4,24 22,25 7,28 4,29 3,32 32,35 5.6,36 0.123,37 7,38 48,39 54.342,40 60.358,41 37.239,42 35.971,44 4.301}
{0 CHEMBL77322,1 7.578,2 46.6,3 43.1,4 1,5 1.115,6 0.685,7 0.655,8 439.55,9 5.2,10 18,11 58,13 22,14 36,16 61,17 27,20 23,21 4,22 4,24 25,25 6,28 3,29 3,32 33,35 5.2,36 0.115,37 7,38 49,39 58.007,40 64.69,41 39.756,42 38.003,44 4.921}
{0 CHEMBL77549,1 9.538,2 48.5,3 33.3,4 1.028,5 1.11,6 0.728,7 0.717,8 314.74,9 6.1,10 17,11 33,13 18,14 24,16 35,17 16,18 1,20 16,22 1,24 11,25 6,26 1,28 2,29 3,32 22,34 1,35 9.1,36 0.057,37 2,38 33.5,39 33.927,40 36.645,41 24.04,42 23.649,43 3,44 4.62}
{0 CHEMBL78105,1 10.581,2 48.5,3 30.3,4 1.038,5 1.109,6 0.754,7 0.742,8 349.18,9 6.1,10 17,11 33,13 18,14 25,16 35,17 16,18 2,20 16,22 1,24 10,25 7,26 2,28 2,29 3,32 23,34 2,35 9.1,36 0.057,37 2,38 34.5,39 34.251,40 36.589,41 24.898,42 24.476,43 6.1,44 4.854}
{0 CHEMBL84631,1 8.009,2 44.9,3 40.8,4 1.016,5 1.118,6 0.676,7 0.66,8 392.44,9 4.1,10 12,11 49,13 17,14 31,16 51,17 22,20 19,21 3,22 5,24 20,25 7,28 2,29 5,32 29,35 10.2,36 0.137,37 7,38 42,39 49.793,40 54.78,41 33.137,42 32.358,44 4.699}
{0 CHEMBL85229,1 8.262,2 40.4,3 44.2,4 1.005,5 1.118,6 0.698,7 0.651,8 429.61,9 5.8,10 11,11 52,13 15,14 31,16 54,17 21,20 16,21 5,22 4,24 23,25 8,26 2,28 3,29 3,31 2,32 29,35 5.8,36 0.13,37 7,38 40.5,39 52.276,40 58.115,41 36.29,42 33.851,44 4.963}
{0 CHEMBL86361,1 8.474,2 46.5,3 37.2,4 1.024,5 1.115,6 0.689,7 0.681,8 364.38,9 4.7,10 12,11 43,13 17,14 29,16 45,17 20,20 19,21 1,22 5,24 16,25 7,28 2,29 5,32 27,35 11.6,36 0.111,37 5,38 40,39 44.025,40 47.95,41 29.614,42 29.304,44 4.602}
{0 CHEMBL86470,1 8.149,2 43.1,3 41.7,4 1.013,5 1.119,6 0.685,7 0.658,8 586.72,9 5.6,10 17,11 72,13 24,14 45,16 75,17 31,20 25,21 6,22 7,24 30,25 11,26 1,28 4,29 6,31 1,32 42,35 8.3,36 0.16,37 12,38 60.5,39 72.934,40 80.567,41 49.296,42 47.41,44 6.284}
{0 CHEMBL86497,1 9.968,2 41.7,3 41.7,4 1.006,5 1.111,6 0.738,7 0.68,8 478.47,9 6.3,10 11,11 48,13 15,14 30,15 1,16 50,17 20,20 16,21 4,22 4,24 20,25 8,26 3,28 3,29 2,31 2,32 28,34 1,35 4.2,36 0.12,37 6,38 39.5,39 48.294,40 53.332,41 35.426,42 32.634,43 2.1,44 4.883}
{0 CHEMBL86652,1 7.882,2 42.3,3 43.6,4 1.009,5 1.12,6 0.677,7 0.647,8 614.78,9 5.1,10 17,11 78,13 24,14 47,16 81,17 33,20 25,21 8,22 7,24 34,25 11,26 1,28 4,29 6,31 1,32 44,35 7.7,36 0.173,37 14,38 62.5,39 78.701,40 87.398,41 52.818,42 50.463,44 6.409}
{0 CHEMBL86748,1 8.481,2 40.8,3 42.9,4 1.008,5 1.116,6 0.705,7 0.66,8 415.58,9 6.1,10 11,11 49,13 16,14 30,16 51,17 20,20 16,21 4,22 5,24 21,25 8,26 2,28 3,29 3,31 2,32 28,35 6.1,36 0.118,37 6,38 40.5,39 49.393,40 54.7,41 34.529,42 32.324,44 4.602}
{0 CHEMBL86980,1 8.665,2 42.9,3 40.8,4 1.006,5 1.114,6 0.721,7 0.676,8 424.59,9 8.2,10 11,11 49,13 16,14 31,16 51,17 21,19 1,20 16,21 4,22 4,24 20,25 8,26 2,28 4,29 2,31 2,32 29,33 1,35 4.1,36 0.118,37 6,38 42.5,39 49.283,40 54.574,41 35.318,42 33.104,44 4.602}
{0 CHEMBL87573,1 9.968,2 41.7,3 41.7,4 1.006,5 1.111,6 0.738,7 0.68,8 478.47,9 6.3,10 11,11 48,13 15,14 30,15 1,16 50,17 20,20 16,21 4,22 4,24 20,25 8,26 3,28 3,29 2,31 2,32 28,34 1,35 4.2,36 0.12,37 6,38 39.5,39 48.294,40 53.332,41 35.426,42 32.634,43 2.1,44 4.602}
{0 CHEMBL87628,1 9.042,2 41.7,3 41.7,4 1.008,5 1.113,6 0.728,7 0.676,8 434.02,9 6.3,10 11,11 48,13 15,14 30,16 50,17 20,18 1,20 16,21 4,22 4,24 20,25 8,26 3,28 3,29 2,31 2,32 28,34 1,35 4.2,36 0.12,37 6,38 39.5,39 48.389,40 53.435,41 34.932,42 32.437,43 2.1,44 4.602}
{0 CHEMBL87651,1 7.817,2 44.2,3 42.3,4 1.013,5 1.119,6 0.671,7 0.652,8 406.47,9 3.8,10 12,11 52,13 17,14 32,16 54,17 23,20 19,21 4,22 5,24 22,25 7,28 2,29 5,32 30,35 9.6,36 0.148,37 8,38 43,39 52.676,40 58.196,41 34.898,42 33.885,44 4.824}
{0 CHEMBL87654,1 7.968,2 43.1,3 43.1,4 1.01,5 1.118,6 0.681,7 0.652,8 573.72,9 4.2,10 17,11 72,13 23,14 44,16 75,17 31,20 24,21 7,22 6,24 31,25 10,26 1,28 3,29 6,31 1,32 41,35 8.3,36 0.173,37 13,38 58.5,39 72.716,40 80.484,41 49.051,42 46.915,44 6.585}
{0 CHEMBL87819,1 7.99,2 41.7,3 43.8,4 1.007,5 1.12,6 0.685,7 0.649,8 383.51,9 6.3,10 11,11 48,13 15,14 29,16 50,17 20,20 16,21 4,22 4,24 21,25 7,26 1,28 3,29 3,31 1,32 27,35 6.3,36 0.12,37 6,38 38.5,39 48.316,40 53.78,41 32.881,42 31.137,44 4.602}
{0 CHEMBL87927,1 8.894,2 42.4,3 40.7,4 1.008,5 1.111,6 0.728,7 0.679,8 524.74,9 6.8,10 16,11 59,13 21,14 38,16 62,17 25,20 21,21 4,22 5,24 24,25 10,26 3,28 4,29 3,31 3,32 35,35 5.1,36 0.129,37 8,38 51,39 59.454,40 65.533,41 42.943,42 40.059,44 5.509}
{0 CHEMBL89665,1 8.474,2 40.7,3 42.6,4 1.011,5 1.117,6 0.699,7 0.659,8 457.62,9 5.6,10 11,11 54,13 16,14 33,16 56,17 22,20 17,21 5,22 5,24 23,25 9,26 2,28 3,29 4,31 2,32 31,35 7.4,36 0.143,37 8,38 43.5,39 54.603,40 60.325,41 37.744,42 35.566,44 4.752}
{0 CHEMBL90163,1 8.01,2 42.7,3 42.7,4 1.011,5 1.12,6 0.681,7 0.652,8 600.75,9 5.3,10 17,11 75,13 24,14 46,16 78,17 32,20 25,21 7,22 7,24 32,25 11,26 1,28 4,29 6,31 1,32 43,35 8,36 0.167,37 13,38 61.5,39 75.818,40 83.982,41 51.057,42 48.937,44 5.321}
{0 CHEMBL9867,1 7.631,2 45.9,3 43.2,4 1.006,5 1.115,6 0.678,7 0.652,8 564.68,9 2.7,10 28,11 74,13 30,14 46,16 78,17 34,20 27,21 7,22 2,24 32,25 8,28 2,29 6,32 42,35 8.1,36 0.154,37 12,38 62,39 74.421,40 82.481,41 50.159,42 48.234,44 6.222}
{0 CHEMBL9932,1 7.266,2 39.2,3 47.3,4 1.01,5 1.13,6 0.64,7 0.615,8 537.67,9 4.1,10 12,11 74,13 16,14 42,16 77,17 29,20 17,21 12,22 4,24 35,25 10,28 3,29 7,32 39,35 9.5,36 0.169,37 13,38 52,39 74.734,40 83.604,41 47.381,42 45.497,44 4.301}
{0 CHEMBL9962,1 7.898,2 39.7,3 42.9,4 1.024,5 1.129,6 0.647,7 0.637,8 497.55,9 4.8,10 12,11 63,13 18,14 38,16 65,17 25,20 17,21 8,22 6,24 27,25 11,28 3,29 8,32 36,35 12.7,36 0.2,37 13,38 50,39 64.527,40 71.153,41 40.79,42 40.104,44 5.372}
{0 CHEMBL9994,1 8.181,2 41.4,3 41.4,4 1.031,5 1.136,6 0.651,7 0.645,8 474.5,9 3.4,10 17,11 58,13 19,14 36,16 60,17 24,20 17,21 7,22 2,23 2,24 24,25 10,28 2,29 6,32 34,34 2,35 10.3,36 0.183,37 11,38 46.5,39 59.796,40 65.915,41 37.75,42 37.42,43 3.4,44 5.629}
