{
  "data_set_description": {
    "collection_date": "November 2013",
    "creator": "Dr Jeremy Besnard, Dr Ivan Olier, Dr Noureddin Sadawi, Dr Larisa Soldatova, Dr Crina Grosan, Prof Ross King, Dr Richard Bickerton, Prof Andrew Hopkins and Dr Willem van Hoorn",
    "default_target_attribute": "pXC50",
    "description": "This dataset contains QSAR data (from ChEMBL version 17) showing activity values (unit is pseudo-pCI50) of several compounds on drug target ChEMBL_ID: CHEMBL3507 (TID: 11010), and it has 22 rows and 1179 features (not including molecule IDs and class feature: molecule_id and pXC50). The features represent Molecular Descriptors which were generated from SMILES strings. Missing value imputation was applied to this dataset (By choosing the Median).",
    "description_version": "1",
    "file_id": "3563478",
    "format": "ARFF",
    "id": "35617",
    "licence": "Public",
    "md5_checksum": "900e230ffcf73b46af59cebddb82d5a6",
    "minio_url": "https://data.openml.org/datasets/0003/35617/dataset_35617.pq",
    "name": "QSAR-DATASET-FOR-DRUG-TARGET-CHEMBL3507",
    "original_data_url": "https://www.ebi.ac.uk/chembl/target/inspect/CHEMBL3507",
    "parquet_url": "https://data.openml.org/datasets/0003/35617/dataset_35617.pq",
    "processing_date": "2018-10-04 04:46:08",
    "row_id_attribute": "molecule_id",
    "status": "deactivated",
    "tag": [
      "MetaQSAR",
      "study_13"
    ],
    "upload_date": "2016-07-15T18:32:00",
    "url": "https://api.openml.org/data/v1/download/3563478/QSAR-DATASET-FOR-DRUG-TARGET-CHEMBL3507.arff",
    "version": "11",
    "visibility": "public"
  }
}