{
  "data_set_description": {
    "collection_date": "November 2013",
    "creator": "Dr Jeremy Besnard, Dr Ivan Olier, Dr Noureddin Sadawi, Dr Larisa Soldatova, Dr Crina Grosan, Prof Ross King, Dr Richard Bickerton, Prof Andrew Hopkins and Dr Willem van Hoorn",
    "default_target_attribute": "pXC50",
    "description": "This dataset contains QSAR data (from ChEMBL version 17) showing activity values (unit is pseudo-pCI50) of several compounds on drug target ChEMBL_ID: CHEMBL2903 (TID: 12054), and it has 246 rows and 1305 features (not including molecule IDs and class feature: molecule_id and pXC50). The features represent Molecular Descriptors which were generated from SMILES strings. Missing value imputation was applied to this dataset (By choosing the Median).",
    "description_version": "1",
    "file_id": "3562691",
    "format": "ARFF",
    "id": "35594",
    "licence": "Public",
    "md5_checksum": "d05083a7073fb49337b2c6fc95a90cef",
    "minio_url": "https://data.openml.org/datasets/0003/35594/dataset_35594.pq",
    "name": "QSAR-DATASET-FOR-DRUG-TARGET-CHEMBL2903",
    "original_data_url": "https://www.ebi.ac.uk/chembl/target/inspect/CHEMBL2903",
    "parquet_url": "https://data.openml.org/datasets/0003/35594/dataset_35594.pq",
    "processing_date": "2018-10-04 04:42:20",
    "row_id_attribute": "molecule_id",
    "status": "deactivated",
    "tag": [
      "MetaQSAR",
      "study_13"
    ],
    "upload_date": "2016-07-15T18:28:07",
    "url": "https://api.openml.org/data/v1/download/3562691/QSAR-DATASET-FOR-DRUG-TARGET-CHEMBL2903.arff",
    "version": "10",
    "visibility": "public"
  }
}