"molecule_id","AMW","C.","H.","Me","Mi","Mp","Mv","MW","N.","nAB","nAT","nB","nBM","nBO","nBR","nBT","nC","nCL","nCsp","nCsp2","nCsp3","nDB","nF","nH","nHet","nHM","nI","nN","nO","nP","nS","nSK","nTB","nX","O.","RBF","RBN","SCBO","Se","Si","Sp","Sv","X.","pXC50"
{1 8.768,2 44,3 36,4 1.038,5 1.12,6 0.675,7 0.68,8 219.21,9 4,10 6,11 25,13 9,14 17,16 26,17 11,20 10,21 1,22 3,24 9,25 5,28 1,29 4,32 16,35 16,36 0.077,37 2,38 23,39 25.945,40 27.997,41 16.869,42 16.988,44 5.021}
{0 CHEMBL1269381,1 8.33,2 42.9,3 39.3,4 1.03,5 1.122,6 0.665,7 0.661,8 233.24,9 3.6,10 6,11 28,13 9,14 18,16 29,17 12,20 10,21 2,22 3,24 11,25 5,28 1,29 4,32 17,35 14.3,36 0.069,37 2,38 24,39 28.829,40 31.412,41 18.631,42 18.515,44 4.618}
{0 CHEMBL1269382,1 8.33,2 42.9,3 39.3,4 1.03,5 1.122,6 0.665,7 0.661,8 233.24,9 3.6,10 6,11 28,13 9,14 18,16 29,17 12,20 10,21 2,22 3,24 11,25 5,28 1,29 4,32 17,35 14.3,36 0.069,37 2,38 24,39 28.829,40 31.412,41 18.631,42 18.515,44 4.636}
{0 CHEMBL1269407,1 9.488,2 44,3 32,4 1.058,5 1.133,6 0.672,7 0.695,8 237.2,9 4,10 6,11 25,13 9,14 18,16 26,17 11,20 10,21 1,22 3,23 1,24 8,25 6,28 1,29 4,32 17,34 1,35 16,36 0.077,37 2,38 24,39 26.458,40 28.336,41 16.807,42 17.371,43 4,44 4.939}
{0 CHEMBL1269408,1 10.146,2 44,3 32,4 1.051,5 1.118,6 0.709,7 0.713,8 253.65,9 4,10 6,11 25,13 9,14 18,16 26,17 11,18 1,20 10,21 1,22 3,24 8,25 6,26 1,28 1,29 4,32 17,34 1,35 16,36 0.077,37 2,38 24,39 26.269,40 27.941,41 17.727,42 17.815,43 4,44 4.648}
{0 CHEMBL1269409,1 9.786,2 40.7,3 29.6,4 1.067,5 1.13,6 0.668,7 0.7,8 264.21,9 7.4,10 6,11 27,13 11,14 20,16 28,17 11,20 10,21 1,22 5,24 8,25 8,28 2,29 6,32 19,35 22.2,36 0.107,37 3,38 28,39 28.818,40 30.499,41 18.023,42 18.912,44 4.55}
{0 CHEMBL1269410,1 8.33,2 42.9,3 39.3,4 1.03,5 1.122,6 0.665,7 0.661,8 233.24,9 3.6,10 6,11 28,13 9,14 18,16 29,17 12,20 10,21 2,22 3,24 11,25 5,28 1,29 4,32 17,35 14.3,36 0.069,37 2,38 24,39 28.829,40 31.412,41 18.631,42 18.515,44 4.74}
{0 CHEMBL1269430,1 9.488,2 44,3 32,4 1.058,5 1.133,6 0.672,7 0.695,8 237.2,9 4,10 6,11 25,13 9,14 18,16 26,17 11,20 10,21 1,22 3,23 1,24 8,25 6,28 1,29 4,32 17,34 1,35 16,36 0.077,37 2,38 24,39 26.458,40 28.336,41 16.807,42 17.371,43 4,44 4.523}
{0 CHEMBL1269431,1 10.146,2 44,3 32,4 1.051,5 1.118,6 0.709,7 0.713,8 253.65,9 4,10 6,11 25,13 9,14 18,16 26,17 11,18 1,20 10,21 1,22 3,24 8,25 6,26 1,28 1,29 4,32 17,34 1,35 16,36 0.077,37 2,38 24,39 26.269,40 27.941,41 17.727,42 17.815,43 4,44 4.447}
{0 CHEMBL1269432,1 9.786,2 40.7,3 29.6,4 1.067,5 1.13,6 0.668,7 0.7,8 264.21,9 7.4,10 6,11 27,13 11,14 20,16 28,17 11,20 10,21 1,22 5,24 8,25 8,28 2,29 6,32 19,35 22.2,36 0.107,37 3,38 28,39 28.818,40 30.499,41 18.023,42 18.912,44 4.693}
{0 CHEMBL1270877,1 9.157,2 38.2,3 38.2,4 1.042,5 1.123,6 0.675,7 0.666,8 311.34,9 2.9,10 6,11 34,13 11,14 22,16 35,17 13,20 10,21 3,22 5,24 13,25 8,26 1,28 1,29 6,31 1,32 21,35 17.6,36 0.114,37 4,38 30,39 35.444,40 38.166,41 22.949,42 22.658,44 4.747}
{0 CHEMBL2024253,1 7.253,2 43.9,3 46.3,4 1.001,5 1.119,6 0.664,7 0.632,8 297.38,9 2.4,10 12,11 41,13 14,14 23,16 42,17 18,20 14,21 4,22 2,24 19,25 4,28 1,29 3,32 22,35 7.3,36 0.167,37 7,38 31,39 41.036,40 45.863,41 27.222,42 25.907,44 4.278}
{0 CHEMBL2024254,1 7.692,2 43.9,3 43.9,4 1.013,5 1.127,6 0.662,7 0.641,8 315.37,9 2.4,10 12,11 41,13 14,14 24,16 42,17 18,20 14,21 4,22 2,23 1,24 18,25 5,28 1,29 3,32 23,34 1,35 7.3,36 0.167,37 7,38 32,39 41.549,40 46.203,41 27.159,42 26.29,43 2.4,44 4.842}
{0 CHEMBL2024255,1 8.093,2 43.9,3 43.9,4 1.009,5 1.117,6 0.685,7 0.652,8 331.82,9 2.4,10 12,11 41,13 14,14 24,16 42,17 18,18 1,20 14,21 4,22 2,24 18,25 5,26 1,28 1,29 3,32 23,34 1,35 7.3,36 0.167,37 7,38 32,39 41.36,40 45.807,41 28.08,42 26.735,43 2.4,44 4.932}
{0 CHEMBL2024256,1 8.093,2 43.9,3 43.9,4 1.009,5 1.117,6 0.685,7 0.652,8 331.82,9 2.4,10 12,11 41,13 14,14 24,16 42,17 18,18 1,20 14,21 4,22 2,24 18,25 5,26 1,28 1,29 3,32 23,34 1,35 7.3,36 0.167,37 7,38 32,39 41.36,40 45.807,41 28.08,42 26.735,43 2.4,44 5.076}
{0 CHEMBL2024257,1 8.304,2 43.2,3 40.9,4 1.033,5 1.143,6 0.654,7 0.65,8 365.38,9 2.3,10 12,11 44,13 14,14 27,16 45,17 19,20 14,21 5,22 2,23 3,24 18,25 7,28 1,29 3,32 26,34 3,35 6.8,36 0.156,37 7,38 35,39 45.458,40 50.298,41 28.796,42 28.584,43 6.8,44 5.495}
{0 CHEMBL2024335,1 9.317,2 29.5,3 41,4 1.047,5 1.141,6 0.661,7 0.639,8 978.24,9 6.7,10 16,11 105,13 23,14 65,16 108,17 31,18 1,20 15,21 16,22 7,24 43,25 31,26 5,28 7,29 19,30 3,31 1,32 62,34 1,35 18.1,36 0.222,37 24,38 80,39 109.927,40 119.806,41 69.454,42 67.053,43 1,44 6.393}
{0 CHEMBL2024336,1 8.934,2 29.4,3 42.2,4 1.044,5 1.142,6 0.65,7 0.628,8 973.83,9 6.4,10 16,11 109,13 23,14 66,16 112,17 32,20 15,21 17,22 7,24 46,25 31,26 4,28 7,29 20,30 3,31 1,32 63,35 18.3,36 0.223,37 25,38 81,39 113.814,40 124.486,41 70.812,42 68.467,44 4.475}
{0 CHEMBL2024337,1 9.16,2 29.5,3 41,4 1.049,5 1.145,6 0.653,7 0.634,8 961.79,9 6.7,10 16,11 105,13 23,14 65,16 108,17 31,20 15,21 16,22 7,23 1,24 43,25 31,26 4,28 7,29 19,30 3,31 1,32 62,34 1,35 18.1,36 0.222,37 24,38 80,39 110.116,40 120.202,41 68.534,42 66.608,43 1,44 6.69}
{0 CHEMBL2024338,1 9.317,2 29.5,3 41,4 1.047,5 1.141,6 0.661,7 0.639,8 978.24,9 6.7,10 16,11 105,13 23,14 65,16 108,17 31,18 1,20 15,21 16,22 7,24 43,25 31,26 5,28 7,29 19,30 3,31 1,32 62,34 1,35 18.1,36 0.222,37 24,38 80,39 109.927,40 119.806,41 69.454,42 67.053,43 1,44 6.544}
{0 CHEMBL2024339,1 9.74,2 29.5,3 41,4 1.046,5 1.14,6 0.666,7 0.64,8 1022.69,9 6.7,10 16,11 105,13 23,14 65,15 1,16 108,17 31,20 15,21 16,22 7,24 43,25 31,26 5,28 7,29 19,30 3,31 1,32 62,34 1,35 18.1,36 0.222,37 24,38 80,39 109.833,40 119.703,41 69.949,42 67.25,43 1,44 6.87}
{0 CHEMBL2024340,1 10.188,2 29.5,3 41,4 1.045,5 1.139,6 0.679,7 0.643,8 1069.69,9 6.7,10 16,11 105,13 23,14 65,16 108,17 31,20 15,21 16,22 7,24 43,25 31,26 5,27 1,28 7,29 19,30 3,31 1,32 62,34 1,35 18.1,36 0.222,37 24,38 80,39 109.673,40 119.582,41 71.256,42 67.542,43 1,44 6.376}
{0 CHEMBL2024341,1 9.241,2 29,3 40.2,4 1.051,5 1.144,6 0.652,7 0.637,8 988.8,9 7.5,10 16,11 107,13 25,14 67,16 110,17 31,20 15,21 16,22 9,24 43,25 33,26 4,28 8,29 21,30 3,31 1,32 64,35 19.6,36 0.227,37 25,38 84,39 112.476,40 122.364,41 69.75,42 68.149,44 6.812}
{0 CHEMBL2024342,1 8.934,2 29.4,3 42.2,4 1.044,5 1.142,6 0.65,7 0.628,8 973.83,9 6.4,10 16,11 109,13 23,14 66,16 112,17 32,20 15,21 17,22 7,24 46,25 31,26 4,28 7,29 20,30 3,31 1,32 63,35 18.3,36 0.223,37 25,38 81,39 113.814,40 124.486,41 70.812,42 68.467,44 4.917}
{0 CHEMBL2024343,1 9.317,2 29.5,3 41,4 1.047,5 1.141,6 0.661,7 0.639,8 978.24,9 6.7,10 16,11 105,13 23,14 65,16 108,17 31,18 1,20 15,21 16,22 7,24 43,25 31,26 5,28 7,29 19,30 3,31 1,32 62,34 1,35 18.1,36 0.222,37 24,38 80,39 109.927,40 119.806,41 69.454,42 67.053,43 1,44 4.851}
{0 CHEMBL2024344,1 9.645,2 29.5,3 40,4 1.05,5 1.14,6 0.67,7 0.646,8 1012.68,9 6.7,10 16,11 105,13 23,14 66,16 108,17 31,18 2,20 15,21 16,22 7,24 42,25 32,26 6,28 7,29 19,30 3,31 1,32 63,34 2,35 18.1,36 0.222,37 24,38 81,39 110.251,40 119.75,41 70.312,42 67.88,43 1.9,44 6.76}
{0 CHEMBL2024345,1 9.583,2 29.8,3 40.4,4 1.047,5 1.14,6 0.672,7 0.646,8 996.68,9 6.7,10 16,11 104,13 23,14 65,16 107,17 31,18 2,20 15,21 16,22 7,24 42,25 31,26 6,28 7,29 18,30 3,31 1,32 62,34 2,35 17.3,36 0.224,37 24,38 80,39 108.924,40 118.54,41 69.858,42 67.165,43 1.9,44 5.658}
