{
  "data_set_description": {
    "collection_date": "November 2013",
    "creator": "Dr Jeremy Besnard, Dr Ivan Olier, Dr Noureddin Sadawi, Dr Larisa Soldatova, Dr Crina Grosan, Prof Ross King, Dr Richard Bickerton, Prof Andrew Hopkins and Dr Willem van Hoorn",
    "default_target_attribute": "pXC50",
    "description": "This dataset contains QSAR data (from ChEMBL version 17) showing activity values (unit is pseudo-pCI50) of several compounds on drug target ChEMBL_ID: CHEMBL1949492 (TID: 104462), and it has 17 rows and 1107 features (not including molecule IDs and class feature: molecule_id and pXC50). The features represent Molecular Descriptors which were generated from SMILES strings. Missing value imputation was applied to this dataset (By choosing the Median).",
    "description_version": "1",
    "file_id": "3560153",
    "format": "ARFF",
    "id": "35504",
    "licence": "Public",
    "md5_checksum": "1f1ede83443cd785db8fa941f61a0cec",
    "minio_url": "https://data.openml.org/datasets/0003/35504/dataset_35504.pq",
    "name": "QSAR-DATASET-FOR-DRUG-TARGET-CHEMBL1949492",
    "original_data_url": "https://www.ebi.ac.uk/chembl/target/inspect/CHEMBL1949492",
    "parquet_url": "https://data.openml.org/datasets/0003/35504/dataset_35504.pq",
    "processing_date": "2018-10-04 04:41:48",
    "row_id_attribute": "molecule_id",
    "status": "deactivated",
    "tag": [
      "MetaQSAR",
      "study_13"
    ],
    "upload_date": "2016-07-15T18:13:19",
    "url": "https://api.openml.org/data/v1/download/3560153/QSAR-DATASET-FOR-DRUG-TARGET-CHEMBL1949492.arff",
    "version": "10",
    "visibility": "public"
  }
}