{
  "data_set_description": {
    "collection_date": "November 2013",
    "creator": "Dr Jeremy Besnard, Dr Ivan Olier, Dr Noureddin Sadawi, Dr Larisa Soldatova, Dr Crina Grosan, Prof Ross King, Dr Richard Bickerton, Prof Andrew Hopkins and Dr Willem van Hoorn",
    "default_target_attribute": "pXC50",
    "description": "This dataset contains QSAR data (from ChEMBL version 17) showing activity values (unit is pseudo-pCI50) of several compounds on drug target ChEMBL_ID: CHEMBL2195 (TID: 11027), and it has 10 rows and 1149 features (not including molecule IDs and class feature: molecule_id and pXC50). The features represent Molecular Descriptors which were generated from SMILES strings. Missing value imputation was applied to this dataset (By choosing the Median).",
    "description_version": "1",
    "file_id": "3559183",
    "format": "ARFF",
    "id": "35474",
    "licence": "Public",
    "md5_checksum": "8a12e57b6047cfcb1d3221060d729fa2",
    "minio_url": "https://data.openml.org/datasets/0003/35474/dataset_35474.pq",
    "name": "QSAR-DATASET-FOR-DRUG-TARGET-CHEMBL2195",
    "original_data_url": "https://www.ebi.ac.uk/chembl/target/inspect/CHEMBL2195",
    "parquet_url": "https://data.openml.org/datasets/0003/35474/dataset_35474.pq",
    "processing_date": "2018-10-04 04:33:18",
    "row_id_attribute": "molecule_id",
    "status": "deactivated",
    "tag": [
      "MetaQSAR",
      "study_13"
    ],
    "upload_date": "2016-07-15T18:08:34",
    "url": "https://api.openml.org/data/v1/download/3559183/QSAR-DATASET-FOR-DRUG-TARGET-CHEMBL2195.arff",
    "version": "8",
    "visibility": "public"
  }
}