{
  "data_features": {
    "feature": [
      {
        "data_type": "nominal",
        "index": "0",
        "is_ignore": "false",
        "is_row_identifier": "true",
        "is_target": "false",
        "name": "molecule_id",
        "nominal_value": [
          "CHEMBL1002",
          "CHEMBL100351",
          "CHEMBL100414",
          "CHEMBL100589",
          "CHEMBL100724",
          "CHEMBL101521",
          "CHEMBL101606",
          "CHEMBL101630",
          "CHEMBL101674",
          "CHEMBL102194",
          "CHEMBL103137",
          "CHEMBL104",
          "CHEMBL104061",
          "CHEMBL104076",
          "CHEMBL104127",
          "CHEMBL104180",
          "CHEMBL104193",
          "CHEMBL104222",
          "CHEMBL104377",
          "CHEMBL104551",
          "CHEMBL104981",
          "CHEMBL105968",
          "CHEMBL106487",
          "CHEMBL106746",
          "CHEMBL107681",
          "CHEMBL1077199",
          "CHEMBL1077238",
          "CHEMBL1077273",
          "CHEMBL1078394",
          "CHEMBL1078395",
          "CHEMBL1078465",
          "CHEMBL1078495",
          "CHEMBL1078496",
          "CHEMBL1078575",
          "CHEMBL1078576",
          "CHEMBL1078695",
          "CHEMBL1078696",
          "CHEMBL1078749",
          "CHEMBL1078876",
          "CHEMBL1082500",
          "CHEMBL1082501",
          "CHEMBL1082607",
          "CHEMBL1082723",
          "CHEMBL1082827",
          "CHEMBL1082828",
          "CHEMBL1083053",
          "CHEMBL1083216",
          "CHEMBL1083363",
          "CHEMBL1083364",
          "CHEMBL1083366",
          "CHEMBL1083368",
          "CHEMBL1083666",
          "CHEMBL1083667",
          "CHEMBL1083668",
          "CHEMBL1083669",
          "CHEMBL1083670",
          "CHEMBL1083672",
          "CHEMBL1083831",
          "CHEMBL1083832",
          "CHEMBL1083884",
          "CHEMBL1083994",
          "CHEMBL1083995",
          "CHEMBL1083996",
          "CHEMBL1084136",
          "CHEMBL1084137",
          "CHEMBL1084138",
          "CHEMBL1084144",
          "CHEMBL1084145",
          "CHEMBL1084274",
          "CHEMBL1084526",
          "CHEMBL1084527",
          "CHEMBL1084647",
          "CHEMBL1084648",
          "CHEMBL1084649",
          "CHEMBL1084654",
          "CHEMBL1084655",
          "CHEMBL1084656",
          "CHEMBL1084667",
          "CHEMBL1084706",
          "CHEMBL1084707",
          "CHEMBL1084772",
          "CHEMBL1084773",
          "CHEMBL1084891",
          "CHEMBL1085009",
          "CHEMBL1085010",
          "CHEMBL1085013",
          "CHEMBL1085014",
          "CHEMBL1085016",
          "CHEMBL1085270",
          "CHEMBL1085395",
          "CHEMBL1085399",
          "CHEMBL1085441",
          "CHEMBL1085442",
          "CHEMBL1085444",
          "CHEMBL1085638",
          "CHEMBL1085693",
          "CHEMBL1085694",
          "CHEMBL1085837",
          "CHEMBL1085897",
          "CHEMBL1085898",
          "CHEMBL1085928",
          "CHEMBL1085929",
          "CHEMBL1086005",
          "CHEMBL1086077",
          "CHEMBL1086149",
          "CHEMBL1086411",
          "CHEMBL1086535",
          "CHEMBL1086536",
          "CHEMBL1086542",
          "CHEMBL1088076",
          "CHEMBL1089052",
          "CHEMBL1089053",
          "CHEMBL1089386",
          "CHEMBL1089387",
          "CHEMBL1089395",
          "CHEMBL1089396",
          "CHEMBL1089725",
          "CHEMBL1089734",
          "CHEMBL1089735",
          "CHEMBL1090416",
          "CHEMBL1090424",
          "CHEMBL1090425",
          "CHEMBL1090746",
          "CHEMBL1091478",
          "CHEMBL1091479",
          "CHEMBL1091816",
          "CHEMBL1092502",
          "CHEMBL1093086",
          "CHEMBL1093385",
          "CHEMBL1093387",
          "CHEMBL1094323",
          "CHEMBL1094483",
          "CHEMBL1094486",
          "CHEMBL1094487",
          "CHEMBL1094715",
          "CHEMBL1094785",
          "CHEMBL1095042",
          "CHEMBL1095305",
          "CHEMBL1095777",
          "CHEMBL1095778",
          "CHEMBL1095779",
          "CHEMBL1098230",
          "CHEMBL111201",
          "CHEMBL111732",
          "CHEMBL111775",
          "CHEMBL11268",
          "CHEMBL117405",
          "CHEMBL1200811",
          "CHEMBL1200833",
          "CHEMBL1201153",
          "CHEMBL1201237",
          "CHEMBL120238",
          "CHEMBL120278",
          "CHEMBL1203987",
          "CHEMBL1203988",
          "CHEMBL1203989",
          "CHEMBL1203990",
          "CHEMBL1203991",
          "CHEMBL1203992",
          "CHEMBL1203993",
          "CHEMBL1203994",
          "CHEMBL1203995",
          "CHEMBL1203996",
          "CHEMBL1203997",
          "CHEMBL1203998",
          "CHEMBL1203999",
          "CHEMBL1204000",
          "CHEMBL1204001",
          "CHEMBL1204002",
          "CHEMBL1204003",
          "CHEMBL1204004",
          "CHEMBL1204005",
          "CHEMBL1204006",
          "CHEMBL1204007",
          "CHEMBL1204009",
          "CHEMBL1204383",
          "CHEMBL1204416",
          "CHEMBL1209157",
          "CHEMBL1210154",
          "CHEMBL121704",
          "CHEMBL12188",
          "CHEMBL121964",
          "CHEMBL1221540",
          "CHEMBL1221541",
          "CHEMBL1221542",
          "CHEMBL1221543",
          "CHEMBL1221586",
          "CHEMBL1221587",
          "CHEMBL1221588",
          "CHEMBL1221589",
          "CHEMBL1221590",
          "CHEMBL1221634",
          "CHEMBL1221635",
          "CHEMBL1221636",
          "CHEMBL1221637",
          "CHEMBL1221638",
          "CHEMBL1221679",
          "CHEMBL1221680",
          "CHEMBL1221681",
          "CHEMBL1221682",
          "CHEMBL1221683",
          "CHEMBL1221732",
          "CHEMBL1221733",
          "CHEMBL1221734",
          "CHEMBL1221735",
          "CHEMBL1221736",
          "CHEMBL1221801",
          "CHEMBL1221802",
          "CHEMBL1221803",
          "CHEMBL1221804",
          "CHEMBL1221805",
          "CHEMBL1221861",
          "CHEMBL1221862",
          "CHEMBL1226",
          "CHEMBL122757",
          "CHEMBL122990",
          "CHEMBL122992",
          "CHEMBL1233771",
          "CHEMBL123596",
          "CHEMBL123745",
          "CHEMBL1240965",
          "CHEMBL1240966",
          "CHEMBL1240967",
          "CHEMBL1242923",
          "CHEMBL1242943",
          "CHEMBL1242950",
          "CHEMBL1242969",
          "CHEMBL1243000",
          "CHEMBL1243035",
          "CHEMBL1243068",
          "CHEMBL1243101",
          "CHEMBL1243158",
          "CHEMBL1243189",
          "CHEMBL1243190",
          "CHEMBL1243222",
          "CHEMBL1243256",
          "CHEMBL1243285",
          "CHEMBL1243317",
          "CHEMBL1243347",
          "CHEMBL1243348",
          "CHEMBL1243407",
          "CHEMBL12450",
          "CHEMBL124584",
          "CHEMBL124597",
          "CHEMBL124668",
          "CHEMBL124863",
          "CHEMBL124929",
          "CHEMBL12498",
          "CHEMBL125168",
          "CHEMBL125246",
          "CHEMBL1255596",
          "CHEMBL1255663",
          "CHEMBL1256360",
          "CHEMBL1256958",
          "CHEMBL1257092",
          "CHEMBL1257204",
          "CHEMBL1257323",
          "CHEMBL1257324",
          "CHEMBL1257437",
          "CHEMBL1257438",
          "CHEMBL1257554",
          "CHEMBL1257555",
          "CHEMBL1257674",
          "CHEMBL1257675",
          "CHEMBL1257676",
          "CHEMBL1257797",
          "CHEMBL1257913",
          "CHEMBL1257914",
          "CHEMBL1257915",
          "CHEMBL1257916",
          "CHEMBL1258023",
          "CHEMBL1258024",
          "CHEMBL1258025",
          "CHEMBL1258026",
          "CHEMBL1258142",
          "CHEMBL1258143",
          "CHEMBL1258144",
          "CHEMBL1258257",
          "CHEMBL1258258",
          "CHEMBL1258259",
          "CHEMBL1258260",
          "CHEMBL1258370",
          "CHEMBL1258371",
          "CHEMBL1258372",
          "CHEMBL1258373",
          "CHEMBL1258483",
          "CHEMBL1258484",
          "CHEMBL1258485",
          "CHEMBL1258486",
          "CHEMBL1258596",
          "CHEMBL1258597",
          "CHEMBL1258598",
          "CHEMBL1258599",
          "CHEMBL1258704",
          "CHEMBL1258705",
          "CHEMBL1258706",
          "CHEMBL1258707",
          "CHEMBL1258824",
          "CHEMBL1258825",
          "CHEMBL1258940",
          "CHEMBL125963",
          "CHEMBL126055",
          "CHEMBL1263",
          "CHEMBL12633",
          "CHEMBL12674",
          "CHEMBL12686",
          "CHEMBL12718",
          "CHEMBL12719",
          "CHEMBL127422",
          "CHEMBL127428",
          "CHEMBL127451",
          "CHEMBL12762",
          "CHEMBL127656",
          "CHEMBL12769",
          "CHEMBL12813",
          "CHEMBL12876",
          "CHEMBL12911",
          "CHEMBL12939",
          "CHEMBL12943",
          "CHEMBL12945",
          "CHEMBL12994",
          "CHEMBL12998",
          "CHEMBL13",
          "CHEMBL13003",
          "CHEMBL1301415",
          "CHEMBL1301481",
          "CHEMBL1301877",
          "CHEMBL1302049",
          "CHEMBL1303120",
          "CHEMBL13034",
          "CHEMBL1305925",
          "CHEMBL13068",
          "CHEMBL1306990",
          "CHEMBL13079",
          "CHEMBL1308099",
          "CHEMBL1309228",
          "CHEMBL1309463",
          "CHEMBL13102",
          "CHEMBL13106",
          "CHEMBL13132",
          "CHEMBL1313270",
          "CHEMBL1318214",
          "CHEMBL1318405",
          "CHEMBL1319108",
          "CHEMBL1319376",
          "CHEMBL1322514",
          "CHEMBL1322688",
          "CHEMBL13238",
          "CHEMBL1325241",
          "CHEMBL1325250",
          "CHEMBL1327325",
          "CHEMBL13278",
          "CHEMBL1327806",
          "CHEMBL1329712",
          "CHEMBL1330871",
          "CHEMBL1332942",
          "CHEMBL1333885",
          "CHEMBL1334494",
          "CHEMBL1337858",
          "CHEMBL1338286",
          "CHEMBL13389",
          "CHEMBL1339094",
          "CHEMBL13398",
          "CHEMBL1340208",
          "CHEMBL1340869",
          "CHEMBL1341251",
          "CHEMBL1341999",
          "CHEMBL13432",
          "CHEMBL13453",
          "CHEMBL1345891",
          "CHEMBL13459",
          "CHEMBL1346173",
          "CHEMBL1346316",
          "CHEMBL13467",
          "CHEMBL1347493",
          "CHEMBL1348147",
          "CHEMBL1351178",
          "CHEMBL13521",
          "CHEMBL1353563",
          "CHEMBL1361693",
          "CHEMBL1363",
          "CHEMBL1364787",
          "CHEMBL1364979",
          "CHEMBL1365203",
          "CHEMBL1365995",
          "CHEMBL1368804",
          "CHEMBL1368962",
          "CHEMBL1370616",
          "CHEMBL1373276",
          "CHEMBL1373386",
          "CHEMBL1374751",
          "CHEMBL1375364",
          "CHEMBL1376574",
          "CHEMBL1376861",
          "CHEMBL137781",
          "CHEMBL1378531",
          "CHEMBL1378598",
          "CHEMBL1379002",
          "CHEMBL1383120",
          "CHEMBL1383213",
          "CHEMBL1385381",
          "CHEMBL1387056",
          "CHEMBL1388401",
          "CHEMBL1390471",
          "CHEMBL1391134",
          "CHEMBL1392252",
          "CHEMBL1393806",
          "CHEMBL1396351",
          "CHEMBL1401186",
          "CHEMBL1405897",
          "CHEMBL1406272",
          "CHEMBL1408268",
          "CHEMBL1410048",
          "CHEMBL1410897",
          "CHEMBL1414874",
          "CHEMBL1415227",
          "CHEMBL1416329",
          "CHEMBL1419122",
          "CHEMBL1420188",
          "CHEMBL1422222",
          "CHEMBL1422244",
          "CHEMBL1424678",
          "CHEMBL1424697",
          "CHEMBL1425921",
          "CHEMBL1426242",
          "CHEMBL1429919",
          "CHEMBL1431082",
          "CHEMBL1436649",
          "CHEMBL1437",
          "CHEMBL1437255",
          "CHEMBL1437683",
          "CHEMBL1439691",
          "CHEMBL1444240",
          "CHEMBL144870",
          "CHEMBL1449091",
          "CHEMBL1450393",
          "CHEMBL1450612",
          "CHEMBL1451550",
          "CHEMBL1451649",
          "CHEMBL1452334",
          "CHEMBL1456621",
          "CHEMBL1457704",
          "CHEMBL1458548",
          "CHEMBL1458579",
          "CHEMBL1458840",
          "CHEMBL1459608",
          "CHEMBL1461759",
          "CHEMBL1462616",
          "CHEMBL1463335",
          "CHEMBL1464261",
          "CHEMBL1464795",
          "CHEMBL1465886",
          "CHEMBL1466531",
          "CHEMBL1469574",
          "CHEMBL1472233",
          "CHEMBL1475105",
          "CHEMBL1478198",
          "CHEMBL1479163",
          "CHEMBL1479957",
          "CHEMBL1482007",
          "CHEMBL1483308",
          "CHEMBL1483555",
          "CHEMBL1484690",
          "CHEMBL1488661",
          "CHEMBL1490889",
          "CHEMBL1491674",
          "CHEMBL1500954",
          "CHEMBL1505690",
          "CHEMBL1505813",
          "CHEMBL1506229",
          "CHEMBL1506260",
          "CHEMBL1506379",
          "CHEMBL1506675",
          "CHEMBL1510834",
          "CHEMBL1517798",
          "CHEMBL1518070",
          "CHEMBL1518934",
          "CHEMBL1519042",
          "CHEMBL1521880",
          "CHEMBL1522050",
          "CHEMBL1522618",
          "CHEMBL1524289",
          "CHEMBL152535",
          "CHEMBL1525540",
          "CHEMBL1526751",
          "CHEMBL1527861",
          "CHEMBL1528594",
          "CHEMBL1528906",
          "CHEMBL1531486",
          "CHEMBL1531814",
          "CHEMBL1531826",
          "CHEMBL1532219",
          "CHEMBL153558",
          "CHEMBL1537056",
          "CHEMBL1538061",
          "CHEMBL1539141",
          "CHEMBL153916",
          "CHEMBL1539906",
          "CHEMBL154036",
          "CHEMBL154150",
          "CHEMBL1541608",
          "CHEMBL154370",
          "CHEMBL1543973",
          "CHEMBL154419",
          "CHEMBL1545591",
          "CHEMBL1546584",
          "CHEMBL1547736",
          "CHEMBL1548237",
          "CHEMBL1548594",
          "CHEMBL154906",
          "CHEMBL155072",
          "CHEMBL155092",
          "CHEMBL1551385",
          "CHEMBL1553183",
          "CHEMBL1555833",
          "CHEMBL1557820",
          "CHEMBL1557985",
          "CHEMBL1559039",
          "CHEMBL1559831",
          "CHEMBL1562748",
          "CHEMBL1562838",
          "CHEMBL1564120",
          "CHEMBL1569630",
          "CHEMBL1569866",
          "CHEMBL1570111",
          "CHEMBL1570251",
          "CHEMBL157138",
          "CHEMBL157210",
          "CHEMBL1573444",
          "CHEMBL1575530",
          "CHEMBL1575889",
          "CHEMBL1577023",
          "CHEMBL1577237",
          "CHEMBL1577767",
          "CHEMBL1581044",
          "CHEMBL1581214",
          "CHEMBL1581826",
          "CHEMBL1585368",
          "CHEMBL1586182",
          "CHEMBL1590854",
          "CHEMBL1598434",
          "CHEMBL1600429",
          "CHEMBL1601082",
          "CHEMBL1604735",
          "CHEMBL1606638",
          "CHEMBL1606962",
          "CHEMBL1609490",
          "CHEMBL1609957",
          "CHEMBL1612392",
          "CHEMBL1620339",
          "CHEMBL162043",
          "CHEMBL1622248",
          "CHEMBL1626224",
          "CHEMBL1630578",
          "CHEMBL1632158",
          "CHEMBL1632174",
          "CHEMBL163262",
          "CHEMBL163531",
          "CHEMBL163579",
          "CHEMBL164401",
          "CHEMBL165015",
          "CHEMBL165177",
          "CHEMBL165513",
          "CHEMBL166013",
          "CHEMBL166188",
          "CHEMBL1672288",
          "CHEMBL1672973",
          "CHEMBL1683931",
          "CHEMBL1683932",
          "CHEMBL1683933",
          "CHEMBL1683934",
          "CHEMBL1683935",
          "CHEMBL1683936",
          "CHEMBL1683938",
          "CHEMBL1683939",
          "CHEMBL1683940",
          "CHEMBL1683941",
          "CHEMBL1683942",
          "CHEMBL1684577",
          "CHEMBL1684578",
          "CHEMBL1684580",
          "CHEMBL1684581",
          "CHEMBL1684582",
          "CHEMBL1684583",
          "CHEMBL1684584",
          "CHEMBL1684585",
          "CHEMBL1704973",
          "CHEMBL1705007",
          "CHEMBL1708092",
          "CHEMBL1709014",
          "CHEMBL1711",
          "CHEMBL1713555",
          "CHEMBL1714856",
          "CHEMBL1719341",
          "CHEMBL1722488",
          "CHEMBL1723653",
          "CHEMBL1724644",
          "CHEMBL1727257",
          "CHEMBL1728955",
          "CHEMBL1729",
          "CHEMBL1734754",
          "CHEMBL1735137",
          "CHEMBL1760",
          "CHEMBL1773074",
          "CHEMBL1773196",
          "CHEMBL1773197",
          "CHEMBL1773198",
          "CHEMBL1773262",
          "CHEMBL1773263",
          "CHEMBL1773264",
          "CHEMBL1773265",
          "CHEMBL1773266",
          "CHEMBL1773267",
          "CHEMBL177442",
          "CHEMBL1794855",
          "CHEMBL1800472",
          "CHEMBL1800473",
          "CHEMBL1800474",
          "CHEMBL1800475",
          "CHEMBL1800656",
          "CHEMBL1800657",
          "CHEMBL1800658",
          "CHEMBL1800659",
          "CHEMBL1800660",
          "CHEMBL1800934",
          "CHEMBL1800935",
          "CHEMBL1800936",
          "CHEMBL1800960",
          "CHEMBL1800961",
          "CHEMBL1800962",
          "CHEMBL1800963",
          "CHEMBL1802359",
          "CHEMBL180672",
          "CHEMBL1806874",
          "CHEMBL180700",
          "CHEMBL1807817",
          "CHEMBL1807818",
          "CHEMBL1807819",
          "CHEMBL1807820",
          "CHEMBL1807821",
          "CHEMBL1807822",
          "CHEMBL1807823",
          "CHEMBL1807824",
          "CHEMBL1807825",
          "CHEMBL1807826",
          "CHEMBL1807827",
          "CHEMBL1807828",
          "CHEMBL1807829",
          "CHEMBL1807830",
          "CHEMBL1807831",
          "CHEMBL1807832",
          "CHEMBL1807869",
          "CHEMBL1807870",
          "CHEMBL1807871",
          "CHEMBL1807872",
          "CHEMBL1807873",
          "CHEMBL1807874",
          "CHEMBL181300",
          "CHEMBL1814267",
          "CHEMBL1814268",
          "CHEMBL1814269",
          "CHEMBL1814270",
          "CHEMBL1814271",
          "CHEMBL1814272",
          "CHEMBL1814273",
          "CHEMBL1814274",
          "CHEMBL1814275",
          "CHEMBL1814276",
          "CHEMBL1814277",
          "CHEMBL1814279",
          "CHEMBL181440",
          "CHEMBL181603",
          "CHEMBL181964",
          "CHEMBL182018",
          "CHEMBL1824264",
          "CHEMBL1824265",
          "CHEMBL1824266",
          "CHEMBL182614",
          "CHEMBL182689",
          "CHEMBL182708",
          "CHEMBL182770",
          "CHEMBL1830485",
          "CHEMBL1830486",
          "CHEMBL1830487",
          "CHEMBL1830488",
          "CHEMBL1830489",
          "CHEMBL1830490",
          "CHEMBL1830491",
          "CHEMBL1830492",
          "CHEMBL1830493",
          "CHEMBL1830617",
          "CHEMBL1830618",
          "CHEMBL1830619",
          "CHEMBL1830620",
          "CHEMBL1830621",
          "CHEMBL183129",
          "CHEMBL183460",
          "CHEMBL183552",
          "CHEMBL1835853",
          "CHEMBL1835854",
          "CHEMBL1835855",
          "CHEMBL1835856",
          "CHEMBL1835857",
          "CHEMBL1835858",
          "CHEMBL1835859",
          "CHEMBL1835860",
          "CHEMBL1835861",
          "CHEMBL1835862",
          "CHEMBL1836647",
          "CHEMBL183921",
          "CHEMBL183948",
          "CHEMBL184407",
          "CHEMBL184538",
          "CHEMBL185052",
          "CHEMBL185262",
          "CHEMBL185660",
          "CHEMBL185703",
          "CHEMBL185836",
          "CHEMBL186135",
          "CHEMBL186196",
          "CHEMBL186236",
          "CHEMBL186247",
          "CHEMBL186271",
          "CHEMBL186676",
          "CHEMBL187209",
          "CHEMBL187317",
          "CHEMBL1873201",
          "CHEMBL1876406",
          "CHEMBL1878737",
          "CHEMBL1880217",
          "CHEMBL1881705",
          "CHEMBL188196",
          "CHEMBL188315",
          "CHEMBL188622",
          "CHEMBL1886907",
          "CHEMBL189081",
          "CHEMBL1902287",
          "CHEMBL1902627",
          "CHEMBL1907082",
          "CHEMBL1940682",
          "CHEMBL1940683",
          "CHEMBL1940685",
          "CHEMBL1940686",
          "CHEMBL1940808",
          "CHEMBL1940809",
          "CHEMBL1940810",
          "CHEMBL1940811",
          "CHEMBL1940812",
          "CHEMBL1940813",
          "CHEMBL1940814",
          "CHEMBL1940815",
          "CHEMBL1940816",
          "CHEMBL1940817",
          "CHEMBL1940818",
          "CHEMBL1940819",
          "CHEMBL1940820",
          "CHEMBL1940821",
          "CHEMBL1940822",
          "CHEMBL1940823",
          "CHEMBL1940824",
          "CHEMBL1940825",
          "CHEMBL1940826",
          "CHEMBL1940827",
          "CHEMBL1940828",
          "CHEMBL1940829",
          "CHEMBL1940830",
          "CHEMBL1940831",
          "CHEMBL1940832",
          "CHEMBL1940833",
          "CHEMBL1940834",
          "CHEMBL1944689",
          "CHEMBL1944690",
          "CHEMBL1944691",
          "CHEMBL1944692",
          "CHEMBL1944693",
          "CHEMBL1944694",
          "CHEMBL1944695",
          "CHEMBL1945031",
          "CHEMBL1945032",
          "CHEMBL1945033",
          "CHEMBL1945034",
          "CHEMBL1945035",
          "CHEMBL1945036",
          "CHEMBL1945037",
          "CHEMBL1945038",
          "CHEMBL1945039",
          "CHEMBL1945040",
          "CHEMBL1945041",
          "CHEMBL1945042",
          "CHEMBL1945043",
          "CHEMBL1945044",
          "CHEMBL1945289",
          "CHEMBL1945290",
          "CHEMBL1945291",
          "CHEMBL1945292",
          "CHEMBL1945293",
          "CHEMBL1945294",
          "CHEMBL1945295",
          "CHEMBL1945296",
          "CHEMBL1945297",
          "CHEMBL1945298",
          "CHEMBL1945299",
          "CHEMBL1945300",
          "CHEMBL1945503",
          "CHEMBL1945504",
          "CHEMBL1946761",
          "CHEMBL1946762",
          "CHEMBL1946763",
          "CHEMBL1946764",
          "CHEMBL1946765",
          "CHEMBL1946766",
          "CHEMBL1946767",
          "CHEMBL1946768",
          "CHEMBL1946769",
          "CHEMBL1947150",
          "CHEMBL1947151",
          "CHEMBL1947152",
          "CHEMBL1947153",
          "CHEMBL1947154",
          "CHEMBL1947155",
          "CHEMBL1947156",
          "CHEMBL1947157",
          "CHEMBL198059",
          "CHEMBL198949",
          "CHEMBL199824",
          "CHEMBL2012521",
          "CHEMBL2012522",
          "CHEMBL201878",
          "CHEMBL201946",
          "CHEMBL202434",
          "CHEMBL2031737",
          "CHEMBL204827",
          "CHEMBL205224",
          "CHEMBL205389",
          "CHEMBL206002",
          "CHEMBL2068576",
          "CHEMBL2068577",
          "CHEMBL2070834",
          "CHEMBL2070835",
          "CHEMBL207802",
          "CHEMBL207943",
          "CHEMBL208328",
          "CHEMBL208352",
          "CHEMBL208427",
          "CHEMBL2088195",
          "CHEMBL2088196",
          "CHEMBL2088197",
          "CHEMBL2088198",
          "CHEMBL2088199",
          "CHEMBL2088200",
          "CHEMBL2088201",
          "CHEMBL2088202",
          "CHEMBL2112075",
          "CHEMBL2133469",
          "CHEMBL218210",
          "CHEMBL2203551",
          "CHEMBL2204360",
          "CHEMBL221188",
          "CHEMBL22317",
          "CHEMBL22318",
          "CHEMBL22345",
          "CHEMBL22375",
          "CHEMBL22386",
          "CHEMBL225775",
          "CHEMBL226292",
          "CHEMBL226293",
          "CHEMBL226348",
          "CHEMBL226349",
          "CHEMBL228417",
          "CHEMBL228992",
          "CHEMBL228996",
          "CHEMBL228998",
          "CHEMBL229388",
          "CHEMBL229390",
          "CHEMBL229391",
          "CHEMBL229400",
          "CHEMBL229401",
          "CHEMBL229429",
          "CHEMBL229442",
          "CHEMBL229443",
          "CHEMBL229476",
          "CHEMBL229477",
          "CHEMBL229614",
          "CHEMBL229615",
          "CHEMBL229616",
          "CHEMBL229620",
          "CHEMBL230203",
          "CHEMBL230486",
          "CHEMBL230487",
          "CHEMBL230490",
          "CHEMBL2348196",
          "CHEMBL2348197",
          "CHEMBL2348198",
          "CHEMBL2348199",
          "CHEMBL2348200",
          "CHEMBL2348201",
          "CHEMBL2348202",
          "CHEMBL2348203",
          "CHEMBL2348204",
          "CHEMBL2348205",
          "CHEMBL2348206",
          "CHEMBL2348207",
          "CHEMBL2348208",
          "CHEMBL2348209",
          "CHEMBL2348210",
          "CHEMBL2348211",
          "CHEMBL2348212",
          "CHEMBL2348213",
          "CHEMBL2348214",
          "CHEMBL2348215",
          "CHEMBL2348216",
          "CHEMBL2348217",
          "CHEMBL2348218",
          "CHEMBL2348219",
          "CHEMBL2348220",
          "CHEMBL235612",
          "CHEMBL235818",
          "CHEMBL236039",
          "CHEMBL236040",
          "CHEMBL236041",
          "CHEMBL236042",
          "CHEMBL236251",
          "CHEMBL236514",
          "CHEMBL237501",
          "CHEMBL237709",
          "CHEMBL238347",
          "CHEMBL24",
          "CHEMBL245673",
          "CHEMBL245873",
          "CHEMBL245874",
          "CHEMBL245875",
          "CHEMBL246908",
          "CHEMBL247315",
          "CHEMBL247518",
          "CHEMBL247519",
          "CHEMBL247520",
          "CHEMBL248547",
          "CHEMBL248548",
          "CHEMBL248750",
          "CHEMBL248751",
          "CHEMBL249336",
          "CHEMBL249359",
          "CHEMBL249534",
          "CHEMBL250144",
          "CHEMBL250352",
          "CHEMBL250553",
          "CHEMBL250579",
          "CHEMBL251167",
          "CHEMBL251176",
          "CHEMBL251177",
          "CHEMBL251180",
          "CHEMBL25133",
          "CHEMBL251347",
          "CHEMBL251372",
          "CHEMBL251392",
          "CHEMBL251554",
          "CHEMBL251555",
          "CHEMBL251579",
          "CHEMBL251580",
          "CHEMBL251581",
          "CHEMBL251599",
          "CHEMBL251764",
          "CHEMBL252319",
          "CHEMBL25856",
          "CHEMBL26183",
          "CHEMBL263881",
          "CHEMBL26393",
          "CHEMBL266195",
          "CHEMBL267306",
          "CHEMBL267545",
          "CHEMBL268289",
          "CHEMBL269538",
          "CHEMBL27",
          "CHEMBL270026",
          "CHEMBL270964",
          "CHEMBL271574",
          "CHEMBL271576",
          "CHEMBL271945",
          "CHEMBL272383",
          "CHEMBL272584",
          "CHEMBL273028",
          "CHEMBL273428",
          "CHEMBL274143",
          "CHEMBL274144",
          "CHEMBL274361",
          "CHEMBL274782",
          "CHEMBL274807",
          "CHEMBL275114",
          "CHEMBL275291",
          "CHEMBL275511",
          "CHEMBL275742",
          "CHEMBL276257",
          "CHEMBL276480",
          "CHEMBL276659",
          "CHEMBL277613",
          "CHEMBL279260",
          "CHEMBL279931",
          "CHEMBL280822",
          "CHEMBL281200",
          "CHEMBL281350",
          "CHEMBL282618",
          "CHEMBL28405",
          "CHEMBL284311",
          "CHEMBL284612",
          "CHEMBL284782",
          "CHEMBL284788",
          "CHEMBL284965",
          "CHEMBL285001",
          "CHEMBL285240",
          "CHEMBL285242",
          "CHEMBL285458",
          "CHEMBL285481",
          "CHEMBL285499",
          "CHEMBL285520",
          "CHEMBL285704",
          "CHEMBL285713",
          "CHEMBL285881",
          "CHEMBL286139",
          "CHEMBL286231",
          "CHEMBL286435",
          "CHEMBL286437",
          "CHEMBL286438",
          "CHEMBL286574",
          "CHEMBL286800",
          "CHEMBL286859",
          "CHEMBL286868",
          "CHEMBL287561",
          "CHEMBL287562",
          "CHEMBL287567",
          "CHEMBL287880",
          "CHEMBL287947",
          "CHEMBL288083",
          "CHEMBL288418",
          "CHEMBL288550",
          "CHEMBL288917",
          "CHEMBL289248",
          "CHEMBL289249",
          "CHEMBL289250",
          "CHEMBL289316",
          "CHEMBL289689",
          "CHEMBL290053",
          "CHEMBL290131",
          "CHEMBL290752",
          "CHEMBL291246",
          "CHEMBL291306",
          "CHEMBL29141",
          "CHEMBL291467",
          "CHEMBL291516",
          "CHEMBL291593",
          "CHEMBL291594",
          "CHEMBL291992",
          "CHEMBL292407",
          "CHEMBL292598",
          "CHEMBL292947",
          "CHEMBL293577",
          "CHEMBL293818",
          "CHEMBL293994",
          "CHEMBL294008",
          "CHEMBL294042",
          "CHEMBL294172",
          "CHEMBL294492",
          "CHEMBL294649",
          "CHEMBL294753",
          "CHEMBL294849",
          "CHEMBL295234",
          "CHEMBL295502",
          "CHEMBL296380",
          "CHEMBL298594",
          "CHEMBL298612",
          "CHEMBL299175",
          "CHEMBL299719",
          "CHEMBL300552",
          "CHEMBL301202",
          "CHEMBL301231",
          "CHEMBL301594",
          "CHEMBL301707",
          "CHEMBL302803",
          "CHEMBL302893",
          "CHEMBL304090",
          "CHEMBL304298",
          "CHEMBL304878",
          "CHEMBL304991",
          "CHEMBL305558",
          "CHEMBL305891",
          "CHEMBL306423",
          "CHEMBL306430",
          "CHEMBL307647",
          "CHEMBL308126",
          "CHEMBL308150",
          "CHEMBL308351",
          "CHEMBL308860",
          "CHEMBL308868",
          "CHEMBL309673",
          "CHEMBL312074",
          "CHEMBL312364",
          "CHEMBL312546",
          "CHEMBL313631",
          "CHEMBL314639",
          "CHEMBL314893",
          "CHEMBL317003",
          "CHEMBL318165",
          "CHEMBL318802",
          "CHEMBL319409",
          "CHEMBL319673",
          "CHEMBL320138",
          "CHEMBL320228",
          "CHEMBL323113",
          "CHEMBL323776",
          "CHEMBL32411",
          "CHEMBL32418",
          "CHEMBL324665",
          "CHEMBL32521",
          "CHEMBL32590",
          "CHEMBL32599",
          "CHEMBL327519",
          "CHEMBL32888",
          "CHEMBL32891",
          "CHEMBL32996",
          "CHEMBL33013",
          "CHEMBL33155",
          "CHEMBL33168",
          "CHEMBL331744",
          "CHEMBL332010",
          "CHEMBL332132",
          "CHEMBL33224",
          "CHEMBL33292",
          "CHEMBL332964",
          "CHEMBL333417",
          "CHEMBL333438",
          "CHEMBL33384",
          "CHEMBL33438",
          "CHEMBL33515",
          "CHEMBL33725",
          "CHEMBL33755",
          "CHEMBL338216",
          "CHEMBL338618",
          "CHEMBL338664",
          "CHEMBL338748",
          "CHEMBL338794",
          "CHEMBL338976",
          "CHEMBL34291",
          "CHEMBL34328",
          "CHEMBL343755",
          "CHEMBL34406",
          "CHEMBL34441",
          "CHEMBL345304",
          "CHEMBL347400",
          "CHEMBL347582",
          "CHEMBL347616",
          "CHEMBL348269",
          "CHEMBL348501",
          "CHEMBL349505",
          "CHEMBL349651",
          "CHEMBL349689",
          "CHEMBL350590",
          "CHEMBL350931",
          "CHEMBL351467",
          "CHEMBL351596",
          "CHEMBL351967",
          "CHEMBL35282",
          "CHEMBL354906",
          "CHEMBL35500",
          "CHEMBL357995",
          "CHEMBL360133",
          "CHEMBL36060",
          "CHEMBL36101",
          "CHEMBL361505",
          "CHEMBL362293",
          "CHEMBL362763",
          "CHEMBL363260",
          "CHEMBL363329",
          "CHEMBL36568",
          "CHEMBL36609",
          "CHEMBL368584",
          "CHEMBL37335",
          "CHEMBL374867",
          "CHEMBL37512",
          "CHEMBL377028",
          "CHEMBL38254",
          "CHEMBL383511",
          "CHEMBL383577",
          "CHEMBL384560",
          "CHEMBL38486",
          "CHEMBL38538",
          "CHEMBL38562",
          "CHEMBL38569",
          "CHEMBL386016",
          "CHEMBL38704",
          "CHEMBL387825",
          "CHEMBL387851",
          "CHEMBL387852",
          "CHEMBL388177",
          "CHEMBL388570",
          "CHEMBL38861",
          "CHEMBL389390",
          "CHEMBL389519",
          "CHEMBL389629",
          "CHEMBL389734",
          "CHEMBL389902",
          "CHEMBL391006",
          "CHEMBL391308",
          "CHEMBL391946",
          "CHEMBL392056",
          "CHEMBL39269",
          "CHEMBL39334",
          "CHEMBL393469",
          "CHEMBL393470",
          "CHEMBL393471",
          "CHEMBL393648",
          "CHEMBL394339",
          "CHEMBL39577",
          "CHEMBL395834",
          "CHEMBL39596",
          "CHEMBL39804",
          "CHEMBL398241",
          "CHEMBL398320",
          "CHEMBL398322",
          "CHEMBL398557",
          "CHEMBL399203",
          "CHEMBL399329",
          "CHEMBL400049",
          "CHEMBL400067",
          "CHEMBL400947",
          "CHEMBL401335",
          "CHEMBL402501",
          "CHEMBL40317",
          "CHEMBL403297",
          "CHEMBL404626",
          "CHEMBL405245",
          "CHEMBL40650",
          "CHEMBL40898",
          "CHEMBL40966",
          "CHEMBL410702",
          "CHEMBL41113",
          "CHEMBL415039",
          "CHEMBL417250",
          "CHEMBL417325",
          "CHEMBL417613",
          "CHEMBL417709",
          "CHEMBL418234",
          "CHEMBL418308",
          "CHEMBL418411",
          "CHEMBL418600",
          "CHEMBL419085",
          "CHEMBL41948",
          "CHEMBL419787",
          "CHEMBL421871",
          "CHEMBL422876",
          "CHEMBL424167",
          "CHEMBL424866",
          "CHEMBL425161",
          "CHEMBL425190",
          "CHEMBL425658",
          "CHEMBL428027",
          "CHEMBL429",
          "CHEMBL430361",
          "CHEMBL430390",
          "CHEMBL430392",
          "CHEMBL430594",
          "CHEMBL431048",
          "CHEMBL431678",
          "CHEMBL433042",
          "CHEMBL433248",
          "CHEMBL433252",
          "CHEMBL433454",
          "CHEMBL434",
          "CHEMBL434284",
          "CHEMBL434763",
          "CHEMBL439794",
          "CHEMBL440561",
          "CHEMBL440961",
          "CHEMBL442",
          "CHEMBL442172",
          "CHEMBL442225",
          "CHEMBL443435",
          "CHEMBL444553",
          "CHEMBL445481",
          "CHEMBL446806",
          "CHEMBL446840",
          "CHEMBL447786",
          "CHEMBL452696",
          "CHEMBL452798",
          "CHEMBL452861",
          "CHEMBL453047",
          "CHEMBL453048",
          "CHEMBL456352",
          "CHEMBL456485",
          "CHEMBL456795",
          "CHEMBL457839",
          "CHEMBL458001",
          "CHEMBL458002",
          "CHEMBL458220",
          "CHEMBL458541",
          "CHEMBL461463",
          "CHEMBL462313",
          "CHEMBL466088",
          "CHEMBL466467",
          "CHEMBL466515",
          "CHEMBL466519",
          "CHEMBL466704",
          "CHEMBL466705",
          "CHEMBL466713",
          "CHEMBL466726",
          "CHEMBL466879",
          "CHEMBL466923",
          "CHEMBL466924",
          "CHEMBL466925",
          "CHEMBL467082",
          "CHEMBL467083",
          "CHEMBL467094",
          "CHEMBL467102",
          "CHEMBL467103",
          "CHEMBL467116",
          "CHEMBL467117",
          "CHEMBL467298",
          "CHEMBL467301",
          "CHEMBL467502",
          "CHEMBL469821",
          "CHEMBL470292",
          "CHEMBL470856",
          "CHEMBL470857",
          "CHEMBL471",
          "CHEMBL471060",
          "CHEMBL473495",
          "CHEMBL473702",
          "CHEMBL474393",
          "CHEMBL475236",
          "CHEMBL475237",
          "CHEMBL475389",
          "CHEMBL483202",
          "CHEMBL483407",
          "CHEMBL485847",
          "CHEMBL486051",
          "CHEMBL486278",
          "CHEMBL487507",
          "CHEMBL487508",
          "CHEMBL487682",
          "CHEMBL488223",
          "CHEMBL488224",
          "CHEMBL490733",
          "CHEMBL49080",
          "CHEMBL491251",
          "CHEMBL495075",
          "CHEMBL497113",
          "CHEMBL497280",
          "CHEMBL497453",
          "CHEMBL497847",
          "CHEMBL497963",
          "CHEMBL498145",
          "CHEMBL498302",
          "CHEMBL498305",
          "CHEMBL498531",
          "CHEMBL498703",
          "CHEMBL499",
          "CHEMBL500",
          "CHEMBL500782",
          "CHEMBL503209",
          "CHEMBL503468",
          "CHEMBL504479",
          "CHEMBL506518",
          "CHEMBL507003",
          "CHEMBL507506",
          "CHEMBL509336",
          "CHEMBL510102",
          "CHEMBL511552",
          "CHEMBL512099",
          "CHEMBL513104",
          "CHEMBL513389",
          "CHEMBL514032",
          "CHEMBL514102",
          "CHEMBL516002",
          "CHEMBL516056",
          "CHEMBL51963",
          "CHEMBL520313",
          "CHEMBL522708",
          "CHEMBL523475",
          "CHEMBL52407",
          "CHEMBL52473",
          "CHEMBL529659",
          "CHEMBL530556",
          "CHEMBL531322",
          "CHEMBL531401",
          "CHEMBL53359",
          "CHEMBL53517",
          "CHEMBL53679",
          "CHEMBL537445",
          "CHEMBL53842",
          "CHEMBL539226",
          "CHEMBL54716",
          "CHEMBL54749",
          "CHEMBL54750",
          "CHEMBL54821",
          "CHEMBL54885",
          "CHEMBL550743",
          "CHEMBL550746",
          "CHEMBL551272",
          "CHEMBL551350",
          "CHEMBL551389",
          "CHEMBL551831",
          "CHEMBL551832",
          "CHEMBL551892",
          "CHEMBL552089",
          "CHEMBL552368",
          "CHEMBL552434",
          "CHEMBL552497",
          "CHEMBL55338",
          "CHEMBL555146",
          "CHEMBL55528",
          "CHEMBL55541",
          "CHEMBL557253",
          "CHEMBL557269",
          "CHEMBL557295",
          "CHEMBL55852",
          "CHEMBL561211",
          "CHEMBL561291",
          "CHEMBL561348",
          "CHEMBL561693",
          "CHEMBL561818",
          "CHEMBL562153",
          "CHEMBL562154",
          "CHEMBL56308",
          "CHEMBL563810",
          "CHEMBL563872",
          "CHEMBL56449",
          "CHEMBL564544",
          "CHEMBL564556",
          "CHEMBL565267",
          "CHEMBL565547",
          "CHEMBL565685",
          "CHEMBL565686",
          "CHEMBL565747",
          "CHEMBL565770",
          "CHEMBL56594",
          "CHEMBL566352",
          "CHEMBL566353",
          "CHEMBL566777",
          "CHEMBL566973",
          "CHEMBL566992",
          "CHEMBL567192",
          "CHEMBL56752",
          "CHEMBL56767",
          "CHEMBL56768",
          "CHEMBL567833",
          "CHEMBL567843",
          "CHEMBL567863",
          "CHEMBL568060",
          "CHEMBL568239",
          "CHEMBL568272",
          "CHEMBL568273",
          "CHEMBL568511",
          "CHEMBL568531",
          "CHEMBL568667",
          "CHEMBL570593",
          "CHEMBL570834",
          "CHEMBL57163",
          "CHEMBL572163",
          "CHEMBL57430",
          "CHEMBL57486",
          "CHEMBL576428",
          "CHEMBL576848",
          "CHEMBL577289",
          "CHEMBL577702",
          "CHEMBL577917",
          "CHEMBL57908",
          "CHEMBL579394",
          "CHEMBL58241",
          "CHEMBL583235",
          "CHEMBL58407",
          "CHEMBL584498",
          "CHEMBL585382",
          "CHEMBL585751",
          "CHEMBL587197",
          "CHEMBL58798",
          "CHEMBL59",
          "CHEMBL59270",
          "CHEMBL592879",
          "CHEMBL595449",
          "CHEMBL59765",
          "CHEMBL600007",
          "CHEMBL600400",
          "CHEMBL600401",
          "CHEMBL600616",
          "CHEMBL600617",
          "CHEMBL600817",
          "CHEMBL601036",
          "CHEMBL601429",
          "CHEMBL601430",
          "CHEMBL601858",
          "CHEMBL602257",
          "CHEMBL602258",
          "CHEMBL60281",
          "CHEMBL603271",
          "CHEMBL603274",
          "CHEMBL604125",
          "CHEMBL604311",
          "CHEMBL604333",
          "CHEMBL605372",
          "CHEMBL605993",
          "CHEMBL606208",
          "CHEMBL61429",
          "CHEMBL61861",
          "CHEMBL61962",
          "CHEMBL62032",
          "CHEMBL631",
          "CHEMBL6310",
          "CHEMBL63138",
          "CHEMBL63357",
          "CHEMBL63760",
          "CHEMBL63825",
          "CHEMBL63842",
          "CHEMBL63963",
          "CHEMBL64201",
          "CHEMBL64697",
          "CHEMBL64760",
          "CHEMBL64932",
          "CHEMBL64935",
          "CHEMBL64936",
          "CHEMBL65042",
          "CHEMBL65461",
          "CHEMBL65513",
          "CHEMBL66789",
          "CHEMBL66859",
          "CHEMBL66908",
          "CHEMBL66936",
          "CHEMBL66964",
          "CHEMBL67015",
          "CHEMBL67251",
          "CHEMBL67404",
          "CHEMBL67416",
          "CHEMBL67461",
          "CHEMBL67534",
          "CHEMBL67672",
          "CHEMBL67886",
          "CHEMBL679",
          "CHEMBL67993",
          "CHEMBL67998",
          "CHEMBL68021",
          "CHEMBL68131",
          "CHEMBL68301",
          "CHEMBL68334",
          "CHEMBL68408",
          "CHEMBL68685",
          "CHEMBL68766",
          "CHEMBL70230",
          "CHEMBL707",
          "CHEMBL71348",
          "CHEMBL714",
          "CHEMBL71948",
          "CHEMBL72060",
          "CHEMBL72168",
          "CHEMBL72169",
          "CHEMBL723",
          "CHEMBL73220",
          "CHEMBL73917",
          "CHEMBL74085",
          "CHEMBL74860",
          "CHEMBL75604",
          "CHEMBL75753",
          "CHEMBL76403",
          "CHEMBL776",
          "CHEMBL787",
          "CHEMBL79363",
          "CHEMBL79675",
          "CHEMBL79806",
          "CHEMBL79915",
          "CHEMBL82296",
          "CHEMBL82663",
          "CHEMBL83698",
          "CHEMBL83753",
          "CHEMBL83754",
          "CHEMBL841",
          "CHEMBL84117",
          "CHEMBL84190",
          "CHEMBL926",
          "CHEMBL98088",
          "CHEMBL99219",
          "CHEMBL99599"
        ],
        "number_of_missing_values": "0"
      },
      {
        "data_type": "numeric",
        "index": "1",
        "is_ignore": "false",
        "is_row_identifier": "false",
        "is_target": "false",
        "name": "RBF",
        "number_of_missing_values": "0"
      },
      {
        "data_type": "numeric",
        "index": "2",
        "is_ignore": "false",
        "is_row_identifier": "false",
        "is_target": "false",
        "name": "N.",
        "number_of_missing_values": "0"
      },
      {
        "data_type": "numeric",
        "index": "3",
        "is_ignore": "false",
        "is_row_identifier": "false",
        "is_target": "false",
        "name": "nCsp3",
        "number_of_missing_values": "0"
      },
      {
        "data_type": "numeric",
        "index": "4",
        "is_ignore": "false",
        "is_row_identifier": "false",
        "is_target": "false",
        "name": "RBN",
        "number_of_missing_values": "0"
      },
      {
        "data_type": "numeric",
        "index": "5",
        "is_ignore": "false",
        "is_row_identifier": "false",
        "is_target": "false",
        "name": "nN",
        "number_of_missing_values": "0"
      },
      {
        "data_type": "numeric",
        "index": "6",
        "is_ignore": "false",
        "is_row_identifier": "false",
        "is_target": "false",
        "name": "nAB",
        "number_of_missing_values": "0"
      },
      {
        "data_type": "numeric",
        "index": "7",
        "is_ignore": "false",
        "is_row_identifier": "false",
        "is_target": "false",
        "name": "H.",
        "number_of_missing_values": "0"
      },
      {
        "data_type": "numeric",
        "index": "8",
        "is_ignore": "false",
        "is_row_identifier": "false",
        "is_target": "false",
        "name": "C.",
        "number_of_missing_values": "0"
      },
      {
        "data_type": "numeric",
        "index": "9",
        "is_ignore": "false",
        "is_row_identifier": "false",
        "is_target": "false",
        "name": "nBM",
        "number_of_missing_values": "0"
      },
      {
        "data_type": "numeric",
        "index": "10",
        "is_ignore": "false",
        "is_row_identifier": "false",
        "is_target": "false",
        "name": "O.",
        "number_of_missing_values": "0"
      },
      {
        "data_type": "numeric",
        "index": "11",
        "is_ignore": "false",
        "is_row_identifier": "false",
        "is_target": "false",
        "name": "Mp",
        "number_of_missing_values": "0"
      },
      {
        "data_type": "numeric",
        "index": "12",
        "is_ignore": "false",
        "is_row_identifier": "false",
        "is_target": "false",
        "name": "Mv",
        "number_of_missing_values": "0"
      },
      {
        "data_type": "numeric",
        "index": "13",
        "is_ignore": "false",
        "is_row_identifier": "false",
        "is_target": "false",
        "name": "nH",
        "number_of_missing_values": "0"
      },
      {
        "data_type": "numeric",
        "index": "14",
        "is_ignore": "false",
        "is_row_identifier": "false",
        "is_target": "false",
        "name": "SCBO",
        "number_of_missing_values": "0"
      },
      {
        "data_type": "numeric",
        "index": "15",
        "is_ignore": "false",
        "is_row_identifier": "false",
        "is_target": "false",
        "name": "nHet",
        "number_of_missing_values": "0"
      },
      {
        "data_type": "numeric",
        "index": "16",
        "is_ignore": "false",
        "is_row_identifier": "false",
        "is_target": "false",
        "name": "nCsp2",
        "number_of_missing_values": "0"
      },
      {
        "data_type": "numeric",
        "index": "17",
        "is_ignore": "false",
        "is_row_identifier": "false",
        "is_target": "false",
        "name": "Me",
        "number_of_missing_values": "0"
      },
      {
        "data_type": "numeric",
        "index": "18",
        "is_ignore": "false",
        "is_row_identifier": "false",
        "is_target": "false",
        "name": "nF",
        "number_of_missing_values": "0"
      },
      {
        "data_type": "numeric",
        "index": "19",
        "is_ignore": "false",
        "is_row_identifier": "false",
        "is_target": "false",
        "name": "nBO",
        "number_of_missing_values": "0"
      },
      {
        "data_type": "numeric",
        "index": "20",
        "is_ignore": "false",
        "is_row_identifier": "false",
        "is_target": "false",
        "name": "nSK",
        "number_of_missing_values": "0"
      },
      {
        "data_type": "numeric",
        "index": "21",
        "is_ignore": "false",
        "is_row_identifier": "false",
        "is_target": "false",
        "name": "AMW",
        "number_of_missing_values": "0"
      },
      {
        "data_type": "numeric",
        "index": "22",
        "is_ignore": "false",
        "is_row_identifier": "false",
        "is_target": "false",
        "name": "nO",
        "number_of_missing_values": "0"
      },
      {
        "data_type": "numeric",
        "index": "23",
        "is_ignore": "false",
        "is_row_identifier": "false",
        "is_target": "false",
        "name": "Si",
        "number_of_missing_values": "0"
      },
      {
        "data_type": "numeric",
        "index": "24",
        "is_ignore": "false",
        "is_row_identifier": "false",
        "is_target": "false",
        "name": "MW",
        "number_of_missing_values": "0"
      },
      {
        "data_type": "numeric",
        "index": "25",
        "is_ignore": "false",
        "is_row_identifier": "false",
        "is_target": "false",
        "name": "Sv",
        "number_of_missing_values": "0"
      },
      {
        "data_type": "numeric",
        "index": "26",
        "is_ignore": "false",
        "is_row_identifier": "false",
        "is_target": "false",
        "name": "Se",
        "number_of_missing_values": "0"
      },
      {
        "data_type": "numeric",
        "index": "27",
        "is_ignore": "false",
        "is_row_identifier": "false",
        "is_target": "true",
        "name": "pXC50",
        "number_of_missing_values": "0"
      }
    ]
  }
}