{
  "data_set_description": {
    "collection_date": "November 2013",
    "creator": "Dr Jeremy Besnard, Dr Ivan Olier, Dr Noureddin Sadawi, Dr Larisa Soldatova, Dr Crina Grosan, Prof Ross King, Dr Richard Bickerton, Prof Andrew Hopkins and Dr Willem van Hoorn",
    "default_target_attribute": "pXC50",
    "description": "This dataset contains QSAR data (from ChEMBL version 17) showing activity values (unit is pseudo-pCI50) of several compounds on drug target ChEMBL_ID: CHEMBL5062 (TID: 20023), and it has 60 rows and 1239 features (not including molecule IDs and class feature: molecule_id and pXC50). The features represent Molecular Descriptors which were generated from SMILES strings. Missing value imputation was applied to this dataset (By choosing the Median).",
    "description_version": "1",
    "file_id": "3559019",
    "format": "ARFF",
    "id": "35468",
    "licence": "Public",
    "md5_checksum": "bfe8355912bfd04bb65872f4dd6b0b08",
    "minio_url": "https://data.openml.org/datasets/0003/35468/dataset_35468.pq",
    "name": "QSAR-DATASET-FOR-DRUG-TARGET-CHEMBL5062",
    "original_data_url": "https://www.ebi.ac.uk/chembl/target/inspect/CHEMBL5062",
    "parquet_url": "https://data.openml.org/datasets/0003/35468/dataset_35468.pq",
    "processing_date": "2018-10-04 04:27:17",
    "row_id_attribute": "molecule_id",
    "status": "deactivated",
    "tag": [
      "MetaQSAR",
      "study_13"
    ],
    "upload_date": "2016-07-15T18:07:34",
    "url": "https://api.openml.org/data/v1/download/3559019/QSAR-DATASET-FOR-DRUG-TARGET-CHEMBL5062.arff",
    "version": "12",
    "visibility": "public"
  }
}