"molecule_id","AMW","C.","H.","Me","Mi","Mp","Mv","MW","N.","nAB","nAT","nB","nBM","nBO","nBR","nBT","nC","nCL","nCsp","nCsp2","nCsp3","nDB","nF","nH","nHet","nHM","nI","nN","nO","nP","nS","nSK","nTB","nX","O.","RBF","RBN","SCBO","Se","Si","Sp","Sv","X.","pXC50"
{1 7.459,2 47.8,3 43.5,4 0.993,5 1.113,6 0.693,7 0.657,8 514.67,9 5.8,10 32,11 69,13 33,14 44,16 74,17 33,20 27,21 6,22 1,24 30,25 6,28 4,29 2,32 39,35 2.9,36 0.095,37 7,38 61,39 68.549,40 76.81,41 47.83,42 45.364,44 9.481}
{0 CHEMBL115021,1 7.573,2 41.8,3 43.6,4 1.004,5 1.13,6 0.669,7 0.642,8 416.53,9 10.9,10 22,11 55,13 23,14 34,16 58,17 23,20 17,21 6,22 1,24 24,25 8,28 6,29 2,32 31,35 3.6,36 0.138,37 8,38 46,39 55.218,40 62.145,41 36.796,42 35.299,44 6}
{0 CHEMBL121872,1 8.56,2 39.1,3 44.8,4 1.014,5 1.13,6 0.671,7 0.638,8 744.75,9 5.7,10 18,11 87,13 24,14 51,15 1,16 90,17 34,20 22,21 12,22 6,23 1,24 39,25 14,26 2,28 5,29 6,31 1,32 48,34 2,35 6.9,36 0.156,37 14,38 66,39 88.196,40 98.323,41 58.398,42 55.474,43 2.3,44 8.602}
{0 CHEMBL121907,1 8.154,2 38.9,3 43.3,4 1.027,5 1.144,6 0.651,7 0.635,8 733.86,9 5.6,10 18,11 90,13 24,14 54,16 93,17 35,20 22,21 13,22 6,23 4,24 39,25 16,26 1,28 5,29 6,31 1,32 51,34 4,35 6.7,36 0.151,37 14,38 69,39 92.388,40 102.916,41 58.62,42 57.125,43 4.4,44 8.585}
{0 CHEMBL122157,1 9.008,2 39.7,3 42.3,4 1.02,5 1.129,6 0.681,7 0.652,8 702.66,9 6.4,10 18,11 78,13 24,14 48,15 1,16 81,17 31,20 22,21 9,22 6,23 1,24 33,25 14,26 2,28 5,29 6,31 1,32 45,34 2,35 7.7,36 0.136,37 11,38 63,39 79.545,40 88.077,41 53.114,42 50.893,43 2.6,44 8.77}
{0 CHEMBL122158,1 8.566,2 42,3 39.8,4 1.03,5 1.137,6 0.672,7 0.66,8 753.84,9 5.7,10 24,11 88,13 30,14 57,16 92,17 37,20 28,21 9,22 6,23 4,24 35,25 16,26 1,28 5,29 6,31 1,32 53,34 4,35 6.8,36 0.13,37 12,38 75,39 90.621,40 100.085,41 59.097,42 58.072,43 4.5,44 8.276}
{0 CHEMBL122273,1 9.292,2 43.2,3 39.5,4 1.021,5 1.126,6 0.699,7 0.674,8 752.69,9 6.2,10 24,11 81,13 30,14 53,15 1,16 85,17 35,20 28,21 7,22 6,23 2,24 32,25 14,26 2,28 5,29 5,31 1,32 49,34 3,35 6.2,36 0.141,37 12,38 71,39 82.73,40 91.208,41 56.597,42 54.562,43 3.7,44 9.194}
{0 CHEMBL122380,1 9.515,2 43.2,3 38.3,4 1.028,5 1.13,6 0.698,7 0.678,8 770.68,9 6.2,10 24,11 81,13 30,14 54,15 1,16 85,17 35,20 28,21 7,22 6,23 3,24 31,25 15,26 2,28 5,29 5,31 1,32 50,34 4,35 6.2,36 0.141,37 12,38 72,39 83.243,40 91.547,41 56.534,42 54.945,43 4.9,44 8.824}
{0 CHEMBL122401,1 9.733,2 42.9,3 39.3,4 1.021,5 1.121,6 0.716,7 0.683,8 817.61,9 6,10 24,11 84,13 30,14 55,15 1,16 88,17 36,18 2,20 28,21 8,22 6,23 1,24 33,25 15,26 4,28 5,29 5,31 1,32 51,34 4,35 6,36 0.148,37 13,38 73,39 85.749,40 94.171,41 60.137,42 57.36,43 4.8,44 8.699}
{0 CHEMBL122917,1 8.066,2 39.3,3 43.8,4 1.023,5 1.143,6 0.654,7 0.634,8 717.86,9 5.6,10 18,11 89,13 24,14 53,16 92,17 35,20 22,21 13,22 6,23 4,24 39,25 15,26 1,28 5,29 5,31 1,32 50,34 4,35 5.6,36 0.141,37 13,38 68,39 91.061,40 101.706,41 58.165,42 56.41,43 4.5,44 8.367}
{0 CHEMBL124771,1 8.699,2 39.3,3 44,4 1.016,5 1.13,6 0.674,7 0.642,8 730.72,9 6,10 18,11 84,13 24,14 50,15 1,16 87,17 33,20 22,21 11,22 6,23 1,24 37,25 14,26 2,28 5,29 6,31 1,32 47,34 2,35 7.1,36 0.149,37 13,38 65,39 85.312,40 94.908,41 56.637,42 53.947,43 2.4,44 8.638}
{0 CHEMBL124903,1 8.274,2 39.1,3 42.5,4 1.029,5 1.144,6 0.654,7 0.639,8 719.83,9 5.7,10 18,11 87,13 24,14 53,16 90,17 34,20 22,21 12,22 6,23 4,24 37,25 16,26 1,28 5,29 6,31 1,32 50,34 4,35 6.9,36 0.144,37 13,38 68,39 89.505,40 99.5,41 56.858,42 55.598,43 4.6,44 8.086}
{0 CHEMBL125008,1 8.85,2 42,3 42,4 1.015,5 1.124,6 0.689,7 0.658,8 778.76,9 5.7,10 24,11 88,13 30,14 55,15 1,16 92,17 37,20 28,21 9,22 6,23 1,24 37,25 14,26 2,28 5,29 6,31 1,32 51,34 2,35 6.8,36 0.141,37 13,38 73,39 89.312,40 98.908,41 60.637,42 57.947,43 2.3,44 8.215}
{0 CHEMBL125280,1 8.831,2 42.9,3 38.1,4 1.035,5 1.14,6 0.676,7 0.669,8 741.8,9 6,10 24,11 84,13 30,14 56,16 88,17 36,20 28,21 8,22 6,23 5,24 32,25 16,26 1,28 5,29 5,31 1,32 52,34 5,35 6,36 0.136,37 12,38 74,39 86.923,40 95.8,41 56.819,42 56.213,43 6,44 8.699}
{0 CHEMBL125542,1 7.39,2 40.8,3 45.1,4 1.001,5 1.132,6 0.663,7 0.633,8 524.69,9 11.3,10 22,11 71,13 25,14 43,16 75,17 29,20 20,21 9,22 3,24 32,25 10,28 8,29 2,32 39,35 2.8,36 0.147,37 11,38 57,39 71.072,40 80.388,41 47.091,42 44.922,44 6.103}
{0 CHEMBL125760,1 8.393,2 39,3 42.7,4 1.023,5 1.132,6 0.669,7 0.646,8 688.24,9 6.1,10 18,11 82,13 24,14 50,16 85,17 32,18 1,20 22,21 10,22 6,23 1,24 35,25 15,26 2,28 5,29 7,31 1,32 47,34 2,35 8.5,36 0.153,37 13,38 65,39 83.851,40 92.804,41 54.835,42 52.937,43 2.4,44 8.824}
{0 CHEMBL128416,1 7.581,2 49,3 42.9,4 0.998,5 1.108,6 0.694,7 0.662,8 371.46,9 2,10 18,11 49,13 20,14 31,16 52,17 24,20 20,21 4,22 2,24 21,25 4,28 1,29 3,32 28,35 6.1,36 0.077,37 4,38 42,39 48.92,40 54.279,41 33.983,42 32.434,44 6.699}
{0 CHEMBL130896,1 6.996,2 42.7,3 48,4 0.994,5 1.124,6 0.661,7 0.622,8 524.72,9 5.3,10 22,11 75,13 24,14 43,16 79,17 32,20 21,21 11,22 2,24 36,25 7,28 4,29 3,32 39,35 4,36 0.114,37 9,38 56,39 74.527,40 84.265,41 49.569,42 46.659,44 6.319}
{0 CHEMBL154057,1 7.138,2 44.3,3 47.1,4 0.998,5 1.117,6 0.664,7 0.629,8 499.65,9 1.4,10 18,11 70,13 20,14 41,16 74,17 31,20 20,21 11,22 2,24 33,25 6,28 1,29 5,32 37,35 7.1,36 0.108,37 8,38 52,39 69.876,40 78.189,41 46.461,42 44.024,44 8.959}
{0 CHEMBL155728,1 7.568,2 44.1,3 44.1,4 1.008,5 1.119,6 0.668,7 0.643,8 446.54,9 3.4,10 18,11 59,13 20,14 36,16 62,17 26,20 20,21 6,22 2,24 26,25 7,28 2,29 5,32 33,35 8.5,36 0.097,37 6,38 47,39 59.443,40 66.026,41 39.421,42 37.938,44 8.027}
{0 CHEMBL155836,1 7.576,2 47.8,3 43.3,4 1.002,5 1.11,6 0.686,7 0.656,8 507.62,9 1.5,10 24,11 67,13 26,14 42,16 71,17 32,20 26,21 6,22 2,24 29,25 6,28 1,29 5,32 38,35 7.5,36 0.113,37 8,38 56,39 67.109,40 74.358,41 45.938,42 43.971,44 8.62}
{0 CHEMBL155847,1 8.045,2 44.6,3 41.1,4 1.019,5 1.124,6 0.671,7 0.657,8 450.5,9 3.6,10 18,11 56,13 20,14 36,16 59,17 25,20 20,21 5,22 2,23 1,24 23,25 8,28 2,29 5,32 33,34 1,35 8.9,36 0.102,37 6,38 47,39 57.072,40 62.951,41 37.597,42 36.795,43 1.8,44 6.77}
{0 CHEMBL155938,1 8.779,2 45.6,3 40.4,4 1.017,5 1.113,6 0.704,7 0.677,8 500.4,9 1.8,10 18,11 57,13 20,14 37,16 60,17 26,18 2,20 20,21 6,22 2,24 23,25 8,26 2,28 1,29 5,32 34,34 2,35 8.8,36 0.117,37 7,38 48,39 57.989,40 63.416,41 40.131,42 38.572,43 3.5,44 7.155}
{0 CHEMBL155987,1 7.576,2 47.8,3 43.3,4 1.002,5 1.11,6 0.686,7 0.656,8 507.62,9 1.5,10 24,11 67,13 26,14 42,16 71,17 32,20 26,21 6,22 2,24 29,25 6,28 1,29 5,32 38,35 7.5,36 0.113,37 8,38 56,39 67.109,40 74.358,41 45.938,42 43.971,44 7.229}
{0 CHEMBL156100,1 7.455,2 45.9,3 44.6,4 1.003,5 1.113,6 0.675,7 0.645,8 551.68,9 1.4,10 24,11 74,13 26,14 45,16 78,17 34,20 26,21 8,22 2,24 33,25 7,28 1,29 6,32 41,35 8.1,36 0.115,37 9,38 59,39 74.203,40 82.398,41 49.915,42 47.739,44 8.721}
{0 CHEMBL156129,1 7.452,2 47.1,3 44.3,4 1,5 1.111,6 0.681,7 0.65,8 521.65,9 1.4,10 24,11 70,13 26,14 43,16 74,17 33,20 26,21 7,22 2,24 31,25 6,28 1,29 5,32 39,35 7.1,36 0.122,37 9,38 57,39 69.992,40 77.773,41 47.699,42 45.497,44 8.319}
{0 CHEMBL156165,1 8.604,2 47.8,3 40.3,4 1.011,5 1.108,6 0.711,7 0.681,8 576.5,9 1.5,10 24,11 67,13 26,14 44,16 71,17 32,18 2,20 26,21 6,22 2,24 27,25 8,26 2,28 1,29 5,32 40,34 2,35 7.5,36 0.113,37 8,38 58,39 67.756,40 74.246,41 47.654,42 45.626,43 3,44 7.456}
{0 CHEMBL156587,1 7.706,2 47,3 42.4,4 1.005,5 1.113,6 0.685,7 0.659,8 508.61,9 3,10 24,11 66,13 26,14 42,16 70,17 31,20 26,21 5,22 2,24 28,25 7,28 2,29 5,32 38,35 7.6,36 0.1,37 7,38 56,39 66.327,40 73.441,41 45.182,42 43.465,44 7.398}
{0 CHEMBL157510,1 7.576,2 47.8,3 43.3,4 1.002,5 1.11,6 0.686,7 0.656,8 507.62,9 1.5,10 24,11 67,13 26,14 42,16 71,17 32,20 26,21 6,22 2,24 29,25 6,28 1,29 5,32 38,35 7.5,36 0.113,37 8,38 56,39 67.109,40 74.358,41 45.938,42 43.971,44 9.237}
{0 CHEMBL157946,1 7.267,2 44.3,3 45.7,4 0.997,5 1.12,6 0.672,7 0.637,8 508.67,9 5.7,10 23,11 70,13 25,14 42,16 74,17 31,20 23,21 8,22 2,24 32,25 7,28 4,29 3,32 38,35 4.3,36 0.095,37 7,38 55.5,39 69.76,40 78.434,41 47.046,42 44.605,44 8.121}
{0 CHEMBL158557,1 7.88,2 47.1,3 41.4,4 1.011,5 1.111,6 0.684,7 0.663,8 551.63,9 1.4,10 24,11 70,13 27,14 45,16 74,17 33,20 27,21 6,22 3,24 29,25 8,28 1,29 7,32 41,35 10,36 0.122,37 9,38 60,39 70.763,40 77.777,41 47.847,42 46.4,44 6.125}
{0 CHEMBL160930,1 8.009,2 46.4,3 40.6,4 1.014,5 1.114,6 0.682,7 0.665,8 552.62,9 2.9,10 24,11 69,13 28,14 45,16 73,17 32,20 26,21 6,22 4,24 28,25 9,28 2,29 7,32 41,35 10.1,36 0.123,37 9,38 61,39 69.982,40 76.86,41 47.091,42 45.895,44 6.432}
{0 CHEMBL165354,1 8.626,2 43.8,3 40.6,4 1.015,5 1.115,6 0.702,7 0.671,8 552.09,9 4.7,10 23,11 64,13 27,14 41,16 67,17 28,18 1,20 23,21 5,22 4,24 26,25 10,26 2,28 3,29 5,31 1,32 38,34 1,35 7.8,36 0.149,37 10,38 56.5,39 64.945,40 71.388,41 44.932,42 42.974,43 1.6,44 8.699}
{0 CHEMBL165572,1 9.474,2 41.1,3 35.7,4 1.052,5 1.16,6 0.671,7 0.675,8 530.54,9 7.1,10 18,11 56,13 20,14 39,16 59,17 23,20 16,21 7,22 2,23 6,24 20,25 13,26 1,28 4,29 2,31 1,32 36,34 6,35 3.6,36 0.102,37 6,38 50,39 58.934,40 64.937,41 37.58,42 37.797,43 10.7,44 7}
{0 CHEMBL166143,1 8.382,2 45.1,3 39.2,4 1.026,5 1.139,6 0.674,7 0.665,8 427.46,9 5.9,10 18,11 51,13 19,14 34,16 54,17 23,20 17,21 6,22 1,23 3,24 20,25 8,28 3,29 2,32 31,34 3,35 3.9,36 0.093,37 5,38 44,39 52.334,40 58.085,41 34.353,42 33.912,43 5.9,44 6.561}
{0 CHEMBL1668003,1 8.224,2 44.6,3 39.3,4 1.016,5 1.136,6 0.682,7 0.667,8 460.53,9 10.7,10 27,11 56,13 27,14 38,16 60,17 25,20 20,21 5,23 2,24 22,25 9,28 6,29 1,32 34,34 2,35 1.8,36 0.117,37 7,38 51.5,39 56.916,40 63.615,41 38.216,42 37.351,43 3.6,44 6.319}
{0 CHEMBL1668007,1 7.845,2 41.8,3 44,4 1.011,5 1.126,6 0.671,7 0.642,8 713.9,9 5.5,10 23,11 91,13 29,14 56,16 96,17 38,20 26,21 12,22 6,23 1,24 40,25 13,26 1,28 5,29 6,31 1,32 51,34 1,35 6.6,36 0.135,37 13,38 73.5,39 91.967,40 102.481,41 61.046,42 58.449,43 1.1,44 8.456}
{0 CHEMBL1668008,1 8.333,2 43.9,3 40.4,4 1.01,5 1.124,6 0.696,7 0.669,8 474.99,9 10.5,10 22,11 57,13 24,14 38,16 61,17 25,18 1,20 19,21 6,22 2,24 23,25 9,26 1,28 6,29 2,32 34,34 1,35 3.5,36 0.115,37 7,38 51,39 57.542,40 64.089,41 39.654,42 38.127,43 1.8,44 8}
{0 CHEMBL1668009,1 8.333,2 43.9,3 40.4,4 1.01,5 1.124,6 0.696,7 0.669,8 474.99,9 10.5,10 22,11 57,13 24,14 38,16 61,17 25,18 1,20 19,21 6,22 2,24 23,25 9,26 1,28 6,29 2,32 34,34 1,35 3.5,36 0.115,37 7,38 51,39 57.542,40 64.089,41 39.654,42 38.127,43 1.8,44 7.301}
{0 CHEMBL170290,1 7.607,2 41.1,3 43.9,4 1.009,5 1.129,6 0.661,7 0.637,8 814,9 8.4,10 33,11 107,13 38,14 66,16 113,17 44,20 30,21 14,22 5,24 47,25 16,28 9,29 7,32 60,35 6.5,36 0.168,37 19,38 87.5,39 107.996,40 120.839,41 70.699,42 68.205,44 8.444}
{0 CHEMBL17487,1 7.905,2 39.5,3 44.2,4 1.016,5 1.131,6 0.66,7 0.635,8 679.84,9 5.8,10 18,11 86,13 24,14 52,16 90,17 34,20 22,21 12,22 6,23 1,24 38,25 14,26 1,28 5,29 7,31 1,32 48,34 1,35 8.1,36 0.122,37 11,38 67,39 87.41,40 97.275,41 56.739,42 54.637,43 1.2,44 7.187}
{0 CHEMBL177435,1 7.734,2 46.6,3 41.4,4 0.998,5 1.12,6 0.696,7 0.665,8 448.57,9 10.3,10 28,11 58,13 29,14 38,16 62,17 27,20 23,21 4,22 1,24 24,25 7,28 6,29 1,32 34,35 1.7,36 0.129,37 8,38 53,39 57.891,40 64.936,41 40.341,42 38.584,44 8.174}
{0 CHEMBL1791259,1 7.343,2 36.9,3 46.8,4 1.012,5 1.138,6 0.636,7 0.612,8 1035.3,9 8.5,10 23,11 141,13 32,14 80,16 146,17 52,20 30,21 22,22 9,24 66,25 23,28 12,29 11,32 75,35 7.8,36 0.171,37 25,38 100.5,39 142.679,40 160.493,41 89.626,42 86.343,44 5}
{0 CHEMBL1791308,1 7.229,2 35.8,3 47.8,4 1.011,5 1.141,6 0.63,7 0.605,8 1149.47,9 8.8,10 23,11 159,13 33,14 88,16 164,17 57,20 31,21 26,22 10,24 76,25 26,28 14,29 12,32 83,35 7.5,36 0.171,37 28,38 109.5,39 160.744,40 181.36,41 100.137,42 96.208,44 9.523}
{0 CHEMBL1791309,1 7.345,2 36.4,3 46.9,4 1.012,5 1.14,6 0.634,7 0.611,8 1050.32,9 9.1,10 23,11 143,13 32,14 81,16 148,17 52,20 30,21 22,22 9,24 67,25 24,28 13,29 11,32 76,35 7.7,36 0.169,37 25,38 101.5,39 144.781,40 162.992,41 90.631,42 87.365,44 6.93}
{0 CHEMBL1791349,1 7.009,2 34.3,3 49.7,4 1.009,5 1.144,6 0.62,7 0.592,8 1002.33,9 9.1,10 17,11 143,13 26,14 75,16 146,17 49,20 24,21 25,22 9,24 71,25 23,28 13,29 10,32 72,35 7,36 0.192,37 28,38 92.5,39 144.221,40 163.613,41 88.7,42 84.703,44 9.745}
{0 CHEMBL1791350,1 7.046,2 33.6,3 49.6,4 1.011,5 1.145,6 0.616,7 0.59,8 965.26,9 8.8,10 12,11 137,13 22,14 71,16 139,17 46,20 22,21 24,22 10,24 68,25 23,28 12,29 11,32 69,35 8,36 0.194,37 27,38 87,39 138.563,40 156.909,41 84.387,42 80.87,44 9.155}
{0 CHEMBL1791351,1 7.309,2 36.4,3 47.1,4 1.012,5 1.139,6 0.633,7 0.61,8 1023.29,9 8.6,10 23,11 140,13 32,14 78,16 144,17 51,20 30,21 21,22 9,24 66,25 23,28 12,29 11,32 74,35 7.9,36 0.188,37 27,38 98.5,39 141.679,40 159.493,41 88.626,42 85.343,44 6.334}
{0 CHEMBL1801740,1 7.129,2 43.3,3 46.3,4 0.99,5 1.126,6 0.674,7 0.634,8 477.67,9 10.4,10 27,11 67,13 27,14 41,16 72,17 29,20 19,21 10,24 31,25 7,28 7,32 36,36 0.083,37 6,38 54.5,39 66.316,40 75.471,41 45.177,42 42.471,44 5}
{0 CHEMBL187871,1 8.088,2 38.5,3 46.2,4 1.007,5 1.12,6 0.683,7 0.636,8 420.6,9 3.8,10 11,11 52,13 15,14 29,16 53,17 20,19 1,20 11,21 8,22 3,24 24,25 8,26 2,28 2,29 4,31 2,32 28,33 1,35 7.7,36 0.17,37 9,38 39.5,39 52.385,40 58.241,41 35.5,42 33.071,44 5}
{0 CHEMBL187880,1 7.592,2 35.4,3 46.8,4 1.013,5 1.138,6 0.643,7 0.614,8 599.79,9 8.9,10 11,11 79,13 16,14 45,16 82,17 28,20 14,21 14,22 5,24 37,25 14,26 1,28 7,29 6,31 1,32 42,35 7.6,36 0.134,37 11,38 55.5,39 80.007,40 89.893,41 50.836,42 48.528,44 9}
{0 CHEMBL189568,1 7.798,2 37.7,3 47.5,4 1.004,5 1.124,6 0.673,7 0.625,8 475.69,9 4.9,10 16,11 61,13 19,14 34,16 63,17 23,20 14,21 9,22 3,24 29,25 9,26 2,28 3,29 4,31 2,32 32,35 6.6,36 0.175,37 11,38 45,39 61.254,40 68.57,41 41.029,42 38.146,44 9.398}
{0 CHEMBL190286,1 7.592,2 35.4,3 46.8,4 1.013,5 1.138,6 0.643,7 0.614,8 599.79,9 8.9,10 11,11 79,13 16,14 45,16 82,17 28,20 14,21 14,22 5,24 37,25 14,26 1,28 7,29 6,31 1,32 42,35 7.6,36 0.134,37 11,38 55.5,39 80.007,40 89.893,41 50.836,42 48.528,44 8.432}
{0 CHEMBL190577,1 7.586,2 39.7,3 47.9,4 0.999,5 1.121,6 0.676,7 0.626,8 553.81,9 4.1,10 21,11 73,13 24,14 41,16 76,17 29,20 18,21 11,22 3,24 35,25 9,26 2,28 3,29 4,31 2,32 38,35 5.5,36 0.158,37 12,38 54.5,39 72.905,40 81.816,41 49.313,42 45.726,44 8.495}
{0 CHEMBL190796,1 7.798,2 37.7,3 47.5,4 1.004,5 1.124,6 0.673,7 0.625,8 475.69,9 4.9,10 16,11 61,13 19,14 34,16 63,17 23,20 14,21 9,22 3,24 29,25 9,26 2,28 3,29 4,31 2,32 32,35 6.6,36 0.175,37 11,38 45,39 61.254,40 68.57,41 41.029,42 38.146,44 5}
{0 CHEMBL190811,1 7.981,2 39.4,3 45.5,4 1.005,5 1.122,6 0.682,7 0.639,8 526.74,9 6.1,10 21,11 66,13 24,14 39,16 69,17 26,20 17,21 9,22 3,24 30,25 10,26 2,28 4,29 4,31 2,32 36,35 6.1,36 0.159,37 11,38 52.5,39 66.356,40 74.068,41 45.034,42 42.167,44 8.149}
{0 CHEMBL191,1 7.98,2 41.5,3 43.4,4 1.004,5 1.13,6 0.683,7 0.649,8 422.96,9 11.3,10 22,11 53,13 22,14 33,16 56,17 22,18 1,20 16,21 6,24 23,25 8,26 1,28 6,29 1,32 30,34 1,35 1.9,36 0.143,37 8,38 44,39 53.214,40 59.88,41 36.199,42 34.412,43 1.9,44 5}
{0 CHEMBL191468,1 7.902,2 38.2,3 47.3,4 1.005,5 1.121,6 0.677,7 0.629,8 434.63,9 3.6,10 11,11 55,13 15,14 30,16 56,17 21,19 1,20 11,21 9,22 3,24 26,25 8,26 2,28 2,29 4,31 2,32 29,33 1,35 7.3,36 0.179,37 10,38 40.5,39 55.269,40 61.657,41 37.262,42 34.598,44 7.155}
{0 CHEMBL1945006,1 7.407,2 44.9,3 44.9,4 1.001,5 1.118,6 0.673,7 0.642,8 577.73,9 3.8,10 28,11 78,13 30,14 47,16 82,17 35,20 27,21 8,22 2,24 35,25 8,28 3,29 5,32 43,35 6.4,36 0.134,37 11,38 63,39 78.08,40 87.185,41 52.472,42 50.067,44 5}
{0 CHEMBL1945007,1 7.295,2 45.5,3 45.5,4 0.997,5 1.117,6 0.676,7 0.641,8 561.73,9 3.9,10 28,11 77,13 30,14 46,16 81,17 35,20 27,21 8,22 2,24 35,25 7,28 3,29 4,32 42,35 5.2,36 0.136,37 11,38 62,39 76.752,40 85.976,41 52.017,42 49.352,44 5}
{0 CHEMBL1945008,1 7.295,2 45.5,3 45.5,4 0.997,5 1.117,6 0.676,7 0.641,8 561.73,9 3.9,10 28,11 77,13 30,14 46,16 81,17 35,20 27,21 8,22 2,24 35,25 7,28 3,29 4,32 42,35 5.2,36 0.136,37 11,38 62,39 76.752,40 85.976,41 52.017,42 49.352,44 5.824}
{0 CHEMBL1945009,1 7.306,2 44.4,3 45.7,4 1,5 1.119,6 0.67,7 0.637,8 591.76,9 3.7,10 28,11 81,13 30,14 48,16 85,17 36,20 27,21 9,22 2,24 37,25 8,28 3,29 5,32 44,35 6.2,36 0.141,37 12,38 64,39 80.963,40 90.6,41 54.233,42 51.594,44 5.921}
{0 CHEMBL1945010,1 7.306,2 44.4,3 45.7,4 1,5 1.119,6 0.67,7 0.637,8 591.76,9 3.7,10 28,11 81,13 30,14 48,16 85,17 36,20 27,21 9,22 2,24 37,25 8,28 3,29 5,32 44,35 6.2,36 0.141,37 12,38 64,39 80.963,40 90.6,41 54.233,42 51.594,44 5.854}
{0 CHEMBL1945149,1 7.53,2 46.6,3 43.8,4 1.001,5 1.119,6 0.681,7 0.651,8 549.69,9 4.1,10 28,11 73,13 30,14 45,16 77,17 34,20 27,21 7,22 2,23 1,24 32,25 7,28 3,29 3,32 41,34 1,35 4.1,36 0.13,37 10,38 61,39 73.054,40 81.691,41 49.739,42 47.494,43 1.4,44 5.886}
{0 CHEMBL194608,1 7.874,2 39.5,3 44.4,4 1.015,5 1.131,6 0.661,7 0.635,8 637.8,9 6.2,10 18,11 81,13 24,14 48,16 84,17 32,20 22,21 10,22 6,23 1,24 36,25 13,26 1,28 5,29 6,31 1,32 45,34 1,35 7.4,36 0.131,37 11,38 63,39 82.2,40 91.651,41 53.523,42 51.395,43 1.2,44 7.959}
{0 CHEMBL1947129,1 7.401,2 45.9,3 44.6,4 0.998,5 1.116,6 0.679,7 0.646,8 547.7,9 4.1,10 28,11 74,13 30,14 45,16 78,17 34,20 27,21 7,22 2,24 33,25 7,28 3,29 4,32 41,35 5.4,36 0.128,37 10,38 61,39 73.869,40 82.561,41 50.256,42 47.825,44 5.959}
{0 CHEMBL1947130,1 7.401,2 45.9,3 44.6,4 0.998,5 1.116,6 0.679,7 0.646,8 547.7,9 4.1,10 28,11 74,13 30,14 45,16 78,17 34,20 27,21 7,22 2,24 33,25 7,28 3,29 4,32 41,35 5.4,36 0.128,37 10,38 61,39 73.869,40 82.561,41 50.256,42 47.825,44 5}
{0 CHEMBL1947131,1 7.401,2 45.9,3 44.6,4 0.998,5 1.116,6 0.679,7 0.646,8 547.7,9 4.1,10 28,11 74,13 30,14 45,16 78,17 34,20 27,21 7,22 2,24 33,25 7,28 3,29 4,32 41,35 5.4,36 0.128,37 10,38 61,39 73.869,40 82.561,41 50.256,42 47.825,44 5.444}
{0 CHEMBL194864,1 7.594,2 37.3,3 44.9,4 1.017,5 1.138,6 0.641,7 0.622,8 896.08,9 9.3,10 23,11 118,13 31,14 69,16 122,17 44,20 29,21 15,22 8,24 53,25 21,28 11,29 10,32 65,35 8.5,36 0.18,37 22,38 88.5,39 119.948,40 134.295,41 75.597,42 73.446,44 7.384}
{0 CHEMBL196316,1 7.522,2 37.2,3 45.5,4 1.015,5 1.138,6 0.639,7 0.62,8 910.11,9 9.1,10 23,11 121,13 31,14 70,16 125,17 45,20 29,21 16,22 8,24 55,25 21,28 11,29 10,32 66,35 8.3,36 0.184,37 23,38 89.5,39 122.832,40 137.71,41 77.359,42 74.973,44 7.996}
{0 CHEMBL214525,1 7.614,2 39.7,3 46.6,4 1.005,5 1.125,6 0.666,7 0.628,8 441.6,9 5.2,10 17,11 58,13 20,14 33,16 60,17 23,20 16,21 7,22 3,24 27,25 8,26 1,28 3,29 4,31 1,32 31,35 6.9,36 0.167,37 10,38 44.5,39 58.294,40 65.235,41 38.62,42 36.432,44 8.699}
{0 CHEMBL214592,1 7.338,2 39.1,3 48.4,4 1.001,5 1.126,6 0.658,7 0.617,8 469.66,9 4.7,10 17,11 64,13 20,14 35,16 66,17 25,20 16,21 9,22 3,24 31,25 8,26 1,28 3,29 4,31 1,32 33,35 6.3,36 0.182,37 12,38 46.5,39 64.061,40 72.065,41 42.142,42 39.486,44 8.301}
{0 CHEMBL214671,1 8.178,2 40.9,3 43.9,4 1.009,5 1.118,6 0.689,7 0.649,8 539.73,9 4.5,10 22,11 66,13 25,14 40,16 69,17 27,20 20,21 7,22 3,24 29,25 10,26 2,28 3,29 5,31 2,32 37,35 7.6,36 0.174,37 12,38 54,39 66.582,40 73.78,41 45.483,42 42.861,44 5}
{0 CHEMBL215159,1 7.96,2 37.9,3 46.6,4 1.006,5 1.123,6 0.677,7 0.631,8 461.66,9 5.2,10 16,11 58,13 19,14 33,16 60,17 22,20 14,21 8,22 3,24 27,25 9,26 2,28 3,29 4,31 2,32 31,35 6.9,36 0.15,37 9,38 44,39 58.371,40 65.155,41 39.267,42 36.619,44 7.125}
{0 CHEMBL215160,1 7.472,2 38.5,3 47.7,4 1.006,5 1.127,6 0.655,7 0.618,8 485.66,9 4.6,10 17,11 65,13 20,14 36,16 67,17 25,20 16,21 9,22 3,24 31,25 9,26 1,28 3,29 5,31 1,32 34,35 7.7,36 0.194,37 13,38 47.5,39 65.389,40 73.275,41 42.597,42 40.2,44 9.301}
{0 CHEMBL216250,1 7.652,2 37.5,3 48.4,4 1.002,5 1.125,6 0.669,7 0.62,8 489.72,9 4.7,10 16,11 64,13 19,14 35,16 66,17 24,20 14,21 10,22 3,24 31,25 9,26 2,28 3,29 4,31 2,32 33,35 6.3,36 0.182,37 12,38 46,39 64.138,40 71.985,41 42.79,42 39.673,44 9}
{0 CHEMBL216331,1 7.686,2 33.8,3 46.8,4 1.017,5 1.141,6 0.638,7 0.611,8 1068.39,9 9.4,10 17,11 139,13 27,14 77,16 142,17 47,20 25,21 22,22 10,24 65,25 27,26 2,28 13,29 12,31 2,32 74,35 8.6,36 0.211,37 30,38 95.5,39 141.377,40 158.626,41 88.62,42 84.927,44 8.678}
{0 CHEMBL216361,1 7.657,2 37.1,3 48.4,4 1,5 1.127,6 0.671,7 0.62,8 474.71,9 6.5,10 16,11 62,13 19,14 34,16 64,17 23,20 14,21 9,22 3,24 30,25 9,26 2,28 4,29 3,31 2,32 32,35 4.8,36 0.156,37 10,38 45,39 62.029,40 69.859,41 41.58,42 38.453,44 7.886}
{0 CHEMBL216515,1 7.607,2 38.7,3 46.8,4 1.008,5 1.127,6 0.659,7 0.624,8 471.63,9 4.8,10 17,11 62,13 20,14 35,16 64,17 24,20 16,21 8,22 3,24 29,25 9,26 1,28 3,29 5,31 1,32 33,35 8.1,36 0.172,37 11,38 46.5,39 62.505,40 69.86,41 40.835,42 38.674,44 7.824}
{0 CHEMBL216688,1 7.96,2 37.9,3 46.6,4 1.006,5 1.123,6 0.677,7 0.631,8 461.66,9 5.2,10 16,11 58,13 19,14 33,16 60,17 22,20 14,21 8,22 3,24 27,25 9,26 2,28 3,29 4,31 2,32 31,35 6.9,36 0.183,37 11,38 44,39 58.371,40 65.155,41 39.267,42 36.619,44 8.222}
{0 CHEMBL216746,1 7.924,2 41.3,3 43.5,4 0.997,5 1.126,6 0.696,7 0.652,8 364.52,9 13,10 21,11 46,13 21,14 29,16 49,17 19,20 14,21 5,24 20,25 7,26 1,28 6,31 1,32 26,36 0.122,37 6,38 39.5,39 45.872,40 51.816,41 32.012,42 30.003,44 6.724}
{0 CHEMBL216830,1 7.219,2 34.3,3 48.3,4 1.014,5 1.144,6 0.621,7 0.599,8 1032.31,9 9.1,10 17,11 143,13 27,14 77,16 146,17 49,20 25,21 24,22 10,24 69,25 25,28 13,29 12,32 74,35 8.4,36 0.192,37 28,38 95.5,39 144.992,40 163.616,41 88.847,42 85.606,44 8.602}
{0 CHEMBL217084,1 8.683,2 37.7,3 42.6,4 1.029,5 1.141,6 0.67,7 0.644,8 529.66,9 4.9,10 16,11 61,13 19,14 37,16 63,17 23,20 14,21 9,22 3,23 3,24 26,25 12,26 2,28 3,29 4,31 2,32 35,34 3,35 6.6,36 0.175,37 11,38 48,39 62.792,40 69.589,41 40.841,42 39.296,43 4.9,44 5}
{0 CHEMBL217208,1 7.661,2 38.3,3 48.3,4 0.999,5 1.123,6 0.676,7 0.624,8 459.69,9 5,10 16,11 60,13 19,14 33,16 62,17 23,20 14,21 9,22 3,24 29,25 8,26 2,28 3,29 3,31 2,32 31,35 5,36 0.161,37 10,38 44,39 59.927,40 67.361,41 40.574,42 37.431,44 7.469}
{0 CHEMBL217249,1 7.798,2 37.7,3 47.5,4 1.004,5 1.124,6 0.673,7 0.625,8 475.69,9 4.9,10 16,11 61,13 19,14 34,16 63,17 23,20 14,21 9,22 3,24 29,25 9,26 2,28 3,29 4,31 2,32 32,35 6.6,36 0.19,37 12,38 45,39 61.254,40 68.57,41 41.029,42 38.146,44 8.301}
{0 CHEMBL217673,1 7.338,2 39.1,3 48.4,4 1.001,5 1.126,6 0.658,7 0.617,8 469.66,9 4.7,10 17,11 64,13 20,14 35,16 66,17 25,20 16,21 9,22 3,24 31,25 8,26 1,28 3,29 4,31 1,32 33,35 6.3,36 0.167,37 11,38 46.5,39 64.061,40 72.065,41 42.142,42 39.486,44 9.222}
{0 CHEMBL217752,1 8.096,2 37.3,3 45.8,4 1.012,5 1.125,6 0.673,7 0.633,8 477.66,9 5.1,10 16,11 59,13 19,14 34,16 61,17 22,20 14,21 8,22 3,24 27,25 10,26 2,28 3,29 5,31 2,32 32,35 8.5,36 0.197,37 12,38 45,39 59.698,40 66.364,41 39.722,42 37.334,44 7.066}
{0 CHEMBL219838,1 7.113,2 37.9,3 48.3,4 1.006,5 1.135,6 0.638,7 0.608,8 412.54,9 6.9,10 11,11 58,13 14,14 32,16 60,17 22,20 12,21 10,22 3,24 28,25 8,28 4,29 4,32 30,35 6.9,36 0.133,37 8,38 40.5,39 58.32,40 65.813,41 36.978,42 35.266,44 5}
{0 CHEMBL219839,1 7.765,2 44.4,3 42.2,4 1.008,5 1.121,6 0.677,7 0.654,8 349.42,9 6.7,10 17,11 45,13 19,14 28,16 47,17 20,20 17,21 3,22 2,24 19,25 6,28 3,29 3,32 26,35 6.7,36 0.149,37 7,38 38.5,39 45.356,40 50.445,41 30.472,42 29.423,44 7.391}
{0 CHEMBL219840,1 7.765,2 44.4,3 42.2,4 1.008,5 1.121,6 0.677,7 0.654,8 349.42,9 6.7,10 17,11 45,13 19,14 28,16 47,17 20,20 17,21 3,22 2,24 19,25 6,28 3,29 3,32 26,35 6.7,36 0.149,37 7,38 38.5,39 45.356,40 50.445,41 30.472,42 29.423,44 7.426}
{0 CHEMBL2205685,1 8.848,2 46.4,3 35.7,4 1.036,5 1.134,6 0.683,7 0.685,8 495.49,9 5.4,10 18,11 56,13 21,14 40,16 60,17 26,20 20,21 6,22 3,23 3,24 20,25 10,28 3,29 4,32 36,34 3,35 7.1,36 0.1,37 6,38 52,39 57.989,40 63.504,41 38.262,42 38.341,43 5.4,44 7.602}
{0 CHEMBL24322,1 7.343,2 41.3,3 45.3,4 0.999,5 1.131,6 0.665,7 0.633,8 550.73,9 10.7,10 23,11 75,13 26,14 45,16 79,17 31,20 22,21 9,22 3,24 34,25 10,28 8,29 2,32 41,35 2.7,36 0.114,37 9,38 59.5,39 74.956,40 84.803,41 49.853,42 47.449,44 5.347}
{0 CHEMBL259843,1 7.796,2 39.3,3 44.9,4 1.015,5 1.131,6 0.657,7 0.631,8 693.87,9 5.6,10 18,11 89,13 24,14 53,16 93,17 35,20 22,21 13,22 6,23 1,24 40,25 14,26 1,28 5,29 7,31 1,32 49,34 1,35 7.9,36 0.129,37 12,38 68,39 90.294,40 100.691,41 58.5,42 56.163,43 1.1,44 8.481}
{0 CHEMBL263191,1 7.654,2 39.1,3 46,4 1.011,5 1.132,6 0.656,7 0.626,8 665.86,9 5.7,10 18,11 87,13 24,14 50,16 90,17 34,20 22,21 12,22 6,23 1,24 40,25 13,26 1,28 5,29 6,31 1,32 47,34 1,35 6.9,36 0.144,37 13,38 65,39 87.967,40 98.481,41 57.046,42 54.449,43 1.1,44 8.456}
{0 CHEMBL263452,1 7.861,2 42.5,3 43.7,4 1.009,5 1.125,6 0.676,7 0.646,8 683.87,9 5.7,10 24,11 87,13 30,14 53,16 91,17 37,20 28,21 9,22 6,23 1,24 38,25 12,26 1,28 5,29 5,31 1,32 49,34 1,35 5.7,36 0.11,37 10,38 71,39 87.756,40 97.857,41 58.83,42 56.207,43 1.1,44 8.051}
{0 CHEMBL263714,1 7.239,2 41,3 48.2,4 0.996,5 1.123,6 0.665,7 0.622,8 600.85,9 4.8,10 18,11 83,13 23,14 47,16 87,17 34,20 21,21 13,22 5,24 40,25 9,26 1,28 4,29 4,31 1,32 43,35 4.8,36 0.046,37 4,38 61,39 82.698,40 93.224,41 55.194,42 51.614,44 7.62}
{0 CHEMBL264450,1 7.63,2 34.3,3 47,4 1.014,5 1.14,6 0.641,7 0.612,8 1022.36,9 9.7,10 17,11 134,13 26,14 75,16 138,17 46,20 24,21 22,22 9,24 63,25 25,26 2,28 13,29 10,31 2,32 71,35 7.5,36 0.152,37 21,38 92.5,39 135.839,40 152.792,41 85.95,42 81.97,44 7.097}
{0 CHEMBL265613,1 7.345,2 36.4,3 46.9,4 1.012,5 1.14,6 0.634,7 0.611,8 1050.32,9 9.1,10 23,11 143,13 32,14 81,16 148,17 52,20 30,21 22,22 9,24 67,25 24,28 13,29 11,32 76,35 7.7,36 0.169,37 25,38 101.5,39 144.781,40 162.992,41 90.631,42 87.365,44 8.328}
{0 CHEMBL265790,1 6.973,2 38.1,3 50,4 0.997,5 1.132,6 0.646,7 0.604,8 934.34,9 6.7,10 23,11 134,13 28,14 73,16 140,17 51,20 26,21 25,22 5,24 67,25 16,26 1,28 9,29 6,31 1,32 67,35 4.5,36 0.179,37 25,38 89.5,39 133.581,40 151.702,41 86.507,42 80.946,44 8.155}
{0 CHEMBL265881,1 7.438,2 36.1,3 46.3,4 1.015,5 1.141,6 0.633,7 0.613,8 1093.35,9 9.5,10 23,11 147,13 33,14 84,16 152,17 53,20 31,21 22,22 10,24 68,25 26,28 14,29 12,32 79,35 8.2,36 0.171,37 26,38 105.5,39 149.21,40 167.699,41 93.092,42 90.101,44 9.097}
{0 CHEMBL267354,1 7.201,2 36.3,3 47.9,4 1.01,5 1.139,6 0.631,7 0.605,8 1051.35,9 8.2,10 23,11 146,13 32,14 80,16 150,17 53,20 30,21 23,22 9,24 70,25 23,28 12,29 11,32 76,35 7.5,36 0.2,37 30,38 100.5,39 147.446,40 166.324,41 92.149,42 88.397,44 7.921}
{0 CHEMBL268815,1 7.095,2 35.1,3 49,4 1.01,5 1.141,6 0.623,7 0.597,8 1071.39,9 7.9,10 18,11 151,13 28,14 80,16 154,17 53,20 28,21 25,22 10,24 74,25 24,28 12,29 12,32 77,35 7.9,36 0.188,37 29,38 99,39 152.541,40 172.364,41 94.126,42 90.165,44 8.766}
{0 CHEMBL273542,1 9.155,2 42.7,3 40.2,4 1.019,5 1.123,6 0.697,7 0.669,8 750.7,9 6.1,10 24,11 82,13 30,14 53,15 1,16 86,17 35,20 28,21 7,22 6,23 1,24 33,25 14,26 2,28 5,29 6,31 1,32 49,34 2,35 7.3,36 0.128,37 11,38 71,39 83.545,40 92.077,41 57.114,42 54.893,43 2.4,44 8.387}
{0 CHEMBL273992,1 7.412,2 41.5,3 45.1,4 1.003,5 1.129,6 0.662,7 0.633,8 607.78,9 8.5,10 28,11 82,13 30,14 49,16 86,17 34,20 24,21 10,22 2,24 37,25 11,28 7,29 4,32 45,35 4.9,36 0.163,37 14,38 65,39 82.276,40 92.554,41 54.279,42 51.911,44 6.097}
{0 CHEMBL274447,1 7.822,2 43.1,3 45.1,4 1.004,5 1.12,6 0.679,7 0.643,8 398.92,9 3.9,10 17,11 51,13 18,14 30,16 53,17 22,18 1,20 16,21 6,22 1,24 23,25 6,26 1,28 2,29 3,32 28,34 1,35 5.9,36 0.151,37 8,38 39.5,39 51.229,40 57.136,41 34.608,42 32.81,43 2,44 6.699}
{0 CHEMBL275449,1 8.089,2 40.3,3 44.2,4 1.01,5 1.121,6 0.681,7 0.645,8 622.83,9 5.2,10 23,11 77,13 27,14 46,16 80,17 31,20 23,21 8,22 4,24 34,25 12,26 2,28 4,29 6,31 2,32 43,35 7.8,36 0.15,37 12,38 61.5,39 77.778,40 86.318,41 52.466,42 49.651,44 8.328}
{0 CHEMBL276163,1 7.427,2 36.6,3 46.3,4 1.014,5 1.139,6 0.635,7 0.614,8 995.23,9 9,10 23,11 134,13 32,14 76,16 138,17 49,20 30,21 19,22 9,24 62,25 23,28 12,29 11,32 72,35 8.2,36 0.181,37 25,38 96.5,39 135.912,40 152.663,41 85.103,42 82.29,44 8.009}
{0 CHEMBL276674,1 8.067,2 39.1,3 43.7,4 1.023,5 1.14,6 0.654,7 0.635,8 701.84,9 5.7,10 18,11 87,13 24,14 52,16 90,17 34,20 22,21 12,22 6,23 3,24 38,25 15,26 1,28 5,29 6,31 1,32 49,34 3,35 6.9,36 0.144,37 13,38 67,39 88.992,40 99.161,41 56.921,42 55.215,43 3.4,44 7.745}
{0 CHEMBL277388,1 8.011,2 38.8,3 45,4 1.012,5 1.124,6 0.671,7 0.636,8 640.85,9 5,10 17,11 80,13 24,14 47,16 83,17 31,20 19,21 12,22 7,24 36,25 13,26 2,28 4,29 7,31 2,32 44,35 8.8,36 0.169,37 14,38 62.5,39 80.989,40 89.942,41 53.682,42 50.892,44 6.876}
{0 CHEMBL286134,1 7.552,2 43.1,3 45.8,4 0.999,5 1.118,6 0.679,7 0.639,8 543.74,9 4.2,10 18,11 72,13 23,14 43,16 76,17 31,20 21,21 10,22 5,24 33,25 8,26 1,28 3,29 4,31 1,32 39,35 5.6,36 0.118,37 9,38 57,39 71.945,40 80.481,41 48.904,42 46.012,44 7}
{0 CHEMBL287829,1 7.885,2 40,3 46.3,4 1.003,5 1.119,6 0.683,7 0.637,8 749.07,9 4.2,10 22,11 95,13 28,14 55,16 99,17 38,20 24,21 14,22 6,24 44,25 13,26 3,28 4,29 6,31 3,32 51,35 6.3,36 0.162,37 16,38 72,39 95.272,40 106.314,41 64.921,42 60.472,44 8.097}
{0 CHEMBL288174,1 7.473,2 38.5,3 48.7,4 0.999,5 1.125,6 0.668,7 0.619,8 582.86,9 5.1,10 21,11 78,13 24,14 43,16 81,17 30,20 17,21 13,22 3,24 38,25 10,26 2,28 4,29 4,31 2,32 40,35 5.1,36 0.148,37 12,38 56.5,39 77.89,40 87.729,41 52.08,42 48.275,44 8.626}
{0 CHEMBL288705,1 7.575,2 45.3,3 43.4,4 1.002,5 1.118,6 0.679,7 0.651,8 401.5,9 5.7,10 22,11 53,13 23,14 33,16 56,17 24,20 19,21 5,22 1,24 23,25 6,28 3,29 3,32 30,35 5.7,36 0.125,37 7,38 45,39 53.123,40 59.275,41 35.995,42 34.477,44 7.699}
{0 CHEMBL289211,1 7.582,2 40.8,3 46.9,4 1.001,5 1.12,6 0.674,7 0.631,8 743.04,9 4.1,10 23,11 98,13 29,14 56,16 102,17 40,20 26,21 14,22 6,24 46,25 12,26 2,28 4,29 6,31 2,32 52,35 6.1,36 0.157,37 16,38 73.5,39 98.079,40 109.809,41 66.035,42 61.811,44 7.319}
{0 CHEMBL289306,1 7.362,2 39,3 49.4,4 0.994,5 1.124,6 0.67,7 0.618,8 566.86,9 5.2,10 21,11 77,13 24,14 42,16 80,17 30,20 17,21 13,22 3,24 38,25 9,26 2,28 4,29 3,31 2,32 39,35 3.9,36 0.138,37 11,38 55.5,39 76.563,40 86.52,41 51.625,42 47.56,44 6.398}
{0 CHEMBL289614,1 7.121,2 39.5,3 49.4,4 0.996,5 1.126,6 0.657,7 0.613,8 576.83,9 4.9,10 22,11 81,13 25,14 44,16 84,17 32,20 19,21 13,22 3,24 40,25 9,26 1,28 4,29 4,31 1,32 41,35 4.9,36 0.143,37 12,38 58,39 80.698,40 91.224,41 53.194,42 49.614,44 9.155}
{0 CHEMBL289775,1 7.582,2 40.8,3 46.9,4 1.001,5 1.12,6 0.674,7 0.631,8 743.04,9 4.1,10 23,11 98,13 29,14 56,16 102,17 40,20 26,21 14,22 6,24 46,25 12,26 2,28 4,29 6,31 2,32 52,35 6.1,36 0.157,37 16,38 73.5,39 98.079,40 109.809,41 66.035,42 61.811,44 7.481}
{0 CHEMBL289803,1 7.681,2 38.8,3 47.1,4 1.005,5 1.124,6 0.668,7 0.626,8 652.91,9 4.7,10 17,11 85,13 23,14 48,16 88,17 33,20 20,21 13,22 6,24 40,25 12,26 2,28 4,29 6,31 2,32 45,35 7.1,36 0.159,37 14,38 62.5,39 85.429,40 95.563,41 56.75,42 53.231,44 7.77}
{0 CHEMBL290214,1 7.452,2 41.9,3 46.5,4 1,5 1.121,6 0.67,7 0.632,8 640.87,9 4.7,10 28,11 86,13 31,14 50,16 90,17 36,20 25,21 11,22 3,24 40,25 10,26 1,28 4,29 5,31 1,32 46,35 5.8,36 0.144,37 13,38 67,39 86.025,40 96.434,41 57.648,42 54.329,44 6.996}
{0 CHEMBL290286,1 7.586,2 50.8,3 42.4,4 0.995,5 1.104,6 0.703,7 0.669,8 447.56,9 1.7,10 24,11 59,13 26,14 38,16 63,17 30,20 26,21 4,22 2,24 25,25 4,28 1,29 3,32 34,35 5.1,36 0.079,37 5,38 52,39 58.687,40 65.109,41 41.506,42 39.487,44 7.523}
{0 CHEMBL290370,1 7.329,2 38.8,3 49.4,4 0.996,5 1.124,6 0.666,7 0.616,8 622.93,9 4.7,10 21,11 85,13 24,14 47,16 89,17 33,20 17,21 16,22 3,24 42,25 10,26 2,28 4,29 4,31 2,32 43,35 4.7,36 0.135,37 12,38 60.5,39 84.658,40 95.56,41 56.603,42 52.328,44 5}
{0 CHEMBL290708,1 7.668,2 42.9,3 45.7,4 1,5 1.116,6 0.684,7 0.641,8 805.11,9 3.8,10 29,11 105,13 35,14 62,16 110,17 45,20 32,21 13,22 6,24 48,25 12,26 2,28 4,29 6,31 2,32 57,35 5.7,36 0.155,37 17,38 82.5,39 104.963,40 117.224,41 71.796,42 67.338,44 7.495}
{0 CHEMBL290829,1 7.771,2 46.3,3 41.8,4 1.005,5 1.117,6 0.686,7 0.661,8 520.63,9 6,10 24,11 67,13 27,14 43,16 71,17 31,20 27,21 4,22 3,24 28,25 8,28 4,29 4,32 39,35 6,36 0.07,37 5,38 58,39 67.32,40 74.813,41 45.978,42 44.266,44 8.824}
{0 CHEMBL291089,1 7.273,2 38.1,3 50,4 0.996,5 1.126,6 0.662,7 0.611,8 610.92,9 4.8,10 21,11 84,13 24,14 45,16 87,17 32,20 17,21 15,22 3,24 42,25 10,26 2,28 4,29 4,31 2,32 42,35 4.8,36 0.161,37 14,38 58.5,39 83.658,40 94.56,41 55.603,42 51.328,44 5}
{0 CHEMBL291124,1 7.483,2 38.5,3 48.4,4 1.002,5 1.125,6 0.662,7 0.619,8 680.97,9 4.4,10 17,11 91,13 23,14 50,16 94,17 35,20 20,21 15,22 6,24 44,25 12,26 2,28 4,29 6,31 2,32 47,35 6.6,36 0.16,37 15,38 64.5,39 91.196,40 102.394,41 60.273,42 56.285,44 8.337}
{0 CHEMBL291125,1 8.101,2 40.4,3 44.9,4 1.006,5 1.118,6 0.69,7 0.645,8 721.01,9 4.5,10 22,11 89,13 28,14 53,16 93,17 36,20 24,21 12,22 6,24 40,25 13,26 3,28 4,29 6,31 3,32 49,35 6.7,36 0.161,37 15,38 70,39 89.505,40 99.483,41 61.398,42 57.418,44 5}
{0 CHEMBL292277,1 7.51,2 45.3,3 43.8,4 1,5 1.119,6 0.68,7 0.649,8 480.61,9 6.3,10 23,11 64,13 25,14 40,16 68,17 29,20 23,21 6,22 2,24 28,25 7,28 4,29 3,32 36,35 4.7,36 0.088,37 6,38 53.5,39 63.992,40 71.604,41 43.523,42 41.552,44 7.18}
{0 CHEMBL294512,1 7.549,2 38.2,3 47.4,4 1.012,5 1.132,6 0.648,7 0.617,8 573.75,9 3.9,10 17,11 76,13 21,14 42,16 78,17 29,20 17,21 12,22 4,23 1,24 36,25 11,26 1,28 3,29 6,31 1,32 40,34 1,35 7.9,36 0.179,37 14,38 54.5,39 76.88,40 86.069,41 49.273,42 46.879,43 1.3,44 9}
{0 CHEMBL302102,1 7.371,2 44.6,3 44.6,4 0.995,5 1.122,6 0.679,7 0.644,8 611.81,9 8.4,10 29,11 83,13 32,14 51,16 88,17 37,20 28,21 9,22 3,24 37,25 9,28 7,29 2,32 46,35 2.4,36 0.136,37 12,38 68.5,39 82.621,40 93.135,41 56.37,42 53.481,44 8.155}
{0 CHEMBL302485,1 7.635,2 46.3,3 42.5,4 1,5 1.118,6 0.688,7 0.658,8 610.77,9 7.5,10 34,11 80,13 36,14 51,16 85,17 37,20 30,21 7,22 2,24 34,25 9,28 6,29 3,32 46,35 3.8,36 0.153,37 13,38 70,39 79.963,40 89.431,41 55.057,42 52.648,44 5.699}
{0 CHEMBL302579,1 7.69,2 42,3 45,4 1.008,5 1.124,6 0.668,7 0.637,8 768.98,9 4,10 29,11 100,13 34,14 59,16 104,17 42,20 30,21 12,22 5,23 1,24 45,25 13,26 1,28 4,29 7,31 1,32 55,34 1,35 7,36 0.173,37 18,38 78.5,39 100.843,40 112.438,41 66.779,42 63.722,43 1,44 9}
{0 CHEMBL302760,1 7.744,2 45.6,3 41.8,4 1.002,5 1.12,6 0.687,7 0.66,8 611.76,9 8.9,10 34,11 79,13 36,14 51,16 84,17 36,20 30,21 6,22 2,24 33,25 10,28 7,29 3,32 46,35 3.8,36 0.143,37 12,38 70,39 79.181,40 88.514,41 54.302,42 52.143,44 6.222}
{0 CHEMBL302959,1 7.756,2 41.3,3 42.7,4 1.009,5 1.136,6 0.667,7 0.644,8 581.72,9 12,10 28,11 75,13 29,14 48,16 80,17 31,20 22,21 9,22 1,23 1,24 32,25 12,28 9,29 2,32 43,34 1,35 2.7,36 0.125,37 10,38 63,39 75.687,40 85.226,41 50.035,42 48.327,43 1.3,44 6.699}
{0 CHEMBL302964,1 7.374,2 39.6,3 47.9,4 1.007,5 1.129,6 0.651,7 0.617,8 707.94,9 3.1,10 23,11 96,13 27,14 53,16 99,17 38,20 23,21 15,22 4,23 1,24 46,25 12,26 1,28 3,29 7,31 1,32 50,34 1,35 7.3,36 0.202,37 20,38 68.5,39 96.625,40 108.355,41 62.535,42 59.228,43 1,44 8.699}
{0 CHEMBL303426,1 7.807,2 41.9,3 41.9,4 1.008,5 1.131,6 0.673,7 0.65,8 577.71,9 12.2,10 28,11 74,13 30,14 48,16 79,17 31,20 23,21 8,22 2,24 31,25 12,28 9,29 3,32 43,35 4.1,36 0.114,37 9,38 64,39 74.618,40 83.68,41 49.79,42 48.132,44 6.155}
{0 CHEMBL303427,1 7.276,2 38.5,3 48.6,4 1.006,5 1.131,6 0.645,7 0.61,8 793.06,9 3.7,10 23,11 109,13 28,14 59,16 112,17 42,20 24,21 18,22 5,23 1,24 53,25 14,26 1,28 4,29 8,31 1,32 56,34 1,35 7.3,36 0.196,37 22,38 75.5,39 109.705,40 123.308,41 70.279,42 66.544,43 0.9,44 8.398}
{0 CHEMBL303647,1 7.652,2 42.1,3 45.3,4 1.007,5 1.124,6 0.669,7 0.637,8 726.94,9 4.2,10 29,11 95,13 33,14 56,16 99,17 40,20 28,21 12,22 4,23 1,24 43,25 12,26 1,28 4,29 6,31 1,32 52,34 1,35 6.3,36 0.172,37 17,38 74.5,39 95.632,40 106.813,41 63.563,42 60.481,43 1.1,44 8.523}
{0 CHEMBL304065,1 7.905,2 44.2,3 43,4 1.008,5 1.116,6 0.684,7 0.654,8 679.85,9 3.5,10 29,11 86,13 34,14 53,16 90,17 38,20 30,21 8,22 5,24 37,25 11,26 1,28 3,29 7,31 1,32 49,35 8.1,36 0.167,37 15,38 72.5,39 86.694,40 95.939,41 58.79,42 56.21,44 8}
{0 CHEMBL304137,1 7.136,2 41.8,3 46.8,4 0.995,5 1.128,6 0.663,7 0.626,8 563.77,9 8.9,10 28,11 79,13 29,14 46,16 83,17 33,20 23,21 10,22 1,24 37,25 9,28 7,29 2,32 42,35 2.5,36 0.169,37 14,38 61,39 78.621,40 89.135,41 52.37,42 49.481,44 7.046}
{0 CHEMBL304620,1 7.101,2 37.5,3 50,4 1.001,5 1.13,6 0.643,7 0.603,8 624.88,9 4.5,10 17,11 88,13 22,14 46,16 90,17 33,20 18,21 15,22 5,24 44,25 11,26 1,28 4,29 6,31 1,32 44,35 6.8,36 0.189,37 17,38 59.5,39 88.119,40 99.474,41 56.625,42 53.097,44 7.046}
{0 CHEMBL305017,1 7.602,2 41.7,3 45.6,4 1.007,5 1.125,6 0.665,7 0.633,8 783.01,9 3.9,10 29,11 103,13 34,14 60,16 107,17 43,20 30,21 13,22 5,23 1,24 47,25 13,26 1,28 4,29 7,31 1,32 56,34 1,35 6.8,36 0.178,37 19,38 79.5,39 103.727,40 115.853,41 68.54,42 65.249,43 1,44 8.699}
{0 CHEMBL305238,1 7.601,2 39.8,3 46.2,4 1.01,5 1.129,6 0.656,7 0.626,8 706.91,9 4.3,10 23,11 93,13 28,14 53,16 96,17 37,20 24,21 13,22 5,23 1,24 43,25 13,26 1,28 4,29 7,31 1,32 50,34 1,35 7.5,36 0.188,37 18,38 69.5,39 93.959,40 105.023,41 61.017,42 58.196,43 1.1,44 8.523}
{0 CHEMBL305239,1 7.175,2 43.3,3 46.4,4 0.995,5 1.124,6 0.669,7 0.632,8 695.94,9 7.2,10 34,11 97,13 36,14 57,16 102,17 42,20 30,21 12,22 2,24 45,25 10,28 7,29 3,32 52,35 3.1,36 0.167,37 17,38 76,39 96.483,40 109.005,41 64.87,42 61.303,44 6.699}
{0 CHEMBL305369,1 7.629,2 46.7,3 42.4,4 0.998,5 1.117,6 0.691,7 0.66,8 701.89,9 7.6,10 40,11 92,13 42,14 59,16 98,17 43,20 36,21 7,22 2,24 39,25 10,28 7,29 3,32 53,35 3.3,36 0.143,37 14,38 81,39 91.832,40 102.76,41 63.586,42 60.723,44 6.523}
{0 CHEMBL305647,1 8.067,2 42.5,3 42.5,4 1.015,5 1.129,6 0.675,7 0.65,8 701.86,9 5.7,10 24,11 87,13 30,14 54,16 91,17 37,20 28,21 9,22 6,23 2,24 37,25 13,26 1,28 5,29 5,31 1,32 50,34 2,35 5.7,36 0.121,37 11,38 72,39 88.269,40 98.196,41 58.767,42 56.59,43 2.3,44 8.357}
{0 CHEMBL305956,1 8.181,2 40.8,3 42.1,4 1.019,5 1.129,6 0.671,7 0.649,8 621.75,9 6.6,10 18,11 76,13 24,14 48,16 80,17 31,20 22,21 9,22 6,23 1,24 32,25 13,26 1,28 5,29 6,31 1,32 44,34 1,35 7.9,36 0.125,37 10,38 63,39 77.432,40 85.82,41 51,42 49.341,43 1.3,44 7.921}
{0 CHEMBL306186,1 6.673,2 38,3 51.1,4 0.993,5 1.135,6 0.637,7 0.596,8 613.89,9 7.6,10 22,11 92,13 24,14 48,16 95,17 35,20 18,21 17,22 2,24 47,25 10,28 7,29 3,32 45,35 3.3,36 0.2,37 19,38 61,39 91.367,40 104.42,41 58.631,42 54.83,44 6.301}
{0 CHEMBL306216,1 7.641,2 42.1,3 43.4,4 1.006,5 1.133,6 0.668,7 0.643,8 580.73,9 10.5,10 28,11 76,13 29,14 48,16 81,17 32,20 23,21 9,22 1,23 1,24 33,25 11,28 8,29 2,32 43,34 1,35 2.6,36 0.123,37 10,38 63,39 76.469,40 86.143,41 50.79,42 48.832,43 1.3,44 7.097}
{0 CHEMBL306340,1 7.372,2 39.4,3 47.9,4 1.005,5 1.13,6 0.652,7 0.617,8 692.93,9 4.3,10 23,11 94,13 27,14 52,16 97,17 37,20 23,21 14,22 4,23 1,24 45,25 12,26 1,28 4,29 6,31 1,32 49,34 1,35 6.4,36 0.186,37 18,38 67.5,39 94.516,40 106.229,41 61.324,42 58.008,43 1.1,44 8.046}
{0 CHEMBL306361,1 8.048,2 40.5,3 43,4 1.017,5 1.13,6 0.668,7 0.644,8 635.78,9 6.3,10 18,11 79,13 24,14 49,16 83,17 32,20 22,21 10,22 6,23 1,24 34,25 13,26 1,28 5,29 6,31 1,32 45,34 1,35 7.6,36 0.145,37 12,38 64,39 80.316,40 89.236,41 52.762,42 50.868,43 1.3,44 8.009}
{0 CHEMBL306362,1 7.603,2 39.6,3 46.2,4 1.009,5 1.131,6 0.657,7 0.626,8 691.9,9 5.5,10 18,11 91,13 24,14 53,16 95,17 36,20 22,21 14,22 6,23 1,24 42,25 13,26 1,28 5,29 6,31 1,32 49,34 1,35 6.6,36 0.147,37 14,38 68,39 91.85,40 102.896,41 59.807,42 56.975,43 1.1,44 8.108}
{0 CHEMBL306435,1 7.953,2 42,3 43.2,4 1.012,5 1.126,6 0.674,7 0.647,8 699.87,9 5.7,10 29,11 88,13 33,14 54,16 92,17 37,20 27,21 10,22 4,23 1,24 38,25 13,26 1,28 5,29 6,31 1,32 50,34 1,35 6.8,36 0.174,37 16,38 72.5,39 89.083,40 99.066,41 59.284,42 56.922,43 1.1,44 8}
{0 CHEMBL306473,1 6.967,2 40.9,3 48.4,4 0.994,5 1.129,6 0.655,7 0.616,8 647.9,9 7.5,10 28,11 93,13 30,14 52,16 97,17 38,20 24,21 14,22 2,24 45,25 10,28 7,29 3,32 48,35 3.2,36 0.186,37 18,38 68,39 92.483,40 105.005,41 60.87,42 57.303,44 6.523}
{0 CHEMBL306489,1 7.858,2 42.1,3 43.4,4 1.004,5 1.128,6 0.68,7 0.648,8 597.18,9 10.5,10 28,11 76,13 29,14 48,16 81,17 32,18 1,20 23,21 9,22 1,24 33,25 11,26 1,28 8,29 2,32 43,34 1,35 2.6,36 0.123,37 10,38 63,39 76.28,40 85.747,41 51.711,42 49.277,43 1.3,44 6.222}
{0 CHEMBL306638,1 7.51,2 42.9,3 45.9,4 1.002,5 1.118,6 0.672,7 0.636,8 735.97,9 3.1,10 29,11 98,13 34,14 57,16 102,17 42,20 30,21 12,22 5,24 45,25 11,26 1,28 3,29 7,31 1,32 53,35 7.1,36 0.176,37 18,38 76.5,39 98.229,40 109.6,41 65.836,42 62.318,44 8.721}
{0 CHEMBL306761,1 7.815,2 42.3,3 45.4,4 1.005,5 1.12,6 0.68,7 0.641,8 758.02,9 3.1,10 29,11 97,13 33,14 57,16 101,17 41,20 29,21 12,22 4,23 1,24 44,25 12,26 2,28 3,29 6,31 2,32 53,34 1,35 6.2,36 0.178,37 18,38 75.5,39 97.49,40 108.65,41 65.966,42 62.173,43 1,44 8.699}
{0 CHEMBL306922,1 7.412,2 41.5,3 45.1,4 1.003,5 1.129,6 0.662,7 0.633,8 607.78,9 8.5,10 28,11 82,13 30,14 49,16 86,17 34,20 24,21 10,22 2,24 37,25 11,28 7,29 4,32 45,35 4.9,36 0.151,37 13,38 65,39 82.276,40 92.554,41 54.279,42 51.911,44 6}
{0 CHEMBL306923,1 7.471,2 46.2,3 43.6,4 0.995,5 1.118,6 0.687,7 0.653,8 582.76,9 7.7,10 34,11 78,13 35,14 49,16 83,17 36,20 29,21 7,22 1,24 34,25 8,28 6,29 2,32 44,35 2.6,36 0.145,37 12,38 67,39 77.636,40 87.221,41 53.603,42 50.933,44 5.523}
{0 CHEMBL306924,1 7.471,2 46.2,3 43.6,4 0.995,5 1.118,6 0.687,7 0.653,8 582.76,9 7.7,10 34,11 78,13 35,14 49,16 83,17 36,20 29,21 7,22 1,24 34,25 8,28 6,29 2,32 44,35 2.6,36 0.145,37 12,38 67,39 77.636,40 87.221,41 53.603,42 50.933,44 5.699}
{0 CHEMBL306961,1 7.41,2 41.3,3 45,4 1.002,5 1.13,6 0.663,7 0.634,8 592.77,9 10,10 28,11 80,13 29,14 49,16 85,17 33,20 23,21 10,22 1,24 36,25 11,28 8,29 3,32 44,35 3.8,36 0.129,37 11,38 64,39 80.167,40 90.427,41 53.069,42 50.691,44 5.523}
{0 CHEMBL307008,1 8.091,2 42.5,3 43.7,4 1.01,5 1.12,6 0.686,7 0.65,8 703.92,9 3.4,10 28,11 87,13 32,14 53,16 91,17 37,20 27,21 10,22 4,23 1,24 38,25 12,26 2,28 3,29 6,31 2,32 49,34 1,35 6.9,36 0.176,37 16,38 71,39 87.84,40 97.405,41 59.682,42 56.593,43 1.1,44 8.523}
{0 CHEMBL307290,1 8.022,2 39.8,3 43.4,4 1.018,5 1.131,6 0.662,7 0.64,8 665.81,9 6,10 18,11 83,13 24,14 51,16 87,17 33,20 22,21 11,22 6,23 1,24 36,25 14,26 1,28 5,29 7,31 1,32 47,34 1,35 8.4,36 0.126,37 11,38 66,39 84.527,40 93.86,41 54.978,42 53.11,43 1.2,44 7.495}
{0 CHEMBL307318,1 7.601,2 39.8,3 46.2,4 1.01,5 1.129,6 0.656,7 0.626,8 706.91,9 4.3,10 23,11 93,13 28,14 53,16 96,17 37,20 24,21 13,22 5,23 1,24 43,25 13,26 1,28 4,29 7,31 1,32 50,34 1,35 7.5,36 0.198,37 19,38 69.5,39 93.959,40 105.023,41 61.017,42 58.196,43 1.1,44 9}
{0 CHEMBL307321,1 7.314,2 39.1,3 47.8,4 1.001,5 1.129,6 0.657,7 0.618,8 672.93,9 6.5,10 23,11 92,13 27,14 52,16 96,17 36,20 22,21 14,22 4,24 44,25 12,26 1,28 6,29 5,31 1,32 48,35 5.4,36 0.156,37 15,38 67.5,39 92.112,40 103.846,41 60.421,42 56.899,44 7.699}
{0 CHEMBL307359,1 7.725,2 41.8,3 45.9,4 1.003,5 1.122,6 0.679,7 0.638,8 757.04,9 4.1,10 29,11 98,13 33,14 57,16 102,17 41,20 29,21 12,22 4,23 1,24 45,25 12,26 2,28 4,29 5,31 2,32 53,34 1,35 5.1,36 0.167,37 17,38 75.5,39 98.265,40 109.939,41 66.518,42 62.48,43 1,44 8.523}
{0 CHEMBL307430,1 7.925,2 40.2,3 43.9,4 1.015,5 1.13,6 0.665,7 0.639,8 649.81,9 6.1,10 18,11 82,13 24,14 50,16 86,17 33,20 22,21 11,22 6,23 1,24 36,25 13,26 1,28 5,29 6,31 1,32 46,34 1,35 7.3,36 0.14,37 12,38 65,39 83.2,40 92.651,41 54.523,42 52.395,43 1.2,44 8.187}
{0 CHEMBL307756,1 7.404,2 42.1,3 44.7,4 0.999,5 1.129,6 0.669,7 0.637,8 562.74,9 10.5,10 28,11 76,13 29,14 47,16 81,17 32,20 23,21 9,22 1,24 34,25 10,28 8,29 2,32 42,35 2.6,36 0.123,37 10,38 62,39 75.956,40 85.803,41 50.853,42 48.449,44 7.301}
{0 CHEMBL307866,1 7.216,2 39.2,3 49,4 1.004,5 1.129,6 0.648,7 0.611,8 736,9 2.9,10 23,11 102,13 27,14 55,16 105,17 40,20 23,21 17,22 4,23 1,24 50,25 12,26 1,28 3,29 7,31 1,32 52,34 1,35 6.9,36 0.19,37 20,38 70.5,39 102.392,40 115.185,41 66.057,42 62.281,43 1,44 8}
{0 CHEMBL308323,1 7.81,2 38.9,3 46.3,4 1.012,5 1.127,6 0.662,7 0.627,8 741.98,9 3.2,10 23,11 95,13 29,14 54,16 98,17 37,20 23,21 14,22 6,23 1,24 44,25 14,26 2,28 3,29 8,31 2,32 51,34 1,35 8.4,36 0.194,37 19,38 71.5,39 96.145,40 107.069,41 62.875,42 59.603,43 1.1,44 8.699}
{0 CHEMBL308361,1 7.499,2 38.9,3 46.7,4 1.006,5 1.129,6 0.657,7 0.623,8 674.9,9 6.7,10 23,11 90,13 27,14 52,16 94,17 35,20 22,21 13,22 4,24 42,25 13,26 1,28 6,29 6,31 1,32 48,35 6.7,36 0.16,37 15,38 67.5,39 90.556,40 101.64,41 59.114,42 56.087,44 7.046}
{0 CHEMBL308482,1 7.374,2 39.6,3 47.9,4 1.007,5 1.129,6 0.651,7 0.617,8 707.94,9 3.1,10 23,11 96,13 27,14 53,16 99,17 38,20 23,21 15,22 4,23 1,24 46,25 12,26 1,28 3,29 7,31 1,32 50,34 1,35 7.3,36 0.202,37 20,38 68.5,39 96.625,40 108.355,41 62.535,42 59.228,43 1,44 8}
{0 CHEMBL308703,1 7.516,2 41.3,3 44,4 1.002,5 1.132,6 0.668,7 0.639,8 563.73,9 12,10 28,11 75,13 29,14 47,16 80,17 31,20 22,21 9,22 1,24 33,25 11,28 9,29 2,32 42,35 2.7,36 0.125,37 10,38 62,39 75.174,40 84.886,41 50.097,42 47.944,44 7.222}
{0 CHEMBL308943,1 7.88,2 44.7,3 41.2,4 1.008,5 1.122,6 0.682,7 0.66,8 669.8,9 8.2,10 34,11 85,13 37,14 55,16 90,17 38,20 31,21 7,22 3,24 35,25 12,28 7,29 5,32 50,35 5.9,36 0.156,37 14,38 75,39 85.72,40 95.348,41 57.972,42 56.099,44 5.155}
{0 CHEMBL309081,1 7.629,2 46.7,3 42.4,4 0.998,5 1.117,6 0.691,7 0.66,8 701.89,9 7.6,10 40,11 92,13 42,14 59,16 98,17 43,20 36,21 7,22 2,24 39,25 10,28 7,29 3,32 53,35 3.3,36 0.143,37 14,38 81,39 91.832,40 102.76,41 63.586,42 60.723,44 6.699}
{0 CHEMBL309165,1 7.631,2 40.5,3 43.2,4 1.005,5 1.135,6 0.667,7 0.641,8 564.72,9 13.5,10 28,11 74,13 29,14 47,16 79,17 30,20 21,21 9,22 1,24 32,25 12,28 10,29 2,32 42,35 2.7,36 0.127,37 10,38 62,39 74.392,40 83.969,41 49.341,42 47.438,44 7.097}
{0 CHEMBL309365,1 7.336,2 43.8,3 44.9,4 0.996,5 1.124,6 0.676,7 0.641,8 652.87,9 9,10 34,11 89,13 35,14 55,16 95,17 39,20 29,21 10,22 1,24 40,25 10,28 8,29 2,32 49,35 2.2,36 0.126,37 12,38 73,39 88.607,40 100.048,41 60.137,42 57.03,44 6}
{0 CHEMBL309367,1 7.301,2 41.8,3 45.6,4 0.998,5 1.129,6 0.666,7 0.633,8 576.77,9 10.1,10 28,11 79,13 29,14 48,16 84,17 33,20 23,21 10,22 1,24 36,25 10,28 8,29 2,32 43,35 2.5,36 0.119,37 10,38 63,39 78.839,40 89.218,41 52.614,42 49.976,44 7.155}
{0 CHEMBL309455,1 7.234,2 42.7,3 46.1,4 0.997,5 1.126,6 0.667,7 0.632,8 643.86,9 7.9,10 28,11 89,13 31,14 52,16 93,17 38,19 2,20 24,21 12,22 2,24 41,25 10,28 7,29 3,32 48,33 1,35 3.4,36 0.161,37 15,38 70,39 88.716,40 100.175,41 59.347,42 56.25,44 6.398}
{0 CHEMBL309790,1 7.34,2 40,3 48,4 1.005,5 1.128,6 0.653,7 0.618,8 733.98,9 3,10 23,11 100,13 28,14 55,16 103,17 40,20 24,21 16,22 5,23 1,24 48,25 12,26 1,28 3,29 7,31 1,32 52,34 1,35 7,36 0.175,37 18,38 71.5,39 100.508,40 112.77,41 65.296,42 61.755,43 1,44 8.523}
{0 CHEMBL309820,1 7.396,2 40,3 45.3,4 1.004,5 1.133,6 0.657,7 0.629,8 554.72,9 10.7,10 22,11 75,13 24,14 46,16 80,17 30,20 18,21 12,22 2,24 34,25 11,28 8,29 3,32 41,35 4,36 0.125,37 10,38 59,39 75.283,40 85.012,41 49.307,42 47.164,44 5.222}
{0 CHEMBL311018,1 7.89,2 43.5,3 43.5,4 1.011,5 1.121,6 0.677,7 0.648,8 725.9,9 3.3,10 29,11 92,13 34,14 56,16 96,17 40,20 30,21 10,22 5,23 1,24 40,25 12,26 1,28 3,29 7,31 1,32 52,34 1,35 7.6,36 0.177,37 17,38 75.5,39 92.974,40 103.109,41 62.25,42 59.647,43 1.1,44 8}
{0 CHEMBL311160,1 8.188,2 42.9,3 41.7,4 1.016,5 1.128,6 0.679,7 0.656,8 687.83,9 6,10 24,11 84,13 30,14 53,16 88,17 36,20 28,21 8,22 6,23 2,24 35,25 13,26 1,28 5,29 5,31 1,32 49,34 2,35 6,36 0.114,37 10,38 71,39 85.385,40 94.781,41 57.006,42 55.063,43 2.4,44 8.509}
{0 CHEMBL311253,1 7.881,2 40.9,3 44.1,4 1.015,5 1.127,6 0.664,7 0.639,8 732.9,9 4.3,10 23,11 93,13 29,14 56,16 97,17 38,20 25,21 13,22 6,23 1,24 41,25 14,26 1,28 4,29 8,31 1,32 52,34 1,35 8.6,36 0.175,37 17,38 73.5,39 94.403,40 104.817,41 61.711,42 59.384,43 1.1,44 8.155}
{0 CHEMBL311386,1 7.654,2 39.1,3 46,4 1.011,5 1.132,6 0.656,7 0.626,8 665.86,9 5.7,10 18,11 87,13 24,14 50,16 90,17 34,20 22,21 12,22 6,23 1,24 40,25 13,26 1,28 5,29 6,31 1,32 47,34 1,35 6.9,36 0.133,37 12,38 65,39 87.967,40 98.481,41 57.046,42 54.449,43 1.1,44 7.959}
{0 CHEMBL311484,1 8.61,2 44,3 38.7,4 1.023,5 1.127,6 0.69,7 0.673,8 645.74,9 6.7,10 24,11 75,13 30,14 50,16 79,17 33,20 28,21 5,22 6,23 2,24 29,25 13,26 1,28 5,29 5,31 1,32 46,34 2,35 6.7,36 0.114,37 9,38 68,39 76.734,40 84.536,41 51.722,42 50.483,43 2.7,44 7.187}
{0 CHEMBL311625,1 7.723,2 39.4,3 46.8,4 1.009,5 1.126,6 0.664,7 0.626,8 725.98,9 3.2,10 23,11 94,13 28,14 53,16 97,17 37,20 23,21 14,22 5,23 1,24 44,25 13,26 2,28 3,29 7,31 2,32 50,34 1,35 7.4,36 0.196,37 19,38 69.5,39 94.818,40 105.86,41 62.421,42 58.888,43 1.1,44 9}
{0 CHEMBL312301,1 7.98,2 41.4,3 44.4,4 1.012,5 1.122,6 0.676,7 0.642,8 790.02,9 3,10 29,11 99,13 35,14 59,16 103,17 41,20 29,21 12,22 6,23 1,24 44,25 14,26 2,28 3,29 8,31 2,32 55,34 1,35 8.1,36 0.175,37 18,38 79.5,39 100.145,40 111.069,41 66.875,42 63.603,43 1,44 8.301}
{0 CHEMBL313005,1 7.523,2 36.6,3 48.8,4 1.005,5 1.129,6 0.655,7 0.613,8 616.88,9 4.9,10 17,11 82,13 21,14 44,16 84,17 30,20 17,21 13,22 4,24 40,25 12,26 2,28 4,29 6,31 2,32 42,35 7.3,36 0.179,37 15,38 56.5,39 82.429,40 92.563,41 53.75,42 50.231,44 5.456}
{0 CHEMBL313073,1 8.635,2 40,3 41.3,4 1.027,5 1.134,6 0.676,7 0.654,8 690.83,9 5,10 23,11 80,13 27,14 50,16 83,17 32,20 23,21 9,22 4,23 3,24 33,25 15,26 2,28 4,29 6,31 2,32 47,34 3,35 7.5,36 0.157,37 13,38 65.5,39 82.2,40 90.752,41 54.04,42 52.327,43 3.8,44 8.041}
{0 CHEMBL313868,1 8.463,2 42.5,3 41.4,4 1.018,5 1.128,6 0.685,7 0.66,8 736.3,9 5.7,10 24,11 87,13 30,14 55,16 91,17 37,18 1,20 28,21 9,22 6,23 2,24 36,25 14,26 2,28 5,29 5,31 1,32 51,34 3,35 5.7,36 0.143,37 13,38 73,39 88.592,40 98.14,41 59.625,42 57.418,43 3.4,44 8.62}
{0 CHEMBL314506,1 7.532,2 39.1,3 47.8,4 1.002,5 1.124,6 0.666,7 0.623,8 692.98,9 4.3,10 23,11 92,13 27,14 51,16 95,17 36,20 23,21 13,22 4,24 44,25 12,26 2,28 4,29 6,31 2,32 48,35 6.5,36 0.179,37 17,38 66.5,39 92.196,40 103.394,41 61.273,42 57.285,44 8.959}
{0 CHEMBL314827,1 7.842,2 39.8,3 45.8,4 1.007,5 1.122,6 0.675,7 0.635,8 650.89,9 4.8,10 23,11 83,13 27,14 48,16 86,17 33,20 23,21 10,22 4,24 38,25 12,26 2,28 4,29 6,31 2,32 45,35 7.2,36 0.151,37 13,38 63.5,39 83.545,40 93.148,41 55.989,42 52.704,44 8.959}
{0 CHEMBL315275,1 7.748,2 36.8,3 47.4,4 1.009,5 1.128,6 0.661,7 0.621,8 588.82,9 5.3,10 17,11 76,13 21,14 42,16 78,17 28,20 17,21 11,22 4,24 36,25 12,26 2,28 4,29 6,31 2,32 40,35 7.9,36 0.167,37 13,38 54.5,39 76.661,40 85.733,41 50.228,42 47.177,44 8.086}
{0 CHEMBL315327,1 7.961,2 40,3 45,4 1.008,5 1.122,6 0.678,7 0.64,8 636.86,9 5,10 23,11 80,13 27,14 47,16 83,17 32,20 23,21 9,22 4,24 36,25 12,26 2,28 4,29 6,31 2,32 44,35 7.5,36 0.157,37 13,38 62.5,39 80.661,40 89.733,41 54.228,42 51.177,44 8.699}
{0 CHEMBL315994,1 8.227,2 40.5,3 43.2,4 1.012,5 1.12,6 0.685,7 0.65,8 608.8,9 5.4,10 23,11 74,13 27,14 45,16 77,17 30,20 23,21 7,22 4,24 32,25 12,26 2,28 4,29 6,31 2,32 42,35 8.1,36 0.156,37 12,38 60.5,39 74.894,40 82.902,41 50.705,42 48.124,44 7.824}
{0 CHEMBL316021,1 7.961,2 40,3 45,4 1.008,5 1.122,6 0.678,7 0.64,8 636.86,9 5,10 23,11 80,13 27,14 47,16 83,17 32,20 23,21 9,22 4,24 36,25 12,26 2,28 4,29 6,31 2,32 44,35 7.5,36 0.157,37 13,38 62.5,39 80.661,40 89.733,41 54.228,42 51.177,44 8.409}
{0 CHEMBL321313,1 8.17,2 39.3,3 44,4 1.017,5 1.131,6 0.668,7 0.64,8 686.27,9 6,10 18,11 84,13 24,14 50,16 87,17 33,18 1,20 22,21 11,22 6,23 1,24 37,25 14,26 2,28 5,29 6,31 1,32 47,34 2,35 7.1,36 0.161,37 14,38 65,39 85.407,40 95.01,41 56.142,42 53.749,43 2.4,44 8.585}
{0 CHEMBL321531,1 8.652,2 42.5,3 41.4,4 1.016,5 1.124,6 0.696,7 0.665,8 752.75,9 5.7,10 24,11 87,13 30,14 55,16 91,17 37,18 2,20 28,21 9,22 6,23 1,24 36,25 14,26 3,28 5,29 5,31 1,32 51,34 3,35 5.7,36 0.143,37 13,38 73,39 88.403,40 97.745,41 60.546,42 57.862,43 3.4,44 7.77}
{0 CHEMBL323506,1 7.937,2 38.9,3 45.6,4 1.013,5 1.132,6 0.663,7 0.631,8 714.33,9 5.6,10 18,11 90,13 24,14 52,16 93,17 35,18 1,20 22,21 13,22 6,23 1,24 41,25 14,26 2,28 5,29 6,31 1,32 49,34 2,35 6.7,36 0.151,37 14,38 67,39 91.174,40 101.84,41 59.665,42 56.803,43 2.2,44 7.921}
{0 CHEMBL328480,1 8.375,2 40.3,3 41.6,4 1.011,5 1.125,6 0.692,7 0.659,8 644.85,9 10.4,10 28,11 77,13 32,14 49,16 81,17 31,20 24,21 7,22 4,24 32,25 14,26 2,28 8,29 4,31 2,32 45,35 5.2,36 0.148,37 12,38 67,39 77.88,40 86.646,41 53.296,42 50.726,44 7.357}
{0 CHEMBL330302,1 7.859,2 40.5,3 45.6,4 1.004,5 1.121,6 0.681,7 0.639,8 620.86,9 5.1,10 23,11 79,13 27,14 46,16 82,17 32,20 23,21 9,22 4,24 36,25 11,26 2,28 4,29 5,31 2,32 43,35 6.3,36 0.159,37 13,38 61.5,39 79.334,40 88.523,41 53.773,42 50.463,44 5.42}
{0 CHEMBL330744,1 7.961,2 40,3 45,4 1.008,5 1.122,6 0.678,7 0.64,8 636.86,9 5,10 23,11 80,13 27,14 47,16 83,17 32,20 23,21 9,22 4,24 36,25 12,26 2,28 4,29 6,31 2,32 44,35 7.5,36 0.169,37 14,38 62.5,39 80.661,40 89.733,41 54.228,42 51.177,44 6.921}
{0 CHEMBL331450,1 8.617,2 42.9,3 39.3,4 1.029,5 1.136,6 0.677,7 0.665,8 723.81,9 6,10 24,11 84,13 30,14 55,16 88,17 36,20 28,21 8,22 6,23 4,24 33,25 15,26 1,28 5,29 5,31 1,32 51,34 4,35 6,36 0.136,37 12,38 73,39 86.41,40 95.461,41 56.881,42 55.83,43 4.8,44 8.77}
{0 CHEMBL331455,1 8.402,2 39.3,3 41.7,4 1.031,5 1.144,6 0.656,7 0.644,8 705.8,9 6,10 18,11 84,13 24,14 52,16 87,17 33,20 22,21 11,22 6,23 4,24 35,25 16,26 1,28 5,29 6,31 1,32 49,34 4,35 7.1,36 0.149,37 13,38 67,39 86.621,40 96.085,41 55.097,42 54.072,43 4.8,44 8.569}
{0 CHEMBL331507,1 8.362,2 38.6,3 42,4 1.032,5 1.144,6 0.651,7 0.64,8 735.83,9 5.7,10 18,11 88,13 24,14 54,16 91,17 34,20 22,21 12,22 6,23 4,24 37,25 17,26 1,28 5,29 7,31 1,32 51,34 4,35 8,36 0.154,37 14,38 69,39 90.832,40 100.71,41 57.313,42 56.313,43 4.5,44 8.585}
{0 CHEMBL331632,1 8.613,2 42.7,3 40.2,4 1.02,5 1.124,6 0.69,7 0.667,8 706.25,9 6.1,10 24,11 82,13 30,14 53,16 86,17 35,18 1,20 28,21 7,22 6,23 1,24 33,25 14,26 2,28 5,29 6,31 1,32 49,34 2,35 7.3,36 0.128,37 11,38 71,39 83.64,40 92.18,41 56.62,42 54.696,43 2.4,44 8}
{0 CHEMBL332576,1 8.54,2 39.5,3 40.7,4 1.034,5 1.144,6 0.658,7 0.649,8 691.77,9 6.2,10 18,11 81,13 24,14 51,16 84,17 32,20 22,21 10,22 6,23 4,24 33,25 16,26 1,28 5,29 6,31 1,32 48,34 4,35 7.4,36 0.155,37 13,38 66,39 83.738,40 92.67,41 53.336,42 52.545,43 4.9,44 8.337}
{0 CHEMBL332909,1 8.617,2 42.9,3 39.3,4 1.029,5 1.136,6 0.677,7 0.665,8 723.81,9 6,10 24,11 84,13 30,14 55,16 88,17 36,20 28,21 8,22 6,23 4,24 33,25 15,26 1,28 5,29 5,31 1,32 51,34 4,35 6,36 0.136,37 12,38 73,39 86.41,40 95.461,41 56.881,42 55.83,43 4.8,44 8.367}
{0 CHEMBL333224,1 8.848,2 39.5,3 43.2,4 1.018,5 1.13,6 0.677,7 0.647,8 716.69,9 6.2,10 18,11 81,13 24,14 49,15 1,16 84,17 32,20 22,21 10,22 6,23 1,24 35,25 14,26 2,28 5,29 6,31 1,32 46,34 2,35 7.4,36 0.143,37 12,38 64,39 82.429,40 91.492,41 54.875,42 52.42,43 2.5,44 8.678}
{0 CHEMBL334300,1 7.956,2 39.3,3 45.2,4 1.011,5 1.127,6 0.669,7 0.635,8 668.28,9 6,10 18,11 84,13 24,14 49,16 87,17 33,18 1,20 22,21 11,22 6,24 38,25 13,26 2,28 5,29 6,31 1,32 46,34 1,35 7.1,36 0.149,37 13,38 64,39 84.894,40 94.67,41 56.205,42 53.366,43 1.2,44 8.237}
{0 CHEMBL338027,1 8.699,2 39.3,3 44,4 1.016,5 1.13,6 0.674,7 0.642,8 730.72,9 6,10 18,11 84,13 24,14 50,15 1,16 87,17 33,20 22,21 11,22 6,23 1,24 37,25 14,26 2,28 5,29 6,31 1,32 47,34 2,35 7.1,36 0.149,37 13,38 65,39 85.312,40 94.908,41 56.637,42 53.947,43 2.4,44 8.469}
{0 CHEMBL338137,1 8.438,2 41.8,3 40.7,4 1.028,5 1.137,6 0.669,7 0.655,8 767.87,9 5.5,10 24,11 91,13 30,14 58,16 95,17 38,20 28,21 10,22 6,23 4,24 37,25 16,26 1,28 5,29 6,31 1,32 54,34 4,35 6.6,36 0.137,37 13,38 76,39 93.505,40 103.5,41 60.858,42 59.598,43 4.4,44 8.201}
{0 CHEMBL338342,1 8.997,2 42.4,3 41.2,4 1.017,5 1.123,6 0.693,7 0.664,8 764.73,9 5.9,10 24,11 85,13 30,14 54,15 1,16 89,17 36,20 28,21 8,22 6,23 1,24 35,25 14,26 2,28 5,29 6,31 1,32 50,34 2,35 7.1,36 0.135,37 12,38 72,39 86.429,40 95.492,41 58.875,42 56.42,43 2.4,44 8.444}
{0 CHEMBL338433,1 8.24,2 38.5,3 42.9,4 1.03,5 1.144,6 0.649,7 0.636,8 749.86,9 5.5,10 18,11 91,13 24,14 55,16 94,17 35,20 22,21 13,22 6,23 4,24 39,25 17,26 1,28 5,29 7,31 1,32 52,34 4,35 7.7,36 0.16,37 15,38 70,39 93.716,40 104.125,41 59.074,42 57.84,43 4.4,44 8.658}
{0 CHEMBL338434,1 8.042,2 38.7,3 44.1,4 1.024,5 1.143,6 0.649,7 0.631,8 747.89,9 5.4,10 18,11 93,13 24,14 55,16 96,17 36,20 22,21 14,22 6,23 4,24 41,25 16,26 1,28 5,29 6,31 1,32 52,34 4,35 6.5,36 0.156,37 15,38 70,39 95.272,40 106.331,41 60.381,42 58.652,43 4.3,44 8.42}
{0 CHEMBL338514,1 6.685,2 37.8,3 51.4,4 0.996,5 1.134,6 0.632,7 0.593,8 494.7,9 5.4,10 11,11 74,13 15,14 38,16 76,17 28,20 14,21 14,22 4,24 38,25 8,28 4,29 4,32 36,35 5.4,36 0.184,37 14,38 47.5,39 73.738,40 83.889,41 46.785,42 43.9,44 5.231}
{0 CHEMBL338687,1 8.848,2 39.5,3 43.2,4 1.018,5 1.13,6 0.677,7 0.647,8 716.69,9 6.2,10 18,11 81,13 24,14 49,15 1,16 84,17 32,20 22,21 10,22 6,23 1,24 35,25 14,26 2,28 5,29 6,31 1,32 46,34 2,35 7.4,36 0.155,37 13,38 64,39 82.429,40 91.492,41 54.875,42 52.42,43 2.5,44 8.959}
{0 CHEMBL338888,1 8.17,2 39.3,3 44,4 1.017,5 1.131,6 0.668,7 0.64,8 686.27,9 6,10 18,11 84,13 24,14 50,16 87,17 33,18 1,20 22,21 11,22 6,23 1,24 37,25 14,26 2,28 5,29 6,31 1,32 47,34 2,35 7.1,36 0.149,37 13,38 65,39 85.407,40 95.01,41 56.142,42 53.749,43 2.4,44 8.699}
{0 CHEMBL338889,1 8.274,2 39.1,3 42.5,4 1.029,5 1.144,6 0.654,7 0.639,8 719.83,9 5.7,10 18,11 87,13 24,14 53,16 90,17 34,20 22,21 12,22 6,23 4,24 37,25 16,26 1,28 5,29 6,31 1,32 50,34 4,35 6.9,36 0.144,37 13,38 68,39 89.505,40 99.5,41 56.858,42 55.598,43 4.6,44 8.444}
{0 CHEMBL339004,1 8.652,2 42.5,3 41.4,4 1.016,5 1.124,6 0.696,7 0.665,8 752.75,9 5.7,10 24,11 87,13 30,14 55,16 91,17 37,18 2,20 28,21 9,22 6,23 1,24 36,25 14,26 3,28 5,29 5,31 1,32 51,34 3,35 5.7,36 0.154,37 14,38 73,39 88.403,40 97.745,41 60.546,42 57.862,43 3.4,44 8.432}
{0 CHEMBL339040,1 8.049,2 39.1,3 44.8,4 1.015,5 1.131,6 0.666,7 0.635,8 700.3,9 5.7,10 18,11 87,13 24,14 51,16 90,17 34,18 1,20 22,21 12,22 6,23 1,24 39,25 14,26 2,28 5,29 6,31 1,32 48,34 2,35 6.9,36 0.156,37 14,38 66,39 88.29,40 98.425,41 57.904,42 55.276,43 2.3,44 8.469}
{0 CHEMBL339113,1 8.274,2 39.1,3 42.5,4 1.029,5 1.144,6 0.654,7 0.639,8 719.83,9 5.7,10 18,11 87,13 24,14 53,16 90,17 34,20 22,21 12,22 6,23 4,24 37,25 16,26 1,28 5,29 6,31 1,32 50,34 4,35 6.9,36 0.144,37 13,38 68,39 89.505,40 99.5,41 56.858,42 55.598,43 4.6,44 8.538}
{0 CHEMBL339256,1 9.027,2 42.9,3 38.1,4 1.033,5 1.136,6 0.687,7 0.674,8 758.25,9 6,10 24,11 84,13 30,14 56,16 88,17 36,18 1,20 28,21 8,22 6,23 4,24 32,25 16,26 2,28 5,29 5,31 1,32 52,34 5,35 6,36 0.136,37 12,38 74,39 86.734,40 95.405,41 57.739,42 56.658,43 6,44 8.671}
{0 CHEMBL339544,1 7.189,2 39.3,3 48.8,4 0.998,5 1.128,6 0.657,7 0.615,8 603.86,9 6,10 16,11 84,13 20,14 47,16 88,17 33,20 17,21 16,22 4,24 41,25 10,26 1,28 5,29 4,31 1,32 43,35 4.8,36 0.148,37 13,38 59,39 83.799,40 94.723,41 55.199,42 51.636,44 6.26}
{0 CHEMBL339605,1 8.17,2 39.3,3 44,4 1.017,5 1.131,6 0.668,7 0.64,8 686.27,9 6,10 18,11 84,13 24,14 50,16 87,17 33,18 1,20 22,21 11,22 6,23 1,24 37,25 14,26 2,28 5,29 6,31 1,32 47,34 2,35 7.1,36 0.149,37 13,38 65,39 85.407,40 95.01,41 56.142,42 53.749,43 2.4,44 8.432}
{0 CHEMBL339672,1 8.947,2 43.2,3 39.5,4 1.02,5 1.122,6 0.704,7 0.677,8 724.69,9 6.2,10 24,11 81,13 30,14 53,16 85,17 35,18 2,20 28,21 7,22 6,23 1,24 32,25 14,26 3,28 5,29 5,31 1,32 49,34 3,35 6.2,36 0.141,37 12,38 71,39 82.636,40 90.914,41 57.023,42 54.808,43 3.7,44 8.509}
{0 CHEMBL339722,1 8.14,2 38.6,3 44.3,4 1.018,5 1.132,6 0.663,7 0.636,8 716.3,9 5.7,10 18,11 88,13 24,14 52,16 91,17 34,18 1,20 22,21 12,22 6,23 1,24 39,25 15,26 2,28 5,29 7,31 1,32 49,34 2,35 8,36 0.165,37 15,38 67,39 89.618,40 99.635,41 58.358,42 55.991,43 2.3,44 8.762}
{0 CHEMBL339806,1 8.699,2 39.3,3 44,4 1.016,5 1.13,6 0.674,7 0.642,8 730.72,9 6,10 18,11 84,13 24,14 50,15 1,16 87,17 33,20 22,21 11,22 6,23 1,24 37,25 14,26 2,28 5,29 6,31 1,32 47,34 2,35 7.1,36 0.149,37 13,38 65,39 85.312,40 94.908,41 56.637,42 53.947,43 2.4,44 8.432}
{0 CHEMBL340078,1 9.437,2 42.9,3 36.9,4 1.036,5 1.135,6 0.698,7 0.684,8 792.69,9 6,10 24,11 84,13 30,14 57,16 88,17 36,18 2,20 28,21 8,22 6,23 4,24 31,25 17,26 3,28 5,29 5,31 1,32 53,34 6,35 6,36 0.136,37 12,38 75,39 87.058,40 95.349,41 58.597,42 57.485,43 7.1,44 8.292}
{0 CHEMBL340473,1 8.521,2 41.2,3 41.2,4 1.022,5 1.127,6 0.68,7 0.658,8 724.27,9 5.9,10 23,11 85,13 29,14 54,16 89,17 35,18 1,20 26,21 9,22 6,23 1,24 35,25 15,26 2,28 5,29 7,31 1,32 50,34 2,35 8.2,36 0.146,37 13,38 71.5,39 86.851,40 95.804,41 57.835,42 55.937,43 2.4,44 7.699}
{0 CHEMBL340632,1 7.937,2 38.9,3 45.6,4 1.013,5 1.132,6 0.663,7 0.631,8 714.33,9 5.6,10 18,11 90,13 24,14 52,16 93,17 35,18 1,20 22,21 13,22 6,23 1,24 41,25 14,26 2,28 5,29 6,31 1,32 49,34 2,35 6.7,36 0.161,37 15,38 67,39 91.174,40 101.84,41 59.665,42 56.803,43 2.2,44 8.509}
{0 CHEMBL34124,1 7.576,2 47.8,3 43.3,4 1.002,5 1.11,6 0.686,7 0.656,8 507.62,9 1.5,10 24,11 67,13 26,14 42,16 71,17 32,20 26,21 6,22 2,24 29,25 6,28 1,29 5,32 38,35 7.5,36 0.113,37 8,38 56,39 67.109,40 74.358,41 45.938,42 43.971,44 9.237}
{0 CHEMBL341369,1 8.56,2 39.1,3 44.8,4 1.014,5 1.13,6 0.671,7 0.638,8 744.75,9 5.7,10 18,11 87,13 24,14 51,15 1,16 90,17 34,20 22,21 12,22 6,23 1,24 39,25 14,26 2,28 5,29 6,31 1,32 48,34 2,35 6.9,36 0.156,37 14,38 66,39 88.196,40 98.323,41 58.398,42 55.474,43 2.3,44 8.658}
{0 CHEMBL346728,1 7.783,2 46.8,3 43,4 0.996,5 1.111,6 0.702,7 0.662,8 614.82,9 5.1,10 34,11 79,13 37,14 50,16 84,17 37,20 31,21 6,22 3,24 34,25 8,26 1,28 4,29 3,31 1,32 45,35 3.8,36 0.107,37 9,38 70,39 78.72,40 87.769,41 55.455,42 52.319,44 7.745}
{0 CHEMBL348126,1 7.885,2 40.7,3 45.7,4 1.006,5 1.127,6 0.673,7 0.637,8 638.65,9 6.2,10 22,11 81,13 25,14 47,16 84,17 33,18 2,20 22,21 11,22 3,24 37,25 11,26 2,28 5,29 4,32 44,34 2,35 4.9,36 0.155,37 13,38 61,39 81.487,40 91.276,41 54.506,42 51.577,43 2.5,44 6.137}
{0 CHEMBL348157,1 7.476,2 42.2,3 44.4,4 1.003,5 1.127,6 0.667,7 0.638,8 672.86,9 8.9,10 29,11 90,13 32,14 55,16 95,17 38,20 28,21 10,22 3,24 40,25 12,28 8,29 4,32 50,35 4.4,36 0.116,37 11,38 72.5,39 90.261,40 101.467,41 60.046,42 57.459,44 6.745}
{0 CHEMBL348363,1 7.706,2 47,3 42.4,4 1.005,5 1.113,6 0.685,7 0.659,8 508.61,9 3,10 24,11 66,13 26,14 42,16 70,17 31,20 26,21 5,22 2,24 28,25 7,28 2,29 5,32 38,35 7.6,36 0.1,37 7,38 56,39 66.327,40 73.441,41 45.182,42 43.465,44 8.237}
{0 CHEMBL350220,1 7.709,2 43.3,3 43.3,4 1.013,5 1.121,6 0.665,7 0.644,8 462.54,9 3.3,10 18,11 60,13 20,14 37,16 63,17 26,20 20,21 6,22 2,24 26,25 8,28 2,29 6,32 34,35 10,36 0.111,37 7,38 48,39 60.771,40 67.235,41 39.875,42 38.653,44 5.959}
{0 CHEMBL350875,1 7.574,2 46.4,3 43.5,4 1.003,5 1.114,6 0.68,7 0.652,8 522.64,9 2.9,10 24,11 69,13 26,14 43,16 73,17 32,20 26,21 6,22 2,24 30,25 7,28 2,29 5,32 39,35 7.2,36 0.11,37 8,38 57,39 69.211,40 76.856,41 46.943,42 44.992,44 6.137}
{0 CHEMBL361927,1 7.652,2 37.5,3 48.4,4 1.002,5 1.125,6 0.669,7 0.62,8 489.72,9 4.7,10 16,11 64,13 19,14 35,16 66,17 24,20 14,21 10,22 3,24 31,25 9,26 2,28 3,29 4,31 2,32 33,35 6.3,36 0.167,37 11,38 46,39 64.138,40 71.985,41 42.79,42 39.673,44 9.301}
{0 CHEMBL36324,1 7.677,2 43.5,3 44.9,4 1.001,5 1.117,6 0.683,7 0.645,8 529.71,9 4.3,10 18,11 69,13 23,14 42,16 73,17 30,20 21,21 9,22 5,24 31,25 8,26 1,28 3,29 4,31 1,32 38,35 5.8,36 0.11,37 8,38 56,39 69.061,40 77.065,41 47.142,42 44.486,44 6.523}
{0 CHEMBL366210,1 7.847,2 40.3,3 46.3,4 1.002,5 1.119,6 0.683,7 0.637,8 525.75,9 4.5,10 21,11 67,13 24,14 39,16 70,17 27,20 18,21 9,22 3,24 31,25 9,26 2,28 3,29 4,31 2,32 36,35 6,36 0.157,37 11,38 52.5,39 67.138,40 74.985,41 45.79,42 42.673,44 8.398}
{0 CHEMBL370939,1 7.902,2 38.2,3 47.3,4 1.005,5 1.121,6 0.677,7 0.629,8 434.63,9 3.6,10 11,11 55,13 15,14 30,16 56,17 21,19 1,20 11,21 9,22 3,24 26,25 8,26 2,28 2,29 4,31 2,32 29,33 1,35 7.3,36 0.179,37 10,38 40.5,39 55.269,40 61.657,41 37.262,42 34.598,44 5}
{0 CHEMBL371395,1 7.704,2 38.1,3 44.1,4 1.018,5 1.136,6 0.644,7 0.628,8 909.07,9 8.5,10 23,11 118,13 31,14 71,16 123,17 45,20 29,21 16,22 8,24 52,25 21,28 10,29 11,32 66,35 9.3,36 0.154,37 19,38 90.5,39 120.174,40 134.006,41 76.046,42 74.14,44 7.427}
{0 CHEMBL372814,1 7.322,2 41.9,3 47.3,4 0.998,5 1.121,6 0.669,7 0.628,8 680.94,9 4.3,10 28,11 93,13 31,14 54,16 98,17 39,20 25,21 14,22 3,24 44,25 10,26 1,28 4,29 5,31 1,32 49,35 5.4,36 0.122,37 12,38 71,39 92.792,40 104.264,41 62.171,42 58.383,44 7.495}
{0 CHEMBL374725,1 6.896,2 32.1,3 50.9,4 1.01,5 1.149,6 0.608,7 0.58,8 365.49,9 9.4,10 5,11 53,13 8,14 27,16 54,17 17,20 6,21 11,22 3,24 27,25 9,28 5,29 4,32 26,35 7.5,36 0.148,37 8,38 32.5,39 53.538,40 60.896,41 32.222,42 30.761,44 5}
{0 CHEMBL374726,1 7.569,2 42.4,3 44.1,4 1.007,5 1.125,6 0.665,7 0.64,8 446.55,9 6.8,10 17,11 59,13 20,14 36,16 62,17 25,20 18,21 7,22 3,24 26,25 8,28 4,29 4,32 33,35 6.8,36 0.129,37 8,38 47.5,39 59.436,40 66.398,41 39.216,42 37.74,44 5}
{0 CHEMBL374751,1 7.569,2 42.4,3 44.1,4 1.007,5 1.125,6 0.665,7 0.64,8 446.55,9 6.8,10 17,11 59,13 20,14 36,16 62,17 25,20 18,21 7,22 3,24 26,25 8,28 4,29 4,32 33,35 6.8,36 0.129,37 8,38 47.5,39 59.436,40 66.398,41 39.216,42 37.74,44 5}
{0 CHEMBL375335,1 7.113,2 37.9,3 48.3,4 1.006,5 1.135,6 0.638,7 0.608,8 412.54,9 6.9,10 11,11 58,13 14,14 32,16 60,17 22,20 12,21 10,22 3,24 28,25 8,28 4,29 4,32 30,35 6.9,36 0.133,37 8,38 40.5,39 58.32,40 65.813,41 36.978,42 35.266,44 5}
{0 CHEMBL375366,1 7.484,2 37.3,3 45.8,4 1.015,5 1.137,6 0.639,7 0.618,8 441.54,9 8.5,10 11,11 59,13 15,14 34,16 61,17 22,20 13,21 9,22 4,24 27,25 10,28 5,29 5,32 32,35 8.5,36 0.148,37 9,38 43.5,39 59.865,40 67.106,41 37.676,42 36.476,44 5}
{0 CHEMBL376286,1 7.168,2 38.6,3 47.7,4 1.005,5 1.133,6 0.642,7 0.612,8 315.41,9 6.8,10 11,11 44,13 13,14 24,16 45,17 17,20 11,21 6,22 2,24 21,25 6,28 3,29 3,32 23,35 6.8,36 0.156,37 7,38 31.5,39 44.24,40 49.86,41 28.233,42 26.95,44 7.78}
{0 CHEMBL376869,1 7.168,2 38.6,3 47.7,4 1.005,5 1.133,6 0.642,7 0.612,8 315.41,9 6.8,10 11,11 44,13 13,14 24,16 45,17 17,20 11,21 6,22 2,24 21,25 6,28 3,29 3,32 23,35 6.8,36 0.156,37 7,38 31.5,39 44.24,40 49.86,41 28.233,42 26.95,44 5}
{0 CHEMBL384125,1 7.73,2 34.8,3 46.2,4 1.015,5 1.139,6 0.645,7 0.617,8 1020.34,9 9.8,10 17,11 132,13 26,14 76,16 137,17 46,20 24,21 22,22 9,24 61,25 25,26 2,28 13,29 10,31 2,32 71,35 7.6,36 0.153,37 21,38 93.5,39 133.956,40 150.377,41 85.188,42 81.444,44 8.131}
{0 CHEMBL384352,1 7.662,2 34.8,3 46.7,4 1.014,5 1.139,6 0.644,7 0.615,8 1034.37,9 9.6,10 17,11 135,13 26,14 77,16 140,17 47,20 24,21 23,22 9,24 63,25 25,26 2,28 13,29 10,31 2,32 72,35 7.4,36 0.143,37 20,38 94.5,39 136.839,40 153.792,41 86.95,42 82.97,44 9.328}
{0 CHEMBL384462,1 7.519,2 36.9,3 49.2,4 0.999,5 1.127,6 0.667,7 0.615,8 488.74,9 6.2,10 16,11 65,13 19,14 35,16 67,17 24,20 14,21 10,22 3,24 32,25 9,26 2,28 4,29 3,31 2,32 33,35 4.6,36 0.149,37 10,38 46,39 64.912,40 73.274,41 43.341,42 39.979,44 8.398}
{0 CHEMBL384577,1 7.798,2 37.7,3 47.5,4 1.004,5 1.124,6 0.673,7 0.625,8 475.69,9 4.9,10 16,11 61,13 19,14 34,16 63,17 23,20 14,21 9,22 3,24 29,25 9,26 2,28 3,29 4,31 2,32 32,35 6.6,36 0.159,37 10,38 45,39 61.254,40 68.57,41 41.029,42 38.146,44 7.432}
{0 CHEMBL385283,1 7.662,2 34.8,3 46.7,4 1.014,5 1.139,6 0.644,7 0.615,8 1034.37,9 9.6,10 17,11 135,13 26,14 77,16 140,17 47,20 24,21 23,22 9,24 63,25 25,26 2,28 13,29 10,31 2,32 72,35 7.4,36 0.15,37 21,38 94.5,39 136.839,40 153.792,41 86.95,42 82.97,44 9.187}
{0 CHEMBL385706,1 7.229,2 35.8,3 47.8,4 1.011,5 1.141,6 0.63,7 0.605,8 1149.47,9 8.8,10 23,11 159,13 33,14 88,16 164,17 57,20 31,21 26,22 10,24 76,25 26,28 14,29 12,32 83,35 7.5,36 0.171,37 28,38 109.5,39 160.744,40 181.36,41 100.137,42 96.208,44 8.745}
{0 CHEMBL385714,1 8.127,2 36.1,3 47.5,4 1.005,5 1.123,6 0.683,7 0.628,8 495.75,9 4.9,10 16,11 61,13 20,14 34,16 63,17 22,20 13,21 9,22 4,24 29,25 10,26 3,28 3,29 4,31 3,32 32,35 6.6,36 0.175,37 11,38 46,39 61.331,40 68.49,41 41.676,42 38.333,44 7.119}
{0 CHEMBL385998,1 7.398,2 37,3 46.3,4 1.012,5 1.139,6 0.638,7 0.615,8 399.5,9 9.3,10 11,11 54,13 14,14 31,16 56,17 20,20 12,21 8,22 3,24 25,25 9,28 5,29 4,32 29,35 7.4,36 0.143,37 8,38 39.5,39 54.654,40 61.481,41 34.461,42 33.234,44 5}
{0 CHEMBL386172,1 8.096,2 37.3,3 45.8,4 1.012,5 1.125,6 0.673,7 0.633,8 477.66,9 5.1,10 16,11 59,13 19,14 34,16 61,17 22,20 14,21 8,22 3,24 27,25 10,26 2,28 3,29 5,31 2,32 32,35 8.5,36 0.18,37 11,38 45,39 59.698,40 66.364,41 39.722,42 37.334,44 7.509}
{0 CHEMBL386257,1 7.589,2 36.6,3 45,4 1.017,5 1.14,6 0.638,7 0.62,8 994.2,9 9.9,10 23,11 131,13 32,14 77,16 136,17 48,20 30,21 18,22 9,24 59,25 24,28 13,29 11,32 72,35 8.4,36 0.169,37 23,38 97.5,39 133.247,40 149.331,41 83.586,42 81.257,44 5}
{0 CHEMBL386269,1 8.139,2 38.2,3 45.5,4 1.009,5 1.123,6 0.682,7 0.638,8 447.63,9 5.5,10 16,11 55,13 19,14 32,16 57,17 21,20 14,21 7,22 3,24 25,25 9,26 2,28 3,29 4,31 2,32 30,35 7.3,36 0.158,37 9,38 43,39 55.487,40 61.74,41 37.506,42 35.092,44 8}
{0 CHEMBL386671,1 7.798,2 37.7,3 47.5,4 1.004,5 1.124,6 0.673,7 0.625,8 475.69,9 4.9,10 16,11 61,13 19,14 34,16 63,17 23,20 14,21 9,22 3,24 29,25 9,26 2,28 3,29 4,31 2,32 32,35 6.6,36 0.143,37 9,38 45,39 61.254,40 68.57,41 41.029,42 38.146,44 7.201}
{0 CHEMBL386718,1 7.661,2 38.3,3 48.3,4 0.999,5 1.123,6 0.676,7 0.624,8 459.69,9 5,10 16,11 60,13 19,14 33,16 62,17 23,20 14,21 9,22 3,24 29,25 8,26 2,28 3,29 3,31 2,32 31,35 5,36 0.161,37 10,38 44,39 59.927,40 67.361,41 40.574,42 37.431,44 7.102}
{0 CHEMBL38842,1 7.952,2 42.2,3 45.1,4 1.002,5 1.115,6 0.693,7 0.647,8 811.14,9 3.9,10 28,11 102,13 34,14 61,16 107,17 43,20 30,21 13,22 6,24 46,25 13,26 3,28 4,29 6,31 3,32 56,35 5.9,36 0.159,37 17,38 81,39 102.156,40 113.729,41 70.682,42 65.998,44 5}
{0 CHEMBL39132,1 7.706,2 38.9,3 47.2,4 1.002,5 1.124,6 0.674,7 0.628,8 554.8,9 5.6,10 21,11 72,13 24,14 41,16 75,17 28,20 17,21 11,22 3,24 34,25 10,26 2,28 4,29 4,31 2,32 38,35 5.6,36 0.133,37 10,38 54.5,39 72.123,40 80.899,41 48.557,42 45.221,44 5}
{0 CHEMBL39352,1 7.749,2 43.1,3 44.6,4 1.003,5 1.118,6 0.683,7 0.646,8 503.67,9 4.6,10 18,11 65,13 23,14 39,16 68,17 28,20 21,21 7,22 5,24 29,25 8,26 1,28 3,29 4,31 1,32 36,35 6.2,36 0.118,37 8,38 53,39 65.178,40 72.65,41 44.381,42 41.959,44 6.699}
{0 CHEMBL39959,1 7.215,2 39.7,3 48.7,4 0.998,5 1.126,6 0.659,7 0.617,8 562.8,9 5.1,10 22,11 78,13 25,14 43,16 81,17 31,20 19,21 12,22 3,24 38,25 9,26 1,28 4,29 4,31 1,32 40,35 5.1,36 0.148,37 12,38 57,39 77.814,40 87.809,41 51.432,42 48.087,44 8.296}
{0 CHEMBL39996,1 8.025,2 42.9,3 44.3,4 1.002,5 1.114,6 0.697,7 0.652,8 561.78,9 4.3,10 18,11 70,13 23,14 43,16 74,17 30,20 21,21 9,22 5,24 31,25 9,26 2,28 3,29 4,31 2,32 39,35 5.7,36 0.108,37 8,38 57,39 70.138,40 77.985,41 48.79,42 45.673,44 6.699}
{0 CHEMBL40381,1 8.035,2 44.6,3 42.9,4 1.006,5 1.118,6 0.69,7 0.658,8 449.97,9 5.4,10 22,11 56,13 23,14 35,16 59,17 25,18 1,20 19,21 6,22 1,24 24,25 7,26 1,28 3,29 3,32 32,34 1,35 5.4,36 0.136,37 8,38 47,39 56.331,40 62.634,41 38.614,42 36.831,43 1.8,44 7.658}
{0 CHEMBL404996,1 7.686,2 33.8,3 46.8,4 1.017,5 1.141,6 0.638,7 0.611,8 1068.39,9 9.4,10 17,11 139,13 27,14 77,16 142,17 47,20 25,21 22,22 10,24 65,25 27,26 2,28 13,29 12,31 2,32 74,35 8.6,36 0.211,37 30,38 95.5,39 141.377,40 158.626,41 88.62,42 84.927,44 9.208}
{0 CHEMBL40563,1 7.473,2 38.5,3 48.7,4 0.999,5 1.125,6 0.668,7 0.619,8 582.86,9 5.1,10 21,11 78,13 24,14 43,16 81,17 30,20 17,21 13,22 3,24 38,25 10,26 2,28 4,29 4,31 2,32 40,35 5.1,36 0.136,37 11,38 56.5,39 77.89,40 87.729,41 52.08,42 48.275,44 5}
{0 CHEMBL406290,1 7.662,2 34.8,3 46.7,4 1.014,5 1.139,6 0.644,7 0.615,8 1034.37,9 9.6,10 17,11 135,13 26,14 77,16 140,17 47,20 24,21 23,22 9,24 63,25 25,26 2,28 13,29 10,31 2,32 72,35 7.4,36 0.15,37 21,38 94.5,39 136.839,40 153.792,41 86.95,42 82.97,44 8.041}
{0 CHEMBL406907,1 7.524,2 37.3,3 45.5,4 1.016,5 1.137,6 0.638,7 0.619,8 1008.22,9 8.2,10 23,11 134,13 32,14 78,16 139,17 50,20 30,21 20,22 9,24 61,25 23,28 11,29 12,32 73,35 9,36 0.158,37 22,38 98.5,39 136.137,40 152.374,41 85.552,42 82.983,44 8.032}
{0 CHEMBL407801,1 7.524,2 37.3,3 45.5,4 1.016,5 1.137,6 0.638,7 0.619,8 1008.22,9 8.2,10 23,11 134,13 32,14 78,16 139,17 50,20 30,21 20,22 9,24 61,25 23,28 11,29 12,32 73,35 9,36 0.158,37 22,38 98.5,39 136.137,40 152.374,41 85.552,42 82.983,44 5}
{0 CHEMBL408403,1 7.167,2 34.2,3 48.6,4 1.013,5 1.144,6 0.621,7 0.597,8 1046.34,9 8.9,10 17,11 146,13 27,14 78,16 149,17 50,20 25,21 25,22 10,24 71,25 25,28 13,29 12,32 75,35 8.2,36 0.195,37 29,38 96.5,39 147.875,40 167.032,41 90.609,42 87.133,44 9.581}
{0 CHEMBL408773,1 7.73,2 34.8,3 46.2,4 1.015,5 1.139,6 0.645,7 0.617,8 1020.34,9 9.8,10 17,11 132,13 26,14 76,16 137,17 46,20 24,21 22,22 9,24 61,25 25,26 2,28 13,29 10,31 2,32 71,35 7.6,36 0.146,37 20,38 93.5,39 133.956,40 150.377,41 85.188,42 81.444,44 8.215}
{0 CHEMBL408885,1 7.768,2 34.4,3 46.1,4 1.016,5 1.14,6 0.644,7 0.617,8 994.3,9 10.2,10 17,11 128,13 26,14 73,16 132,17 44,20 24,21 20,22 9,24 59,25 25,26 2,28 13,29 10,31 2,32 69,35 7.8,36 0.152,37 20,38 90.5,39 130.072,40 145.962,41 82.427,42 78.917,44 7.553}
{0 CHEMBL408886,1 7.662,2 34.8,3 46.7,4 1.014,5 1.139,6 0.644,7 0.615,8 1034.37,9 9.6,10 17,11 135,13 26,14 77,16 140,17 47,20 24,21 23,22 9,24 63,25 25,26 2,28 13,29 10,31 2,32 72,35 7.4,36 0.143,37 20,38 94.5,39 136.839,40 153.792,41 86.95,42 82.97,44 8.319}
{0 CHEMBL409170,1 7.653,2 40.5,3 45.2,4 1.005,5 1.126,6 0.668,7 0.635,8 642.85,9 7.1,10 23,11 84,13 27,14 51,16 89,17 34,20 22,21 12,22 4,24 38,25 12,26 1,28 6,29 5,31 1,32 46,35 6,36 0.135,37 12,38 66.5,39 84.461,40 94.6,41 56.137,42 53.318,44 6.222}
{0 CHEMBL409184,1 6.923,2 34.1,3 50.3,4 1.007,5 1.145,6 0.619,7 0.589,8 1280.73,9 9.2,10 22,11 185,13 33,14 96,16 189,17 63,20 29,21 34,22 11,24 93,25 29,28 17,29 12,32 92,35 6.5,36 0.201,37 38,38 118,39 186.235,40 211.762,41 114.484,42 108.96,44 6.936}
{0 CHEMBL409528,1 7.589,2 36.6,3 45,4 1.017,5 1.14,6 0.638,7 0.62,8 994.2,9 9.9,10 23,11 131,13 32,14 77,16 136,17 48,20 30,21 18,22 9,24 59,25 24,28 13,29 11,32 72,35 8.4,36 0.169,37 23,38 97.5,39 133.247,40 149.331,41 83.586,42 81.257,44 8.553}
{0 CHEMBL409843,1 7.772,2 41.3,3 45.7,4 1.003,5 1.119,6 0.679,7 0.639,8 714.98,9 4.3,10 23,11 92,13 29,14 54,16 96,17 38,20 26,21 12,22 6,24 42,25 12,26 2,28 4,29 6,31 2,32 50,35 6.5,36 0.156,37 15,38 71.5,39 92.312,40 102.978,41 62.512,42 58.758,44 7.071}
{0 CHEMBL411657,1 7.73,2 34.8,3 46.2,4 1.015,5 1.139,6 0.645,7 0.617,8 2040.68,9 9.8,10 34,11 264,13 52,14 152,16 274,17 92,20 48,21 44,22 18,24 122,25 50,26 4,28 26,29 20,31 4,32 142,35 7.6,36 0.146,37 40,38 187,39 267.911,40 300.753,41 170.376,42 162.887,44 7.602}
{0 CHEMBL41194,1 7.355,2 43.1,3 44.8,4 0.996,5 1.127,6 0.674,7 0.64,8 426.57,9 10.3,10 22,11 58,13 23,14 36,16 62,17 25,20 17,21 8,22 1,24 26,25 7,28 6,29 1,32 32,35 1.7,36 0.097,37 6,38 48,39 57.774,40 65.351,41 39.103,42 37.111,44 5}
{0 CHEMBL413034,1 7.304,2 34.5,3 47.5,4 1.014,5 1.144,6 0.625,7 0.603,8 1015.28,9 10.1,10 17,11 139,13 27,14 77,16 143,17 48,20 25,21 23,22 10,24 66,25 25,28 14,29 11,32 73,35 7.9,36 0.147,37 21,38 95.5,39 140.999,40 159.075,41 86.876,42 83.859,44 7.066}
{0 CHEMBL413925,1 7.73,2 34.8,3 46.2,4 1.015,5 1.139,6 0.645,7 0.617,8 1020.34,9 9.8,10 17,11 132,13 26,14 76,16 137,17 46,20 24,21 22,22 9,24 61,25 25,26 2,28 13,29 10,31 2,32 71,35 7.6,36 0.146,37 20,38 93.5,39 133.956,40 150.377,41 85.188,42 81.444,44 7.921}
{0 CHEMBL414478,1 7.438,2 36.1,3 46.3,4 1.015,5 1.141,6 0.633,7 0.613,8 1093.35,9 9.5,10 23,11 147,13 33,14 84,16 152,17 53,20 31,21 22,22 10,24 68,25 26,28 14,29 12,32 79,35 8.2,36 0.171,37 26,38 105.5,39 149.21,40 167.699,41 93.092,42 90.101,44 8.523}
{0 CHEMBL414533,1 7.73,2 34.8,3 46.2,4 1.015,5 1.139,6 0.645,7 0.617,8 1020.34,9 9.8,10 17,11 132,13 26,14 76,16 137,17 46,20 24,21 22,22 9,24 61,25 25,26 2,28 13,29 10,31 2,32 71,35 7.6,36 0.153,37 21,38 93.5,39 133.956,40 150.377,41 85.188,42 81.444,44 9.086}
{0 CHEMBL415073,1 7.554,2 38.9,3 46.7,4 1.009,5 1.132,6 0.653,7 0.622,8 679.89,9 5.6,10 18,11 90,13 24,14 51,16 93,17 35,20 22,21 13,22 6,23 1,24 42,25 13,26 1,28 5,29 6,31 1,32 48,34 1,35 6.7,36 0.151,37 14,38 66,39 90.85,40 101.896,41 58.807,42 55.975,43 1.1,44 8.114}
{0 CHEMBL415394,1 7.49,2 36.1,3 45.9,4 1.016,5 1.141,6 0.634,7 0.615,8 996.22,9 9.8,10 23,11 133,13 32,14 76,16 137,17 48,20 30,21 18,22 9,24 61,25 24,28 13,29 11,32 72,35 8.3,36 0.182,37 25,38 96.5,39 135.13,40 151.746,41 84.347,42 81.784,44 5}
{0 CHEMBL415875,1 7.693,2 44.3,3 45.5,4 0.994,5 1.113,6 0.698,7 0.649,8 676.97,9 4.5,10 33,11 88,13 36,14 53,16 93,17 39,20 29,21 10,22 3,24 40,25 9,26 2,28 4,29 3,31 2,32 48,35 3.4,36 0.118,37 11,38 72.5,39 87.447,40 97.935,41 61.387,42 57.087,44 5}
{0 CHEMBL417584,1 7.842,2 34.4,3 45.6,4 1.018,5 1.14,6 0.645,7 0.619,8 980.27,9 10.4,10 17,11 125,13 26,14 72,16 129,17 43,20 24,21 19,22 9,24 57,25 25,26 2,28 13,29 10,31 2,32 68,35 8,36 0.155,37 20,38 89.5,39 127.188,40 142.546,41 80.665,42 77.39,44 7.569}
{0 CHEMBL419073,1 7.808,2 41.4,3 45.5,4 1.006,5 1.123,6 0.676,7 0.638,8 773.04,9 4,10 29,11 99,13 34,14 58,16 103,17 41,20 29,21 12,22 5,23 1,24 45,25 13,26 2,28 4,29 6,31 2,32 54,34 1,35 6.1,36 0.165,37 17,38 77.5,39 99.592,40 111.149,41 66.972,42 63.195,43 1,44 8.301}
{0 CHEMBL421478,1 7.947,2 39.8,3 45.5,4 1.012,5 1.129,6 0.667,7 0.634,8 699.31,9 4.5,10 18,11 88,13 24,14 51,16 91,17 35,18 1,20 22,21 13,22 6,23 1,24 40,25 13,26 2,28 4,29 6,31 1,32 48,34 2,35 6.8,36 0.165,37 15,38 66,39 89.072,40 99.342,41 58.659,42 55.781,43 2.3,44 8.125}
{0 CHEMBL423236,1 7.338,2 46.6,3 45.2,4 0.998,5 1.112,6 0.678,7 0.644,8 535.68,9 1.4,10 24,11 73,13 26,14 44,16 77,17 34,20 26,21 8,22 2,24 33,25 6,28 1,29 5,32 40,35 6.8,36 0.13,37 10,38 58,39 72.876,40 81.189,41 49.461,42 47.024,44 6.824}
{0 CHEMBL424004,1 9.643,2 46,3 41.3,4 1.005,5 1.112,6 0.724,7 0.676,8 607.48,9 4.8,10 23,11 63,13 25,14 41,16 67,17 29,20 23,21 6,22 2,24 26,25 8,26 1,27 1,28 3,29 4,32 37,34 1,35 6.3,36 0.09,37 6,38 54.5,39 63.287,40 70.036,41 45.631,42 42.562,43 1.6,44 8.292}
{0 CHEMBL424755,1 7.171,2 33.8,3 48.6,4 1.013,5 1.145,6 0.619,7 0.596,8 1061.36,9 9.5,10 17,11 148,13 27,14 79,16 151,17 50,20 25,21 25,22 10,24 72,25 26,28 14,29 12,32 76,35 8.1,36 0.192,37 29,38 97.5,39 149.977,40 169.53,41 91.614,42 88.154,44 9.046}
{0 CHEMBL425077,1 7.247,2 36.5,3 47.6,4 1.011,5 1.139,6 0.632,7 0.607,8 913.16,9 7.9,10 18,11 126,13 26,14 70,16 130,17 46,20 26,21 20,22 8,24 60,25 20,28 10,29 10,32 66,35 7.9,36 0.162,37 21,38 87,39 127.381,40 143.457,41 79.637,42 76.532,44 7.275}
{0 CHEMBL426885,1 7.026,2 32.8,3 50,4 1.013,5 1.147,6 0.611,7 0.586,8 407.53,9 8.6,10 5,11 58,13 9,14 30,16 59,17 19,20 7,21 12,22 4,24 29,25 10,28 5,29 5,32 29,35 8.6,36 0.153,37 9,38 36.5,39 58.749,40 66.521,41 35.438,42 34.003,44 5.955}
{0 CHEMBL428986,1 7.367,2 36.5,3 46.7,4 1.013,5 1.139,6 0.634,7 0.612,8 1009.26,9 8.8,10 23,11 137,13 32,14 77,16 141,17 50,20 30,21 20,22 9,24 64,25 23,28 12,29 11,32 73,35 8,36 0.184,37 26,38 97.5,39 138.796,40 156.078,41 86.864,42 83.816,44 8.733}
{0 CHEMBL430792,1 7.51,2 39.6,3 46.9,4 1.009,5 1.13,6 0.654,7 0.622,8 720.94,9 4.2,10 23,11 96,13 28,14 54,16 99,17 38,20 24,21 14,22 5,23 1,24 45,25 13,26 1,28 4,29 7,31 1,32 51,34 1,35 7.3,36 0.192,37 19,38 70.5,39 96.843,40 108.438,41 62.779,42 59.722,43 1,44 8.301}
{0 CHEMBL430997,1 7.402,2 41.9,3 44.6,4 0.998,5 1.131,6 0.671,7 0.638,8 547.73,9 12.2,10 28,11 74,13 29,14 46,16 79,17 31,20 22,21 9,22 1,24 33,25 10,28 9,29 1,32 41,35 1.4,36 0.127,37 10,38 61,39 73.847,40 83.677,41 49.643,42 47.229,44 6}
{0 CHEMBL432095,1 7.338,2 40.2,3 48.6,4 0.997,5 1.122,6 0.667,7 0.62,8 785.13,9 3.7,10 23,11 107,13 29,14 59,16 111,17 43,20 26,21 17,22 6,24 52,25 12,26 2,28 4,29 6,31 2,32 55,35 5.6,36 0.171,37 19,38 76.5,39 106.73,40 120.054,41 71.319,42 66.392,44 7.337}
{0 CHEMBL432378,1 7.732,2 39.5,3 46.5,4 1.005,5 1.123,6 0.672,7 0.631,8 664.92,9 4.7,10 23,11 86,13 27,14 49,16 89,17 34,20 23,21 11,22 4,24 40,25 12,26 2,28 4,29 6,31 2,32 46,35 7,36 0.169,37 15,38 64.5,39 86.429,40 96.563,41 57.75,42 54.231,44 9.046}
{0 CHEMBL435811,1 8.14,2 38.6,3 44.3,4 1.018,5 1.132,6 0.663,7 0.636,8 716.3,9 5.7,10 18,11 88,13 24,14 52,16 91,17 34,18 1,20 22,21 12,22 6,23 1,24 39,25 15,26 2,28 5,29 7,31 1,32 49,34 2,35 8,36 0.165,37 15,38 67,39 89.618,40 99.635,41 58.358,42 55.991,43 2.3,44 8.745}
{0 CHEMBL436396,1 8.848,2 39.5,3 43.2,4 1.018,5 1.13,6 0.677,7 0.647,8 716.69,9 6.2,10 18,11 81,13 24,14 49,15 1,16 84,17 32,20 22,21 10,22 6,23 1,24 35,25 14,26 2,28 5,29 6,31 1,32 46,34 2,35 7.4,36 0.143,37 12,38 64,39 82.429,40 91.492,41 54.875,42 52.42,43 2.5,44 8.854}
{0 CHEMBL440063,1 7.768,2 34.4,3 46.1,4 1.016,5 1.14,6 0.644,7 0.617,8 1988.6,9 10.2,10 34,11 256,13 52,14 146,16 264,17 88,20 48,21 40,22 18,24 118,25 50,26 4,28 26,29 20,31 4,32 138,35 7.8,36 0.159,37 42,38 181,39 260.144,40 291.923,41 164.853,42 157.834,44 7.187}
{0 CHEMBL443325,1 7.73,2 34.8,3 46.2,4 1.015,5 1.139,6 0.645,7 0.617,8 2040.68,9 9.8,10 34,11 264,13 52,14 152,16 274,17 92,20 48,21 44,22 18,24 122,25 50,26 4,28 26,29 20,31 4,32 142,35 7.6,36 0.146,37 40,38 187,39 267.911,40 300.753,41 170.376,42 162.887,44 7.638}
{0 CHEMBL444065,1 8.14,2 38.6,3 44.3,4 1.018,5 1.132,6 0.663,7 0.636,8 716.3,9 5.7,10 18,11 88,13 24,14 52,16 91,17 34,18 1,20 22,21 12,22 6,23 1,24 39,25 15,26 2,28 5,29 7,31 1,32 49,34 2,35 8,36 0.165,37 15,38 67,39 89.618,40 99.635,41 58.358,42 55.991,43 2.3,44 8.387}
{0 CHEMBL467872,1 9.192,2 38.9,3 37.6,4 1.033,5 1.124,6 0.693,7 0.675,8 1369.61,9 8.1,10 41,11 149,13 49,14 104,16 160,17 58,20 37,21 21,22 8,24 56,25 35,26 5,28 12,29 18,31 5,32 93,35 12.1,36 0.106,37 17,38 132.5,39 153.934,40 167.483,41 103.239,42 100.648,44 5.951}
{0 CHEMBL499234,1 8.799,2 38.2,3 40,4 1.026,5 1.127,6 0.684,7 0.661,8 1451.78,9 8.5,10 41,11 165,13 49,14 111,16 177,17 63,20 37,21 26,22 8,24 66,25 36,26 5,28 14,29 17,31 5,32 99,35 10.3,36 0.096,37 17,38 139.5,39 169.345,40 185.931,41 112.841,42 109.084,44 6.991}
{0 CHEMBL504492,1 8.628,2 37.7,3 41.1,4 1.025,5 1.128,6 0.678,7 0.654,8 1509.87,9 8,10 41,11 175,13 49,14 115,16 187,17 66,20 37,21 29,22 8,24 72,25 37,26 5,28 14,29 18,31 5,32 103,35 10.3,36 0.118,37 22,38 143.5,39 179.323,40 197.386,41 118.58,42 114.379,44 5.295}
{0 CHEMBL505204,1 8.508,2 37.4,3 41.9,4 1.022,5 1.129,6 0.675,7 0.649,8 1522.92,9 8.4,10 41,11 179,13 49,14 116,16 191,17 67,20 37,21 30,22 8,24 75,25 37,26 5,28 15,29 17,31 5,32 104,35 9.5,36 0.115,37 22,38 144.5,39 182.981,40 202.09,41 120.893,42 116.212,44 6.071}
{0 CHEMBL506486,1 8.573,2 37.5,3 41.5,4 1.023,5 1.129,6 0.677,7 0.652,8 1508.89,9 8.5,10 41,11 176,13 49,14 115,16 188,17 66,20 37,21 29,22 8,24 73,25 37,26 5,28 15,29 17,31 5,32 103,35 9.7,36 0.112,37 21,38 143.5,39 180.098,40 198.675,41 119.131,42 114.685,44 8}
{0 CHEMBL507053,1 8.753,2 37.4,3 40.4,4 1.027,5 1.129,6 0.679,7 0.657,8 1496.83,9 8.8,10 41,11 171,13 50,14 113,16 182,17 64,20 38,21 26,22 9,24 69,25 38,26 5,28 15,29 18,31 5,32 102,35 10.5,36 0.121,37 22,38 142.5,39 175.658,40 193.054,41 116.063,42 112.347,44 7.108}
{0 CHEMBL508306,1 8.697,2 37.8,3 40.7,4 1.026,5 1.128,6 0.679,7 0.656,8 1495.84,9 8.1,10 41,11 172,13 49,14 114,16 184,17 65,20 37,21 28,22 8,24 70,25 37,26 5,28 14,29 18,31 5,32 102,35 10.5,36 0.114,37 21,38 142.5,39 176.439,40 193.971,41 116.819,42 112.852,44 6.585}
{0 CHEMBL508699,1 8.744,2 37.5,3 40.3,4 1.028,5 1.129,6 0.678,7 0.657,8 1538.87,9 8.5,10 41,11 176,13 50,14 117,16 188,17 66,20 38,21 28,22 9,24 71,25 39,26 5,28 15,29 19,31 5,32 105,35 10.8,36 0.117,37 22,38 146.5,39 180.869,40 198.679,41 119.279,42 115.588,44 6.602}
{0 CHEMBL510526,1 8.779,2 37.8,3 40.2,4 1.026,5 1.128,6 0.682,7 0.659,8 1439.77,9 8.5,10 41,11 164,13 49,14 109,16 175,17 62,20 37,21 25,22 8,24 66,25 36,26 5,28 14,29 17,31 5,32 98,35 10.4,36 0.114,37 20,38 137.5,39 168.345,40 184.931,41 111.841,42 108.084,44 6.721}
{0 CHEMBL535139,1 7.51,2 45.3,3 43.8,4 1,5 1.119,6 0.68,7 0.649,8 480.61,9 6.3,10 23,11 64,13 25,14 40,16 68,17 29,20 23,21 6,22 2,24 28,25 7,28 4,29 3,32 36,35 4.7,36 0.088,37 6,38 53.5,39 63.992,40 71.604,41 43.523,42 41.552,44 7.18}
{0 CHEMBL56448,1 7.196,2 32.5,3 48.8,4 1.016,5 1.148,6 0.613,7 0.592,8 885.12,9 9.8,10 11,11 123,13 20,14 65,16 125,17 40,20 18,21 22,22 9,24 60,25 23,28 12,29 11,32 63,35 8.9,36 0.192,37 24,38 79.5,39 125.028,40 141.248,41 75.342,42 72.763,44 8.759}
{0 CHEMBL58156,1 8.148,2 43.1,3 41.2,4 0.999,5 1.124,6 0.706,7 0.667,8 415.57,9 13.7,10 26,11 51,13 26,14 34,16 55,17 22,20 17,21 5,24 21,25 8,26 1,28 7,31 1,32 30,36 0.091,37 5,38 47,39 50.974,40 57.315,41 36.017,42 34.025,44 8.638}
{0 CHEMBL63998,1 8.041,2 37.9,3 45.5,4 1.01,5 1.125,6 0.674,7 0.635,8 530.73,9 6.1,10 17,11 66,13 21,14 38,16 68,17 25,20 17,21 8,22 4,24 30,25 11,26 2,28 4,29 5,31 2,32 36,35 7.6,36 0.162,37 11,38 50.5,39 66.683,40 74.278,41 44.489,42 41.882,44 6.111}
{0 CHEMBL69721,1 7.461,2 39.8,3 47.3,4 1.008,5 1.128,6 0.653,7 0.62,8 693.91,9 3.2,10 23,11 93,13 27,14 52,16 96,17 37,20 23,21 14,22 4,23 1,24 44,25 12,26 1,28 3,29 7,31 1,32 49,34 1,35 7.5,36 0.198,37 19,38 67.5,39 93.741,40 104.94,41 60.773,42 57.701,43 1.1,44 8.699}
{0 CHEMBL69733,1 7.187,2 38.6,3 50,4 1.003,5 1.129,6 0.644,7 0.606,8 503.09,9 2.9,10 12,11 70,13 13,14 38,16 73,17 27,18 1,20 13,21 14,22 1,24 35,25 8,26 1,28 2,29 5,32 35,34 1,35 7.1,36 0.137,37 10,38 45,39 70.185,40 79.046,41 45.086,42 42.4,43 1.4,44 5}
{0 CHEMBL69839,1 7.46,2 39.6,3 47.3,4 1.007,5 1.13,6 0.655,7 0.621,8 678.9,9 4.4,10 23,11 91,13 27,14 51,16 94,17 36,20 23,21 13,22 4,23 1,24 43,25 12,26 1,28 4,29 6,31 1,32 48,34 1,35 6.6,36 0.191,37 18,38 66.5,39 91.632,40 102.813,41 59.563,42 56.481,43 1.1,44 7.699}
{0 CHEMBL70100,1 7.778,2 45.5,3 43.4,4 1.003,5 1.113,6 0.688,7 0.654,8 769.98,9 3,10 35,11 99,13 40,14 61,16 104,17 45,20 36,21 9,22 5,24 43,25 11,26 1,28 3,29 7,31 1,32 56,35 7.1,36 0.173,37 18,38 83.5,39 99.345,40 110.185,41 68.074,42 64.791,44 8.678}
{0 CHEMBL70161,1 7.51,2 40.4,3 46.8,4 1.008,5 1.127,6 0.657,7 0.624,8 705.92,9 3.2,10 23,11 94,13 28,14 53,16 97,17 38,20 24,21 14,22 5,23 1,24 44,25 12,26 1,28 3,29 7,31 1,32 50,34 1,35 7.4,36 0.196,37 19,38 69.5,39 94.741,40 105.94,41 61.773,42 58.701,43 1.1,44 8.301}
{0 CHEMBL70353,1 7.635,2 46.3,3 42.5,4 1,5 1.118,6 0.688,7 0.658,8 610.77,9 7.5,10 34,11 80,13 36,14 51,16 85,17 37,20 30,21 7,22 2,24 34,25 9,28 6,29 3,32 46,35 3.8,36 0.153,37 13,38 70,39 79.963,40 89.431,41 55.057,42 52.648,44 6.523}
{0 CHEMBL70370,1 7.374,2 39.6,3 47.9,4 1.007,5 1.129,6 0.651,7 0.617,8 707.94,9 3.1,10 23,11 96,13 27,14 53,16 99,17 38,20 23,21 15,22 4,23 1,24 46,25 12,26 1,28 3,29 7,31 1,32 50,34 1,35 7.3,36 0.202,37 20,38 68.5,39 96.625,40 108.355,41 62.535,42 59.228,43 1,44 8.699}
{0 CHEMBL70389,1 7.635,2 41.7,3 43.1,4 1.004,5 1.132,6 0.671,7 0.645,8 549.7,9 12.5,10 28,11 72,13 29,14 46,16 77,17 30,20 22,21 8,22 1,24 31,25 11,28 9,29 2,32 41,35 2.8,36 0.117,37 9,38 61,39 72.29,40 81.471,41 48.336,42 46.417,44 6.301}
{0 CHEMBL70638,1 7.482,2 44,3 44,4 0.999,5 1.124,6 0.677,7 0.646,8 680.88,9 8.8,10 34,11 91,13 36,14 57,16 97,17 40,20 30,21 10,22 2,24 40,25 11,28 8,29 3,32 51,35 3.3,36 0.124,37 12,38 76,39 90.934,40 102.258,41 61.591,42 58.744,44 6}
{0 CHEMBL70726,1 7.89,2 43.5,3 43.5,4 1.011,5 1.121,6 0.677,7 0.648,8 725.9,9 3.3,10 29,11 92,13 34,14 56,16 96,17 40,20 30,21 10,22 5,23 1,24 40,25 12,26 1,28 3,29 7,31 1,32 52,34 1,35 7.6,36 0.177,37 17,38 75.5,39 92.974,40 103.109,41 62.25,42 59.647,43 1.1,44 8.796}
{0 CHEMBL70770,1 7.502,2 39.1,3 44.9,4 1.009,5 1.135,6 0.652,7 0.628,8 517.65,9 10.1,10 22,11 69,13 24,14 41,16 72,17 27,20 18,21 9,22 2,24 31,25 11,28 7,29 4,32 38,35 5.8,36 0.153,37 11,38 54,39 69.625,40 78.308,41 44.995,42 43.331,44 5.398}
{0 CHEMBL70789,1 7.554,2 40,3 46.7,4 1.01,5 1.128,6 0.656,7 0.624,8 679.88,9 3.3,10 23,11 90,13 27,14 51,16 93,17 36,20 23,21 13,22 4,23 1,24 42,25 12,26 1,28 3,29 7,31 1,32 48,34 1,35 7.8,36 0.183,37 17,38 66.5,39 90.858,40 101.524,41 59.012,42 56.174,43 1.1,44 9}
{0 CHEMBL70793,1 7.562,2 42.7,3 45.8,4 1.004,5 1.122,6 0.67,7 0.635,8 725.95,9 3.1,10 29,11 96,13 33,14 56,16 100,17 41,20 29,21 12,22 4,23 1,24 44,25 11,26 1,28 3,29 6,31 1,32 52,34 1,35 6.3,36 0.17,37 17,38 74.5,39 96.414,40 107.73,41 64.319,42 60.986,43 1,44 8.046}
{0 CHEMBL70796,1 7.295,2 42.9,3 45.5,4 0.997,5 1.126,6 0.67,7 0.636,8 561.75,9 9.1,10 28,11 77,13 29,14 47,16 82,17 33,20 23,21 10,22 1,24 35,25 9,28 7,29 2,32 42,35 2.6,36 0.122,37 10,38 62,39 76.738,40 86.72,41 51.608,42 48.955,44 6.398}
{0 CHEMBL70801,1 7.574,2 42.3,3 43.6,4 1.004,5 1.128,6 0.671,7 0.643,8 590.75,9 10.3,10 28,11 78,13 30,14 49,16 83,17 33,20 24,21 9,22 2,24 34,25 11,28 8,29 3,32 44,35 3.8,36 0.12,37 10,38 65,39 78.283,40 88.012,41 52.307,42 50.164,44 5}
{0 CHEMBL70843,1 7.781,2 40.6,3 44.8,4 1.013,5 1.127,6 0.661,7 0.634,8 746.93,9 4.2,10 23,11 96,13 29,14 57,16 100,17 39,20 25,21 14,22 6,23 1,24 43,25 14,26 1,28 4,29 8,31 1,32 53,34 1,35 8.3,36 0.18,37 18,38 74.5,39 97.287,40 108.232,41 63.472,42 60.91,43 1,44 8.523}
{0 CHEMBL70867,1 7.69,2 42,3 45,4 1.008,5 1.124,6 0.668,7 0.637,8 768.98,9 4,10 29,11 100,13 34,14 59,16 104,17 42,20 30,21 12,22 5,23 1,24 45,25 13,26 1,28 4,29 7,31 1,32 55,34 1,35 7,36 0.173,37 18,38 78.5,39 100.843,40 112.438,41 66.779,42 63.722,43 1,44 9}
{0 CHEMBL70868,1 7.127,2 38.7,3 49.5,4 1.002,5 1.131,6 0.645,7 0.607,8 791.09,9 3.6,10 23,11 111,13 28,14 59,16 114,17 43,20 24,21 19,22 5,23 1,24 55,25 13,26 1,28 4,29 7,31 1,32 56,34 1,35 6.3,36 0.202,37 23,38 75.5,39 111.261,40 125.514,41 71.586,42 67.356,43 0.9,44 8.301}
{0 CHEMBL70935,1 7.703,2 40.9,3 45.5,4 1.011,5 1.126,6 0.662,7 0.632,8 677.86,9 3.4,10 23,11 88,13 28,14 51,16 91,17 36,20 24,21 12,22 5,23 1,24 40,25 12,26 1,28 3,29 7,31 1,32 48,34 1,35 8,36 0.187,37 17,38 67.5,39 88.974,40 99.109,41 58.25,42 55.647,43 1.1,44 8.699}
{0 CHEMBL71069,1 7.691,2 42.6,3 44.7,4 1.006,5 1.12,6 0.674,7 0.641,8 722.93,9 4.3,10 29,11 94,13 34,14 56,16 98,17 40,20 30,21 10,22 5,24 42,25 12,26 1,28 4,29 7,31 1,32 52,35 7.4,36 0.163,37 16,38 75.5,39 94.563,40 105.268,41 63.319,42 60.285,44 7}
{0 CHEMBL71125,1 7.959,2 45.5,3 42.4,4 1.009,5 1.116,6 0.687,7 0.658,8 787.97,9 3,10 35,11 99,13 40,14 62,16 104,17 45,20 36,21 9,22 5,23 1,24 42,25 12,26 1,28 3,29 7,31 1,32 57,34 1,35 7.1,36 0.173,37 18,38 84.5,39 99.858,40 110.524,41 68.012,42 65.174,43 1,44 9.161}
{0 CHEMBL71172,1 7.789,2 43.2,3 44.2,4 1.009,5 1.121,6 0.674,7 0.644,8 739.93,9 3.2,10 29,11 95,13 34,14 57,16 99,17 41,20 30,21 11,22 5,23 1,24 42,25 12,26 1,28 3,29 7,31 1,32 53,34 1,35 7.4,36 0.182,37 18,38 76.5,39 95.858,40 106.524,41 64.012,42 61.174,43 1.1,44 9.046}
{0 CHEMBL71220,1 7.693,2 42.9,3 44.9,4 1.008,5 1.122,6 0.671,7 0.64,8 753.96,9 3.1,10 29,11 98,13 34,14 58,16 102,17 42,20 30,21 12,22 5,23 1,24 44,25 12,26 1,28 3,29 7,31 1,32 54,34 1,35 7.1,36 0.176,37 18,38 77.5,39 98.741,40 109.94,41 65.773,42 62.701,43 1,44 9.046}
{0 CHEMBL71286,1 8.091,2 42.5,3 43.7,4 1.01,5 1.12,6 0.686,7 0.65,8 703.92,9 3.4,10 28,11 87,13 32,14 53,16 91,17 37,20 27,21 10,22 4,23 1,24 38,25 12,26 2,28 3,29 6,31 2,32 49,34 1,35 6.9,36 0.176,37 16,38 71,39 87.84,40 97.405,41 59.682,42 56.593,43 1.1,44 7.699}
{0 CHEMBL71639,1 7.634,2 39.8,3 47.3,4 1.005,5 1.125,6 0.666,7 0.626,8 709.98,9 3.2,10 23,11 93,13 27,14 52,16 96,17 37,20 23,21 14,22 4,23 1,24 44,25 12,26 2,28 3,29 6,31 2,32 49,34 1,35 6.5,36 0.198,37 19,38 67.5,39 93.49,40 104.65,41 61.966,42 58.173,43 1.1,44 8.699}
{0 CHEMBL71953,1 6.641,2 38.1,3 51.2,4 0.991,5 1.135,6 0.639,7 0.596,8 557.82,9 8.3,10 22,11 84,13 23,14 44,16 87,17 32,20 17,21 15,22 1,24 43,25 9,28 7,29 2,32 41,35 2.4,36 0.195,37 17,38 56,39 83.272,40 95.381,41 53.654,42 50.062,44 6.699}
{0 CHEMBL72099,1 7.744,2 42.6,3 44.7,4 1.009,5 1.123,6 0.67,7 0.64,8 727.92,9 3.2,10 29,11 94,13 33,14 56,16 98,17 40,20 29,21 11,22 4,23 1,24 42,25 12,26 1,28 3,29 7,31 1,32 52,34 1,35 7.4,36 0.184,37 18,38 74.5,39 94.858,40 105.524,41 63.012,42 60.174,43 1.1,44 8.523}
{0 CHEMBL72249,1 7.635,2 46.3,3 42.5,4 1,5 1.118,6 0.688,7 0.658,8 610.77,9 7.5,10 34,11 80,13 36,14 51,16 85,17 37,20 30,21 7,22 2,24 34,25 9,28 6,29 3,32 46,35 3.8,36 0.153,37 13,38 70,39 79.963,40 89.431,41 55.057,42 52.648,44 6}
{0 CHEMBL72409,1 7.234,2 40.8,3 46.1,4 0.996,5 1.133,6 0.663,7 0.628,8 549.75,9 11.8,10 28,11 76,13 28,14 46,16 81,17 31,20 21,21 10,24 35,25 10,28 9,29 1,32 41,35 1.3,36 0.123,37 10,38 60,39 75.73,40 86.092,41 50.404,42 47.756,44 5}
{0 CHEMBL72595,1 7.789,2 43.2,3 44.2,4 1.009,5 1.121,6 0.674,7 0.644,8 739.93,9 3.2,10 29,11 95,13 34,14 57,16 99,17 41,20 30,21 11,22 5,23 1,24 42,25 12,26 1,28 3,29 7,31 1,32 53,34 1,35 7.4,36 0.172,37 17,38 76.5,39 95.858,40 106.524,41 64.012,42 61.174,43 1.1,44 9}
{0 CHEMBL72721,1 7.407,2 41,3 44.9,4 1.001,5 1.132,6 0.665,7 0.634,8 577.76,9 11.5,10 28,11 78,13 29,14 48,16 83,17 32,20 22,21 10,22 1,24 35,25 11,28 9,29 2,32 43,35 2.6,36 0.133,37 11,38 63,39 78.058,40 88.301,41 51.858,42 49.471,44 6.155}
{0 CHEMBL72819,1 7.803,2 42.5,3 43.7,4 1.005,5 1.122,6 0.68,7 0.647,8 678.88,9 6.9,10 29,11 87,13 33,14 54,16 92,17 37,20 28,21 9,22 4,24 38,25 12,26 1,28 6,29 5,31 1,32 49,35 5.7,36 0.13,37 12,38 72.5,39 87.461,40 97.6,41 59.137,42 56.318,44 6.301}
{0 CHEMBL73283,1 7.898,2 41.8,3 44.9,4 1.008,5 1.121,6 0.678,7 0.642,8 774.02,9 3.1,10 29,11 98,13 34,14 58,16 102,17 41,20 29,21 12,22 5,23 1,24 44,25 13,26 2,28 3,29 7,31 2,32 54,34 1,35 7.1,36 0.176,37 18,38 77.5,39 98.818,40 109.86,41 66.421,42 62.888,43 1,44 8.699}
{0 CHEMBL73369,1 7.736,2 46.4,3 41.7,4 1.001,5 1.118,6 0.691,7 0.663,8 649.81,9 8.3,10 34,11 84,13 37,14 54,16 89,17 39,19 2,20 30,21 7,22 2,24 35,25 10,28 7,29 3,32 49,33 1,35 3.6,36 0.135,37 12,38 75,39 84.065,40 93.929,41 58.063,42 55.669,44 6.222}
{0 CHEMBL73780,1 7.738,2 44.4,3 42,4 1.003,5 1.124,6 0.683,7 0.656,8 626.78,9 9.9,10 34,11 81,13 36,14 52,16 86,17 36,20 30,21 6,22 2,24 34,25 11,28 8,29 3,32 47,35 3.7,36 0.14,37 12,38 71,39 81.283,40 91.012,41 55.307,42 53.164,44 6.523}
{0 CHEMBL73876,1 7.81,2 40,3 44.7,4 1.013,5 1.13,6 0.662,7 0.634,8 663.84,9 5.9,10 18,11 85,13 24,14 51,16 89,17 34,20 22,21 12,22 6,23 1,24 38,25 13,26 1,28 5,29 6,31 1,32 47,34 1,35 7.1,36 0.135,37 12,38 66,39 86.083,40 96.066,41 56.284,42 53.922,43 1.2,44 8.208}
{0 CHEMBL74069,1 7.871,2 41.9,3 45.2,4 1.007,5 1.121,6 0.68,7 0.641,8 731.98,9 3.2,10 28,11 93,13 32,14 55,16 97,17 39,20 27,21 12,22 4,23 1,24 42,25 12,26 2,28 3,29 6,31 2,32 51,34 1,35 6.5,36 0.175,37 17,38 73,39 93.607,40 104.235,41 63.205,42 59.646,43 1.1,44 8.523}
{0 CHEMBL74113,1 7.632,2 45.1,3 42.7,4 1.001,5 1.121,6 0.684,7 0.655,8 625.79,9 8.5,10 34,11 82,13 36,14 52,16 87,17 37,20 30,21 7,22 2,24 35,25 10,28 7,29 3,32 47,35 3.7,36 0.149,37 13,38 71,39 82.065,40 91.929,41 56.063,42 53.669,44 6.398}
{0 CHEMBL74144,1 8.193,2 42.7,3 41.5,4 1.016,5 1.125,6 0.68,7 0.657,8 671.81,9 6.1,10 24,11 82,13 30,14 52,16 86,17 35,20 27,21 8,22 6,23 1,24 34,25 13,26 1,28 5,29 6,31 1,32 48,34 1,35 7.3,36 0.14,37 12,38 70,39 83.316,40 92.236,41 55.762,42 53.868,43 1.2,44 7.432}
{0 CHEMBL74236,1 7.871,2 41.9,3 45.2,4 1.007,5 1.121,6 0.68,7 0.641,8 731.98,9 3.2,10 28,11 93,13 32,14 55,16 97,17 39,20 27,21 12,22 4,23 1,24 42,25 12,26 2,28 3,29 6,31 2,32 51,34 1,35 6.5,36 0.175,37 17,38 73,39 93.607,40 104.235,41 63.205,42 59.646,43 1.1,44 7.699}
{0 CHEMBL74442,1 7.654,2 39.1,3 46,4 1.011,5 1.132,6 0.656,7 0.626,8 665.86,9 5.7,10 18,11 87,13 24,14 50,16 90,17 34,20 22,21 12,22 6,23 1,24 40,25 13,26 1,28 5,29 6,31 1,32 47,34 1,35 6.9,36 0.133,37 12,38 65,39 87.967,40 98.481,41 57.046,42 54.449,43 1.1,44 8.036}
{0 CHEMBL74476,1 7.354,2 38.9,3 47.8,4 1.004,5 1.128,6 0.654,7 0.618,8 661.9,9 5.6,10 18,11 90,13 24,14 50,16 93,17 35,20 22,21 13,22 6,24 43,25 12,26 1,28 5,29 6,31 1,32 47,35 6.7,36 0.151,37 14,38 65,39 90.338,40 101.557,41 58.87,42 55.592,44 7.222}
{0 CHEMBL74514,1 7.693,2 42.9,3 44.9,4 1.008,5 1.122,6 0.671,7 0.64,8 753.96,9 3.1,10 29,11 98,13 34,14 58,16 102,17 42,20 30,21 12,22 5,23 1,24 44,25 12,26 1,28 3,29 7,31 1,32 54,34 1,35 7.1,36 0.176,37 18,38 77.5,39 98.741,40 109.94,41 65.773,42 62.701,43 1,44 8.523}
{0 CHEMBL74556,1 7.462,2 38.7,3 47.3,4 1.008,5 1.132,6 0.651,7 0.618,8 693.92,9 5.4,10 18,11 93,13 24,14 52,16 96,17 36,20 22,21 14,22 6,23 1,24 44,25 13,26 1,28 5,29 6,31 1,32 49,34 1,35 6.5,36 0.146,37 14,38 67,39 93.734,40 105.312,41 60.569,42 57.502,43 1.1,44 8.097}
{0 CHEMBL74573,1 7.693,2 42.9,3 44.9,4 1.008,5 1.122,6 0.671,7 0.64,8 753.96,9 3.1,10 29,11 98,13 34,14 58,16 102,17 42,20 30,21 12,22 5,23 1,24 44,25 12,26 1,28 3,29 7,31 1,32 54,34 1,35 7.1,36 0.176,37 18,38 77.5,39 98.741,40 109.94,41 65.773,42 62.701,43 1,44 9.155}
{0 CHEMBL75401,1 7.76,2 39.3,3 45.2,4 1.013,5 1.132,6 0.658,7 0.63,8 651.83,9 6,10 18,11 84,13 24,14 49,16 87,17 33,20 22,21 11,22 6,23 1,24 38,25 13,26 1,28 5,29 6,31 1,32 46,34 1,35 7.1,36 0.126,37 11,38 64,39 85.083,40 95.066,41 55.284,42 52.922,43 1.2,44 7.903}
{0 CHEMBL7550,1 7.584,2 44.4,3 42.6,4 0.996,5 1.126,6 0.688,7 0.655,8 409.54,9 13,10 27,11 54,13 27,14 35,16 58,17 24,20 19,21 5,24 23,25 7,28 7,32 31,36 0.086,37 5,38 48.5,39 53.781,40 60.81,41 37.131,42 35.364,44 9.699}
{0 CHEMBL76525,1 7.895,2 37.7,3 46.4,4 1.008,5 1.126,6 0.67,7 0.629,8 544.76,9 5.8,10 17,11 69,13 21,14 39,16 71,17 26,20 17,21 9,22 4,24 32,25 11,26 2,28 4,29 5,31 2,32 37,35 7.2,36 0.169,37 12,38 51.5,39 69.567,40 77.693,41 46.25,42 43.409,44 6.036}
{0 CHEMBL76821,1 7.81,2 40,3 44.7,4 1.013,5 1.13,6 0.662,7 0.634,8 663.84,9 5.9,10 18,11 85,13 25,14 50,16 88,17 34,20 24,21 10,22 7,23 1,24 38,25 13,26 1,28 5,29 6,31 1,32 47,34 1,35 7.1,36 0.125,37 11,38 66,39 86.083,40 96.066,41 56.284,42 53.922,43 1.2,44 8.032}
{0 CHEMBL77029,1 7.973,2 45.5,3 40,4 1.006,5 1.122,6 0.692,7 0.669,8 438.53,9 10.9,10 28,11 55,13 29,14 37,16 59,17 25,20 21,21 4,22 1,24 22,25 8,28 6,29 2,32 33,35 3.6,36 0.119,37 7,38 52,39 55.334,40 61.73,41 38.034,42 36.772,44 8.347}
{0 CHEMBL80370,1 7.895,2 37.7,3 46.4,4 1.008,5 1.126,6 0.67,7 0.629,8 544.76,9 5.8,10 17,11 69,13 21,14 39,16 71,17 26,20 17,21 9,22 4,24 32,25 11,26 2,28 4,29 5,31 2,32 37,35 7.2,36 0.169,37 12,38 51.5,39 69.567,40 77.693,41 46.25,42 43.409,44 6.036}
{0 CHEMBL81236,1 7.476,2 37.2,3 48.8,4 1.004,5 1.128,6 0.657,7 0.613,8 642.92,9 4.7,10 17,11 86,13 21,14 47,16 89,17 32,20 17,21 15,22 4,24 42,25 12,26 2,28 4,29 6,31 2,32 44,35 7,36 0.146,37 13,38 59.5,39 86.312,40 96.978,41 56.512,42 52.758,44 8.721}
{0 CHEMBL86067,1 8.279,2 43.1,3 43.1,4 1.008,5 1.117,6 0.696,7 0.658,8 538.11,9 4.6,10 23,11 65,13 26,14 40,16 68,17 28,18 1,20 22,21 6,22 3,24 28,25 9,26 2,28 3,29 4,31 1,32 37,34 1,35 6.2,36 0.147,37 10,38 54.5,39 65.502,40 72.594,41 45.239,42 42.786,43 1.5,44 6.854}
{0 CHEMBL86617,1 8.103,2 37.2,3 45.3,4 1.022,5 1.14,6 0.655,7 0.627,8 696.89,9 4.7,10 17,11 86,13 21,14 50,16 89,17 32,20 17,21 15,22 4,23 3,24 39,25 15,26 2,28 4,29 6,31 2,32 47,34 3,35 7,36 0.146,37 13,38 62.5,39 87.85,40 97.998,41 56.324,42 53.908,43 3.5,44 8.252}
{0 CHEMBL88446,1 8.154,2 42.9,3 42.9,4 1.008,5 1.116,6 0.693,7 0.657,8 684.9,9 4.8,10 29,11 84,13 33,14 52,16 88,17 36,20 29,21 7,22 4,24 36,25 12,26 2,28 4,29 6,31 2,32 48,35 7.1,36 0.148,37 13,38 70.5,39 84.661,40 93.733,41 58.228,42 55.177,44 8.678}
{0 CHEMBL89052,1 8.139,2 41,3 43.6,4 1.01,5 1.119,6 0.685,7 0.649,8 634.84,9 5.1,10 23,11 78,13 28,14 47,16 81,17 32,20 25,21 7,22 5,24 34,25 12,26 2,28 4,29 6,31 2,32 44,35 7.7,36 0.16,37 13,38 63.5,39 78.778,40 87.318,41 53.466,42 50.651,44 8.301}
{0 CHEMBL89053,1 8.034,2 42.5,3 43.7,4 1.006,5 1.117,6 0.69,7 0.652,8 698.93,9 4.6,10 29,11 87,13 33,14 53,16 91,17 37,20 29,21 8,22 4,24 38,25 12,26 2,28 4,29 6,31 2,32 49,35 6.9,36 0.154,37 14,38 71.5,39 87.545,40 97.148,41 59.989,42 56.704,44 8.959}
{0 CHEMBL89463,1 8.188,2 39.2,3 43,4 1.01,5 1.127,6 0.684,7 0.649,8 646.87,9 10.1,10 28,11 79,13 31,14 49,16 83,17 31,20 23,21 8,22 3,24 34,25 14,26 2,28 8,29 4,31 2,32 45,35 5.1,36 0.157,37 13,38 66,39 79.763,40 89.062,41 54.057,42 51.253,44 8.097}
{0 CHEMBL89769,1 8.277,2 41.3,3 42.7,4 1.012,5 1.119,6 0.689,7 0.655,8 620.81,9 5.3,10 23,11 75,13 28,14 46,16 78,17 31,20 24,21 7,22 5,24 32,25 12,26 2,28 4,29 6,31 2,32 43,35 8,36 0.167,37 13,38 62.5,39 75.894,40 83.902,41 51.705,42 49.124,44 7.42}
{0 CHEMBL91,1 10.67,2 46.2,3 35.9,4 1.023,5 1.11,6 0.769,7 0.725,8 416.14,9 5.1,10 17,11 39,13 17,14 27,16 41,17 18,18 4,20 15,21 3,24 14,25 7,26 4,28 2,29 1,32 25,34 4,35 2.6,36 0.146,37 6,38 35.5,39 39.895,40 43.304,41 29.989,42 28.282,43 10.3,44 4.62}
{0 CHEMBL938,1 7.017,2 32.3,3 50,4 1.012,5 1.149,6 0.611,7 0.586,8 912.2,9 10,10 11,11 130,13 20,14 67,16 132,17 42,20 18,21 24,22 9,24 65,25 23,28 13,29 10,32 65,35 7.7,36 0.189,37 25,38 81.5,39 131.57,40 149.367,41 79.416,42 76.123,44 9.347}
{0 CHEMBL96314,1 8.786,2 43.4,3 39.8,4 1.026,5 1.134,6 0.687,7 0.668,8 729.25,9 4.8,10 24,11 83,13 29,14 54,16 87,17 36,18 1,20 27,21 9,22 5,23 4,24 33,25 14,26 2,28 4,29 4,31 1,32 50,34 5,35 4.8,36 0.138,37 12,38 71,39 85.189,40 94.112,41 57.04,42 55.448,43 6,44 6.854}
{0 CHEMBL96554,1 7.824,2 39.5,3 45.3,4 1.017,5 1.138,6 0.654,7 0.628,8 672.84,9 4.7,10 18,11 86,13 23,14 50,16 89,17 34,20 21,21 13,22 5,23 3,24 39,25 13,26 1,28 4,29 5,31 1,32 47,34 3,35 5.8,36 0.146,37 13,38 64,39 87.447,40 97.868,41 56.222,42 54.006,43 3.5,44 6.569}
{0 CHEMBL995,1 7.98,2 41.5,3 43.4,4 1.004,5 1.13,6 0.683,7 0.649,8 422.96,9 11.3,10 22,11 53,13 22,14 33,16 56,17 22,18 1,20 16,21 6,24 23,25 8,26 1,28 6,29 1,32 30,34 1,35 1.9,36 0.143,37 8,38 44,39 53.214,40 59.88,41 36.199,42 34.412,43 1.9,44 5}
