"molecule_id","AMW","H.","pXC50"
{1 6.163,2 56.4,3 7.34}
{0 CHEMBL255034,1 6.108,2 56.8,3 6.95}
{0 CHEMBL494249,1 6.429,2 54.3,3 7.21}
{0 CHEMBL549300,1 6.035,2 57.1,3 5.59}
{0 CHEMBL549789,1 6.035,2 57.1,3 8.889}
{0 CHEMBL558256,1 5.646,2 59.7,3 4.05}
{0 CHEMBL559048,1 5.779,2 59,3 7.23}
{0 CHEMBL559941,1 5.646,2 59.7,3 6.1}
{0 CHEMBL560194,1 5.51,2 60.5,3 4.38}
{0 CHEMBL560796,1 5.646,2 59.7,3 5.02}
{0 CHEMBL561275,1 5.394,2 61.5,3 4.38}
{0 CHEMBL562711,1 5.779,2 59,3 4.84}
{0 CHEMBL564474,1 5.779,2 59,3 4.41}
{0 CHEMBL564892,1 5.779,2 59,3 6.49}
{0 CHEMBL564971,1 6.163,2 56.4,3 7.04}
