"molecule_id","GATS1s","GATS1e","PDI","SaasC","MATS1s","GATS7s","MAXDN","SaaCH","CATS2D_06_AL","SpMax1_Bh.s.","SpMax2_Bh.s.","Eta_betaP_A","SpMAD_EA.dm.","C.040","C.","P_VSA_s_5","StN","DLS_04","NNRS","P_VSA_MR_6","AAC","BIC0","BIC1","GATS1m","GATS1v","H.","IC0","JGI4","Mi","Mv","SIC0","SIC1","C.017","nCsp","nRCN","nR.Ct","nTB","NtN","NtsC","MATS5i","Eta_C_A","Eta_FL_A","Eta_L_A","Mp","GATS1p","CATS2D_04_AA","SdssC","C.016","Eig02_EA.dm.","Eta_betaP","nCconj","NdssC","nR.Cs","Eig01_AEA.ed.","Eig01_EA.ed.","SM10_AEA.dm.","SpMax_AEA.ed.","SpMax_EA.ed.","CIC1","O.","nCs","pXC50"
{1 1.787,2 1.463,3 0.857,5 -0.21,6 0.855,7 0.376,10 4.418,11 4.256,13 0.114,15 30.9,18 0.3,20 25.189,21 0.994,22 0.164,23 0.221,24 1.521,25 1.596,26 67.6,27 0.994,28 0.013,29 1.145,30 0.498,31 0.163,32 0.22,40 -0.004,41 1.369,42 0.035,43 0.445,44 0.576,45 1.645,54 6.394,55 9.951,56 9.951,57 6.394,58 9.951,59 4.748,61 16,62 5.502}
{0 CHEMBL109566,1 1.805,2 1.462,3 0.853,5 -0.225,6 0.856,7 0.283,10 4.404,11 4.239,13 0.126,15 30.6,18 0.3,20 16.793,21 1,22 0.169,23 0.241,24 1.524,25 1.606,26 67.7,27 1,28 0.013,29 1.145,30 0.497,31 0.168,32 0.24,40 -0.057,41 1.35,42 0.038,43 0.443,44 0.574,45 1.66,54 6.702,55 10.862,56 10.862,57 6.702,58 10.862,59 4.526,61 13,62 5.053}
{0 CHEMBL109737,1 1.566,2 1.265,3 0.86,5 -0.047,6 0.878,7 0.24,9 1,10 4.349,11 4.225,13 0.114,15 30.4,18 0.3,20 16.793,21 1.026,22 0.187,23 0.258,24 1.497,25 1.603,26 67.4,27 1.026,28 0.015,29 1.146,30 0.498,31 0.186,32 0.257,40 -0.009,41 1.167,42 0.044,43 0.441,44 0.574,45 1.663,54 4.659,55 5.184,56 5.184,57 4.659,58 5.184,59 4.104,61 10,62 4.83}
{0 CHEMBL109747,1 1.826,2 1.46,3 0.849,5 -0.242,6 0.858,7 0.377,10 4.417,11 4.241,13 0.141,15 30.4,18 0.3,20 25.189,21 1.005,22 0.174,23 0.241,24 1.526,25 1.618,26 67.9,27 1.005,28 0.017,29 1.146,30 0.496,31 0.173,32 0.24,40 -0.007,41 1.274,42 0.043,43 0.432,44 0.573,45 1.679,54 6.394,55 9.951,56 9.951,57 6.394,58 9.951,59 4.414,61 12,62 5.014}
{0 CHEMBL109819,1 1.58,2 1.532,3 0.863,5 -0.172,6 0.983,7 0.63,10 5.007,11 4.224,15 29.4,18 0.3,21 1.05,22 0.208,23 0.319,24 1.543,25 1.55,26 67.6,27 1.05,28 0.011,29 1.149,30 0.495,31 0.206,32 0.316,40 -0.019,41 1.051,42 0.027,43 0.465,44 0.57,45 1.553,54 3.902,55 3.792,56 3.792,57 3.902,58 3.792,59 3.478,61 8,62 4.475}
{0 CHEMBL109873,1 1.85,2 1.458,3 0.843,5 -0.263,6 0.866,7 0.378,10 4.416,11 4.231,13 0.16,15 30,18 0.3,20 25.189,21 1.012,22 0.18,23 0.254,24 1.529,25 1.634,26 68,27 1.012,28 0.02,29 1.147,30 0.494,31 0.179,32 0.252,40 -0.009,41 1.219,42 0.049,43 0.424,44 0.571,45 1.703,54 6.394,55 9.951,56 9.951,57 6.394,58 9.951,59 4.219,61 10,62 4.787}
{0 CHEMBL109904,1 1.572,2 1.528,3 0.868,5 -0.158,6 0.882,7 0.628,10 5.007,11 4.238,15 30,18 0.3,21 1.037,22 0.196,23 0.291,24 1.537,25 1.541,26 67.5,27 1.037,28 0.009,29 1.147,30 0.497,31 0.195,32 0.289,40 -0.012,41 1.127,42 0.023,43 0.47,44 0.573,45 1.544,54 3.932,55 3.856,56 3.856,57 3.932,58 3.856,59 3.783,61 10,62 4.889}
{0 CHEMBL109914,1 1.796,2 1.462,3 0.855,5 -0.217,6 0.855,7 0.189,10 4.393,11 4.238,13 0.12,15 30.8,18 0.3,21 0.997,22 0.166,23 0.236,24 1.522,25 1.601,26 67.7,27 0.997,28 0.012,29 1.145,30 0.498,31 0.166,32 0.236,40 -0.014,41 1.422,42 0.037,43 0.451,44 0.575,45 1.653,54 7.172,55 12.409,56 12.409,57 7.172,58 12.409,59 4.604,61 12,62 5.073}
{0 CHEMBL110011,1 1.566,2 1.525,3 0.872,5 -0.147,6 0.828,7 0.628,10 5.007,11 4.248,15 30.4,18 0.3,21 1.026,22 0.187,23 0.27,24 1.532,25 1.536,26 67.4,27 1.026,28 0.007,29 1.146,30 0.498,31 0.186,32 0.268,40 -0.009,41 1.193,42 0.02,43 0.474,44 0.574,45 1.538,54 3.95,55 3.895,56 3.895,57 3.95,58 3.895,59 4.041,61 12,62 4.694}
{0 CHEMBL110012,1 1.554,2 1.519,3 0.879,5 -0.124,6 0.765,7 0.626,10 5.007,11 4.271,15 31.3,18 0.2,21 1.004,22 0.168,23 0.228,24 1.523,25 1.525,26 67.2,27 1.004,28 0.005,29 1.144,30 0.501,31 0.167,32 0.227,40 -0.004,41 1.349,42 0.014,43 0.482,44 0.578,45 1.526,54 3.975,55 3.949,56 3.949,57 3.975,58 3.949,59 4.636,61 18,62 4}
{0 CHEMBL110310,1 1.566,2 1.525,3 0.872,5 -0.147,6 0.828,7 0.628,10 5.007,11 4.248,15 30.4,18 0.3,21 1.026,22 0.187,23 0.27,24 1.532,25 1.536,26 67.4,27 1.026,28 0.007,29 1.146,30 0.498,31 0.186,32 0.268,40 -0.009,41 1.193,42 0.02,43 0.474,44 0.574,45 1.538,54 3.95,55 3.895,56 3.895,57 3.95,58 3.895,59 4.041,61 12,62 4.826}
{0 CHEMBL110737,1 1.779,2 1.464,3 0.859,5 -0.203,6 0.856,7 0.189,10 4.394,11 4.246,13 0.109,15 31,18 0.3,21 0.992,22 0.162,23 0.228,24 1.521,25 1.592,26 67.6,27 0.992,28 0.011,29 1.144,30 0.499,31 0.161,32 0.227,40 -0.012,41 1.461,42 0.033,43 0.455,44 0.576,45 1.639,54 7.172,55 12.409,56 12.409,57 7.172,58 12.409,59 4.752,61 14,62 5.017}
{0 CHEMBL110738,1 1.862,2 1.736,3 0.887,5 -0.258,6 0.968,7 1.436,10 4.321,11 4.227,15 31.5,18 0.2,20 112.213,21 0.981,22 0.152,23 0.208,24 1.449,25 1.51,26 67.4,27 0.981,28 0.014,29 1.139,30 0.506,31 0.152,32 0.207,40 -0.014,41 1.766,42 -0.02,43 0.511,44 0.594,45 1.449,54 7.2,55 12.649,56 12.649,57 7.2,58 12.649,59 5.133,61 20,62 4.992}
{0 CHEMBL111027,1 1.423,2 1.166,3 0.874,5 -0.146,6 0.76,7 1.275,9 1,10 5.063,11 4.959,13 0.091,15 29.3,18 0.4,21 1.187,22 0.204,23 0.33,24 1.401,25 1.503,26 65.5,27 1.187,28 0.009,29 1.15,30 0.504,31 0.203,32 0.329,40 0.014,41 1.246,42 0.052,43 0.44,44 0.572,45 1.564,54 5.271,55 6.644,56 6.644,57 5.271,58 6.644,59 3.931,60 1.7,61 13,62 5.133}
{0 CHEMBL111077,1 0.708,2 0.79,3 0.841,5 -0.015,6 0.843,7 2.323,9 1,10 7.474,11 6.351,12 0.094,13 0.312,14 1,15 31.8,18 0.4,20 0.91,21 1.143,22 0.209,23 0.307,24 1.282,25 1.459,26 63.6,27 1.143,28 0.013,29 1.142,30 0.518,31 0.209,32 0.307,40 -0.003,41 1.118,42 0.056,43 0.429,44 0.581,45 1.516,47 -0.657,50 1.5,52 1,54 4.659,55 5.184,56 5.184,57 4.659,58 5.184,59 3.783,60 4.5,61 12,62 4}
{0 CHEMBL112718,1 1.127,2 1.158,3 0.835,5 -0.09,6 0.734,7 1.189,10 6.456,11 4.37,13 0.126,15 30,18 0.4,20 16.793,21 1.108,22 0.188,23 0.287,24 1.446,25 1.582,26 66.7,27 1.108,28 0.013,29 1.147,30 0.5,31 0.188,32 0.286,40 0.021,41 1.293,42 0.054,43 0.427,44 0.572,45 1.656,54 6.702,55 10.862,56 10.862,57 6.702,58 10.862,59 4.219,60 1.7,61 12,62 5.029}
{0 CHEMBL112719,1 1.316,2 1.357,3 0.887,4 1.46,5 0.021,6 0.931,7 0.387,8 10.914,10 4.759,11 4.35,12 0.25,13 0.125,15 34.8,18 0.7,19 1,20 67.36,21 1.037,22 0.17,23 0.342,24 1.335,25 1.397,26 63.6,27 1.037,28 0.026,29 1.137,30 0.528,31 0.171,32 0.346,40 -0.033,41 1.191,42 0.113,43 0.372,44 0.6,45 1.44,49 0.245,50 6,54 6.741,55 11.044,56 11.044,57 6.741,58 11.044,59 3.954,61 12,62 4.708}
{0 CHEMBL112826,1 1.566,2 1.265,3 0.86,5 -0.047,6 0.878,7 0.24,9 1,10 4.349,11 4.225,13 0.114,15 30.4,18 0.3,20 16.793,21 1.026,22 0.187,23 0.258,24 1.497,25 1.603,26 67.4,27 1.026,28 0.015,29 1.146,30 0.498,31 0.186,32 0.257,40 -0.009,41 1.167,42 0.044,43 0.441,44 0.574,45 1.663,54 4.659,55 5.184,56 5.184,57 4.659,58 5.184,59 4.104,61 10,62 4.523}
{0 CHEMBL112857,1 0.612,2 0.831,3 0.869,5 0.004,6 1.078,7 1.437,9 2,10 7.429,11 4.356,12 0.071,13 0.286,14 1,15 30.5,16 18.011,18 0.4,20 21.497,21 1.197,22 0.203,23 0.323,24 1.321,25 1.522,26 64.4,27 1.197,28 0.018,29 1.147,30 0.513,31 0.203,32 0.323,40 -0.082,41 1.191,42 0.08,43 0.404,44 0.579,45 1.621,47 0.23,49 0.8,50 1.5,52 1,54 5.036,55 6.094,56 6.094,57 5.036,58 6.094,59 3.98,60 1.7,61 12,62 5.111}
{0 CHEMBL112888,1 1.566,2 1.265,3 0.86,5 -0.047,6 0.878,7 0.24,9 1,10 4.349,11 4.225,13 0.114,15 30.4,18 0.3,20 16.793,21 1.026,22 0.187,23 0.258,24 1.497,25 1.603,26 67.4,27 1.026,28 0.015,29 1.146,30 0.498,31 0.186,32 0.257,40 -0.009,41 1.167,42 0.044,43 0.441,44 0.574,45 1.663,54 4.659,55 5.184,56 5.184,57 4.659,58 5.184,59 4.104,61 10,62 4.471}
{0 CHEMBL112909,1 0.872,2 1,3 0.877,5 -0.073,6 0.749,7 1.577,9 1,10 7.429,11 5.049,12 0.071,13 0.206,14 1,15 29.3,16 18.011,18 0.6,20 4.705,21 1.255,22 0.214,23 0.371,24 1.328,25 1.441,26 63.8,27 1.255,28 0.02,29 1.151,30 0.513,31 0.214,32 0.371,40 0.001,41 1.204,42 0.074,43 0.414,44 0.576,45 1.496,47 0.09,49 0.149,50 1.5,52 1,54 5.444,55 7.202,56 7.202,57 5.444,58 7.202,59 3.684,60 1.7,61 13,62 4.993}
{0 CHEMBL113050,1 1.572,2 1.528,3 0.868,5 -0.158,6 0.882,7 0.628,10 5.007,11 4.238,15 30,18 0.3,21 1.037,22 0.196,23 0.291,24 1.537,25 1.541,26 67.5,27 1.037,28 0.009,29 1.147,30 0.497,31 0.195,32 0.289,40 -0.012,41 1.127,42 0.023,43 0.47,44 0.573,45 1.544,54 3.932,55 3.856,56 3.856,57 3.932,58 3.856,59 3.783,61 10,62 4.739}
{0 CHEMBL113150,1 1.826,2 1.46,3 0.849,5 -0.242,6 0.858,7 0.377,10 4.417,11 4.241,13 0.141,15 30.4,18 0.3,20 25.189,21 1.005,22 0.174,23 0.241,24 1.526,25 1.618,26 67.9,27 1.005,28 0.017,29 1.146,30 0.496,31 0.173,32 0.24,40 -0.007,41 1.274,42 0.043,43 0.432,44 0.573,45 1.679,54 6.394,55 9.951,56 9.951,57 6.394,58 9.951,59 4.414,61 12,62 5.237}
{0 CHEMBL113172,1 1.796,2 1.462,3 0.855,5 -0.217,6 0.76,7 0.272,10 4.403,11 4.239,13 0.12,15 30.8,18 0.3,20 16.793,21 0.997,22 0.166,23 0.236,24 1.522,25 1.601,26 67.7,27 0.997,28 0.021,29 1.145,30 0.498,31 0.166,32 0.235,40 0.028,41 1.377,42 0.036,43 0.446,44 0.575,45 1.653,54 6.703,55 10.865,56 10.865,57 6.703,58 10.865,59 4.608,61 14,62 5.096}
{0 CHEMBL113357,1 0.604,2 0.78,3 0.858,5 0.014,6 2.062,7 1.702,9 3,10 7.432,11 4.483,12 0.075,13 0.371,14 1,15 30.9,18 0.4,20 23.984,21 1.218,22 0.211,23 0.325,24 1.253,25 1.528,26 63.6,27 1.218,28 0.014,29 1.145,30 0.516,31 0.211,32 0.325,40 0.077,41 1.155,42 0.086,43 0.398,44 0.579,45 1.666,47 -0.036,49 0.8,50 1.5,52 1,54 5.04,55 6.106,56 6.106,57 5.04,58 6.106,59 3.904,60 3.6,61 11,62 4.638}
{0 CHEMBL114402,1 1.558,2 1.52,3 0.877,5 -0.13,6 0.777,7 0.627,10 5.007,11 4.264,15 31,18 0.2,21 1.01,22 0.173,23 0.239,24 1.526,25 1.528,26 67.2,27 1.01,28 0.005,29 1.145,30 0.501,31 0.172,32 0.238,40 -0.005,41 1.303,42 0.016,43 0.48,44 0.577,45 1.529,54 3.97,55 3.937,56 3.937,57 3.97,58 3.937,59 4.461,61 16,62 4}
{0 CHEMBL1208862,1 0.838,2 0.842,3 0.953,4 0.616,5 -0.155,6 1.593,7 1.991,8 17.46,9 6,10 7.429,11 6.53,12 0.87,13 0.078,14 1,15 48.6,16 17.888,18 0.6,19 0.667,20 110.984,21 1.558,22 0.277,23 0.535,24 0.749,25 0.752,26 37.8,27 1.558,28 0.047,29 1.111,30 0.685,31 0.299,32 0.578,40 0.015,41 0.566,42 0.307,43 0.177,44 0.701,45 0.778,47 -0.324,50 20,51 2,52 1,54 6.25,55 9.416,56 9.416,57 6.25,58 9.416,59 2.197,60 8.1,62 5.292}
{0 CHEMBL1208927,1 0.843,2 0.869,3 0.939,4 0.926,5 -0.15,6 1.744,7 2.197,8 15.299,9 6,10 7.429,11 6.472,12 0.82,13 0.136,14 1,15 46.3,16 17.888,18 0.6,19 0.667,20 117.634,21 1.584,22 0.276,23 0.596,24 0.75,25 0.808,26 39,27 1.584,28 0.049,29 1.116,30 0.673,31 0.296,32 0.639,40 -0.037,41 0.617,42 0.303,43 0.18,44 0.687,45 0.885,47 -0.53,49 0.86,50 20.5,51 2,52 1,54 6.489,55 10.103,56 10.103,57 6.489,58 10.103,59 1.933,60 9.8,62 5.444}
{0 CHEMBL1209885,1 0.91,2 0.914,3 0.928,4 -0.05,5 -0.19,6 1.523,7 2.225,8 14.619,9 6,10 7.429,11 6.53,12 0.854,13 0.075,14 1,15 47.4,16 17.888,18 0.4,19 0.667,20 101.508,21 1.607,22 0.284,23 0.555,24 0.76,25 0.725,26 36.8,27 1.607,28 0.052,29 1.114,30 0.686,31 0.306,32 0.599,40 0.019,41 0.588,42 0.305,43 0.176,44 0.695,45 0.755,47 -0.558,50 20.5,51 2,52 1,54 6.489,55 10.103,56 10.103,57 6.489,58 10.103,59 2.106,60 10.5,62 4.967}
{0 CHEMBL144159,1 0.788,2 0.927,3 0.906,4 0.711,5 -0.121,6 0.925,7 2.303,8 14.772,9 10,10 7.432,11 7.428,12 0.842,13 0.359,14 4,15 46.7,16 69.225,17 18.693,18 0.2,19 1,20 156.489,21 1.637,22 0.26,23 0.593,24 0.769,25 0.767,26 36.7,27 1.637,28 0.043,29 1.116,30 0.685,31 0.277,32 0.633,33 2,34 2,35 2,36 2,37 2,38 2,39 2,40 -0.196,41 0.715,42 0.299,43 0.18,44 0.693,45 0.824,46 2,47 -1.668,48 2,49 2.035,50 32,51 6,52 4,53 2,54 6.07,55 8.777,56 8.777,57 6.07,58 8.777,59 2.171,60 10,62 4.076}
{0 CHEMBL144589,1 0.787,2 0.943,3 0.877,4 -0.635,5 -0.108,6 1.055,7 2.272,8 7.801,9 6,10 7.432,11 7.428,12 0.765,13 0.353,14 4,15 42.9,16 69.225,17 18.394,18 0.5,19 1,20 112.213,21 1.671,22 0.272,23 0.626,24 0.8,25 0.83,26 39.3,27 1.671,28 0.043,29 1.125,30 0.663,31 0.288,32 0.663,33 2,34 2,35 2,36 2,37 2,38 2,39 2,40 -0.069,41 0.738,42 0.277,43 0.2,44 0.671,45 0.906,46 2,47 -1.568,48 2,49 2.035,50 26,51 6,52 4,53 2,54 6.068,55 8.769,56 8.769,57 6.068,58 8.769,59 1.956,60 10.7,61 2,62 5.495}
{0 CHEMBL144760,1 0.768,2 0.924,3 0.879,4 -0.506,5 -0.086,6 1.015,7 2.213,8 7.932,9 8,10 7.432,11 7.428,12 0.722,13 0.334,14 4,15 41.9,16 69.225,17 18.436,18 0.7,19 1,20 112.213,21 1.633,22 0.261,23 0.604,24 0.825,25 0.881,26 41.9,27 1.633,28 0.041,29 1.126,30 0.648,31 0.274,32 0.636,33 2,34 2,35 2,36 2,37 2,38 2,39 2,40 -0.112,41 0.798,42 0.262,43 0.217,44 0.663,45 0.955,46 2,47 -1.358,48 2,49 2.035,50 26,51 6,52 4,53 2,54 6.068,55 8.769,56 8.769,57 6.068,58 8.769,59 2.17,60 9.7,61 4,62 4.585}
{0 CHEMBL144842,1 0.777,2 0.933,3 0.878,4 -0.565,5 -0.096,6 1.054,7 2.238,8 7.872,9 8,10 7.432,11 7.428,12 0.743,13 0.344,14 4,15 42.4,16 69.225,17 18.416,18 0.5,19 1,20 112.213,21 1.651,22 0.266,23 0.616,24 0.812,25 0.857,26 40.7,27 1.651,28 0.042,29 1.125,30 0.655,31 0.281,32 0.65,33 2,34 2,35 2,36 2,37 2,38 2,39 2,40 -0.12,41 0.768,42 0.269,43 0.209,44 0.667,45 0.932,46 2,47 -1.449,48 2,49 2.035,50 26,51 6,52 4,53 2,54 6.068,55 8.769,56 8.769,57 6.068,58 8.769,59 2.059,60 10.2,61 3,62 5.301}
{0 CHEMBL144908,1 0.814,2 0.968,3 0.876,4 -0.831,5 -0.136,6 0.902,7 2.384,8 7.605,9 4,10 7.432,11 7.427,12 0.813,13 0.375,14 4,15 44,16 69.225,17 18.34,18 0.3,19 1,20 112.213,21 1.71,22 0.284,23 0.633,24 0.776,25 0.769,26 36,27 1.71,28 0.045,29 1.123,30 0.681,31 0.303,32 0.676,33 2,34 2,35 2,36 2,37 2,38 2,39 2,40 -0.183,41 0.674,42 0.295,43 0.182,44 0.682,45 0.847,46 2,47 -1.952,48 2,49 2.035,50 26,51 6,52 4,53 2,54 6.069,55 8.772,56 8.772,57 6.069,58 8.772,59 1.83,60 12,62 5.292}
{0 CHEMBL196757,1 0.49,2 0.619,3 0.942,4 2.345,5 0.017,6 1.409,7 2.146,8 13.683,9 6,10 7.432,11 7.428,12 0.75,13 0.375,14 4,15 46.2,16 69.225,17 18.453,18 0.6,19 1,20 138.166,21 1.691,22 0.279,23 0.6,24 0.571,25 0.825,26 38.5,27 1.691,28 0.035,29 1.116,30 0.691,31 0.297,32 0.638,33 2,34 2,35 2,36 2,37 2,38 2,39 2,40 -0.078,41 0.782,42 0.268,43 0.214,44 0.721,45 0.842,46 2,47 -1.003,48 2,49 2.035,50 24,51 6,52 4,53 2,54 6.052,55 8.706,56 8.706,57 6.052,58 8.706,59 2.062,60 3.8,61 2,62 4}
{0 CHEMBL196854,1 0.867,2 1.009,3 0.853,4 -3.567,5 -0.142,6 0.775,7 2.38,8 4.331,9 4,10 7.432,11 7.428,12 0.73,13 0.326,14 4,15 41,16 69.225,17 18.432,18 0.4,19 1,20 93.26,21 1.699,22 0.272,23 0.613,24 0.821,25 0.82,26 39.3,27 1.699,28 0.041,29 1.128,30 0.657,31 0.286,32 0.646,33 2,34 2,35 2,36 2,37 2,38 2,39 2,40 -0.123,41 0.793,42 0.269,43 0.206,44 0.66,45 0.902,46 2,47 -1.887,48 2,49 2.035,50 27,51 6,52 4,53 2,54 6.315,55 9.349,56 9.349,57 6.315,58 9.349,59 2.099,60 13.1,61 3,62 5.77}
{0 CHEMBL196859,1 0.539,2 0.822,3 0.911,4 3.285,5 0.01,6 1.199,7 2.17,8 10.134,9 8,10 7.432,11 7.428,12 0.684,13 0.494,14 4,15 41.2,16 69.225,17 18.792,18 0.9,19 1,20 176.719,21 1.597,22 0.251,23 0.558,24 0.779,25 1.026,26 44.1,27 1.597,28 0.039,29 1.127,30 0.636,31 0.262,32 0.585,33 2,34 2,35 2,36 2,37 2,38 2,39 2,40 -0.056,41 0.833,42 0.274,43 0.21,44 0.657,45 1.221,46 2,47 -1.11,48 2,49 2.035,50 26,51 6,52 4,53 2,54 6.177,55 9.177,56 9.177,57 6.177,58 9.177,59 2.529,60 8.8,61 2,62 4}
{0 CHEMBL196865,1 0.497,2 0.609,3 0.916,4 1.397,5 0.008,6 1.633,7 2.01,8 6.943,9 5,10 7.43,11 6.818,12 0.706,13 0.364,14 2,15 43.3,16 34.612,17 8.907,18 0.8,19 1,20 69.083,21 1.633,22 0.314,23 0.691,24 0.614,25 0.904,26 43.3,27 1.633,28 0.046,29 1.121,30 0.658,31 0.333,32 0.733,33 1,34 1,35 1,36 1,37 1,38 1,39 1,40 -0.189,41 0.655,42 0.252,43 0.228,44 0.696,45 0.92,46 1,47 -0.245,48 1,49 1.058,50 12,51 3,52 2,53 1,54 6.049,55 8.685,56 8.685,57 6.049,58 8.685,59 1.309,60 3.3,61 1,62 4}
{0 CHEMBL196904,1 0.739,2 0.91,3 0.876,4 -0.897,5 -0.045,6 0.688,7 2.174,8 5.311,9 4,10 7.432,11 7.428,12 0.587,13 0.336,14 4,15 38.6,16 69.225,17 18.738,18 0.7,19 1,20 125.513,21 1.557,22 0.233,23 0.525,24 0.882,25 1.035,26 47.7,27 1.557,28 0.036,29 1.131,30 0.612,31 0.241,32 0.544,33 2,34 2,35 2,36 2,37 2,38 2,39 2,40 -0.079,41 1.011,42 0.227,43 0.255,44 0.638,45 1.157,46 2,47 -1.252,48 2,49 2.035,50 27,51 6,52 4,53 2,54 6.377,55 9.619,56 9.619,57 6.377,58 9.619,59 2.948,60 9.1,61 10,62 4}
{0 CHEMBL196922,1 0.487,2 0.402,3 0.898,4 0.359,5 0.021,6 1.111,7 2.527,8 5.755,9 5,10 7.815,11 7.43,12 0.789,13 0.601,14 2,15 40.6,16 34.612,17 8.923,18 0.8,19 1,20 68.339,21 1.696,22 0.317,23 0.693,24 0.703,25 0.956,26 40.6,27 1.696,28 0.039,29 1.131,30 0.651,31 0.339,32 0.742,33 1,34 1,35 1,36 1,37 1,38 1,39 1,40 -0.195,41 0.593,42 0.276,43 0.202,44 0.662,45 1.021,46 1,47 -0.551,48 1,49 2.035,50 15,51 3,52 2,53 1,54 6.07,55 8.795,56 8.795,57 6.07,58 8.795,59 1.289,60 9.4,61 1,62 4}
{0 CHEMBL197008,1 0.651,2 0.773,3 0.906,4 1.139,5 -0.061,6 1.304,7 2.752,8 11.346,9 12,10 7.478,11 7.472,12 0.771,13 0.503,14 6,15 45.5,16 69.225,17 18.463,18 0.4,19 1,20 139.356,21 1.671,22 0.271,23 0.611,24 0.726,25 0.829,26 36.4,27 1.671,28 0.038,29 1.119,30 0.683,31 0.289,32 0.652,33 2,34 2,35 2,36 2,37 2,38 2,39 2,40 -0.123,41 0.716,42 0.286,43 0.192,44 0.688,45 0.919,46 2,47 -3.746,48 2,49 2.035,50 27,51 8,52 6,53 2,54 6.053,55 8.702,56 8.702,57 6.053,58 8.702,59 2.013,60 10.9,61 1,62 4}
{0 CHEMBL197009,1 0.787,2 0.931,3 0.874,4 -0.697,5 -0.11,6 0.926,7 2.311,8 7.765,9 8,10 7.431,11 7.427,12 0.765,13 0.378,14 4,15 42.9,16 51.214,17 18.546,18 0.6,19 1,20 120.609,21 1.671,22 0.272,23 0.631,24 0.789,25 0.858,26 39.3,27 1.671,28 0.044,29 1.125,30 0.663,31 0.288,32 0.668,33 2,34 2,35 2,36 2,37 2,38 2,39 2,40 -0.254,41 0.749,42 0.282,43 0.193,44 0.671,45 0.954,46 3,47 -1.593,48 2,49 2.035,50 26,51 6,52 4,53 2,54 6.34,55 9.437,56 9.437,57 6.34,58 9.437,59 1.929,60 10.7,61 1,62 4}
{0 CHEMBL197017,1 0.782,2 0.951,3 0.87,4 -1.26,5 -0.095,6 0.8,7 2.28,8 5.114,9 4,10 7.432,11 7.428,12 0.692,13 0.395,14 4,15 40.3,16 69.225,17 18.647,18 0.6,19 1,20 125.513,21 1.663,22 0.262,23 0.607,24 0.806,25 0.924,26 41.8,27 1.663,28 0.041,29 1.129,30 0.644,31 0.274,32 0.636,33 2,34 2,35 2,36 2,37 2,38 2,39 2,40 -0.109,41 0.84,42 0.267,43 0.211,44 0.654,45 1.066,46 2,47 -1.634,48 2,49 2.035,50 27,51 6,52 4,53 2,54 6.377,55 9.619,56 9.619,57 6.377,58 9.619,59 2.206,60 11.9,61 3,62 5.097}
{0 CHEMBL197057,1 0.731,2 0.892,3 0.882,4 -0.3,5 -0.044,6 0.86,7 2.137,8 8.146,9 8,10 7.432,11 7.428,12 0.619,13 0.288,14 4,15 40,16 69.225,17 18.526,18 0.8,19 1,20 112.213,21 1.535,22 0.234,23 0.531,24 0.896,25 0.993,26 47.5,27 1.535,28 0.036,29 1.129,30 0.617,31 0.243,32 0.552,33 2,34 2,35 2,36 2,37 2,38 2,39 2,40 -0.081,41 0.957,42 0.225,43 0.257,44 0.646,45 1.062,46 2,47 -1.082,48 2,49 2.035,50 26,51 6,52 4,53 2,54 6.068,55 8.769,56 8.769,57 6.068,58 8.769,59 2.835,60 7.5,61 10,62 4}
{0 CHEMBL197061,1 0.665,2 0.836,3 0.907,4 1.141,5 -0.051,6 1.158,7 2.194,8 12.413,9 6,10 7.432,11 7.428,12 0.781,13 0.375,14 4,15 44.4,16 69.225,17 18.381,18 0.6,19 1,20 131.165,21 1.604,22 0.263,23 0.611,24 0.79,25 0.869,26 40.7,27 1.604,28 0.035,29 1.122,30 0.661,31 0.279,32 0.649,33 2,34 2,35 2,36 2,37 2,38 2,39 2,40 -0.089,41 0.717,42 0.279,43 0.203,44 0.68,45 0.941,46 2,47 -1.222,48 2,49 2.035,50 25,51 6,52 4,53 2,54 6.052,55 8.706,56 8.706,57 6.052,58 8.706,59 2.023,60 7.4,61 2,62 4}
{0 CHEMBL197068,1 0.856,2 0.998,3 0.854,4 -3.483,5 -0.13,6 0.747,7 2.372,8 4.377,9 4,10 7.432,11 7.428,12 0.711,13 0.317,14 4,15 40.6,16 69.225,17 18.452,18 0.6,19 1,20 93.26,21 1.681,22 0.267,23 0.602,24 0.83,25 0.846,26 40.6,27 1.681,28 0.04,29 1.129,30 0.65,31 0.28,32 0.633,33 2,34 2,35 2,36 2,37 2,38 2,39 2,40 -0.116,41 0.821,42 0.262,43 0.214,44 0.657,45 0.927,46 2,47 -1.789,48 2,49 2.035,50 27,51 6,52 4,53 2,54 6.315,55 9.349,56 9.349,57 6.315,58 9.349,59 2.204,60 12.5,61 4,62 5.222}
{0 CHEMBL197180,1 0.495,2 0.624,3 0.944,4 2.003,5 0.012,6 1.644,7 2.204,8 13.739,9 14,10 7.432,11 7.428,12 0.774,13 0.387,14 4,15 46.9,16 69.225,17 18.455,18 0.6,19 1,20 138.166,21 1.715,22 0.286,23 0.607,24 0.558,25 0.8,26 36.7,27 1.715,28 0.04,29 1.115,30 0.702,31 0.305,32 0.648,33 2,34 2,35 2,36 2,37 2,38 2,39 2,40 -0.188,41 0.76,42 0.278,43 0.205,44 0.729,45 0.817,46 2,47 -1.228,48 2,49 2.035,50 24,51 6,52 4,53 2,54 6.156,55 9.042,56 9.042,57 6.156,58 9.042,59 1.974,60 4.1,61 1,62 4}
{0 CHEMBL197231,1 0.48,2 0.658,3 0.911,4 0.861,5 0.044,6 1.968,7 1.956,8 9.391,9 6,10 7.43,11 6.818,12 0.632,13 0.326,14 2,15 41,16 34.612,17 9.019,18 1,19 1,20 75.059,21 1.377,22 0.249,23 0.571,24 0.942,25 1.077,26 51.3,27 1.377,28 0.032,29 1.127,30 0.603,31 0.26,32 0.596,33 1,34 1,35 1,36 1,37 1,38 1,39 1,40 -0.089,41 0.738,42 0.222,43 0.266,44 0.649,45 1.139,46 1,47 -0.135,48 1,49 1.058,50 12,51 3,52 2,53 1,54 6.048,55 8.681,56 8.681,57 6.048,58 8.681,59 2.134,60 2.6,61 4,62 4}
{0 CHEMBL197238,1 0.522,2 0.737,3 0.948,4 2.515,5 -0.004,6 1.956,7 2.054,8 16.665,9 7,10 7.43,11 6.818,12 0.841,13 0.387,14 2,15 47.4,16 34.612,17 9.128,18 0.6,19 1,20 132.276,21 1.483,22 0.264,23 0.591,24 0.765,25 0.903,26 42.1,27 1.483,28 0.039,29 1.114,30 0.662,31 0.283,32 0.632,33 1,34 1,35 1,36 1,37 1,38 1,39 1,40 -0.1,41 0.583,42 0.303,43 0.185,44 0.691,45 1,46 1,47 -0.304,48 1,49 1.081,50 18.5,51 3,52 2,53 1,54 6.051,55 8.689,56 8.689,57 6.051,58 8.689,59 1.93,60 5.3,62 4}
{0 CHEMBL197291,1 0.512,2 0.764,3 0.924,4 2.799,5 0.016,6 1.77,7 2.128,8 14.007,9 12,10 7.432,11 7.428,12 0.735,13 0.452,14 4,15 43.3,16 69.225,17 18.557,18 0.8,19 1,20 163.418,21 1.567,22 0.251,23 0.578,24 0.781,25 0.973,26 43.3,27 1.567,28 0.039,29 1.123,30 0.646,31 0.265,32 0.609,33 2,34 2,35 2,36 2,37 2,38 2,39 2,40 -0.089,41 0.757,42 0.277,43 0.209,44 0.67,45 1.111,46 2,47 -0.922,48 2,49 2.035,50 25,51 6,52 4,53 2,54 6.05,55 8.688,56 8.688,57 6.05,58 8.688,59 2.309,60 6.7,61 2,62 4}
{0 CHEMBL197374,1 0.802,2 0.972,3 0.868,4 -1.473,5 -0.118,6 0.73,7 2.362,8 4.998,9 2,10 7.432,11 7.428,12 0.73,13 0.416,14 4,15 41,16 69.225,17 18.609,18 0.4,19 1,20 125.513,21 1.699,22 0.272,23 0.629,24 0.783,25 0.88,26 39.3,27 1.699,28 0.042,29 1.128,30 0.657,31 0.286,32 0.663,33 2,34 2,35 2,36 2,37 2,38 2,39 2,40 -0.151,41 0.784,42 0.282,43 0.195,44 0.66,45 1.03,46 2,47 -1.921,48 2,49 2.035,50 27,51 6,52 4,53 2,54 6.377,55 9.619,56 9.619,57 6.377,58 9.619,59 2.001,60 13.1,61 1,62 5.301}
{0 CHEMBL197383,1 0.663,2 0.819,3 0.885,4 0.721,5 -0.052,6 1.026,7 2.058,8 6.384,9 3,10 7.43,11 6.818,12 0.735,13 0.364,14 2,15 41.9,16 34.612,17 8.885,18 0.8,19 1,20 65.583,21 1.554,22 0.296,23 0.703,24 0.844,25 0.952,26 45.2,27 1.554,28 0.039,29 1.126,30 0.633,31 0.314,32 0.744,33 1,34 1,35 1,36 1,37 1,38 1,39 1,40 -0.204,41 0.61,42 0.262,43 0.218,44 0.661,45 1.026,46 1,47 -0.359,48 1,49 1.058,50 12.5,51 3,52 2,53 1,54 6.052,55 8.706,56 8.706,57 6.052,58 8.706,59 1.266,60 6.5,61 1,62 4}
{0 CHEMBL197387,1 0.678,2 0.879,3 0.895,4 1.27,5 -0.053,6 1.186,7 2.228,8 9.021,9 8,10 7.432,11 7.428,12 0.722,13 0.427,14 4,15 41.9,16 69.225,17 18.573,18 0.8,19 1,20 144.466,21 1.633,22 0.261,23 0.613,24 0.786,25 0.938,26 41.9,27 1.633,28 0.039,29 1.126,30 0.648,31 0.274,32 0.646,33 2,34 2,35 2,36 2,37 2,38 2,39 2,40 -0.113,41 0.783,42 0.276,43 0.206,44 0.663,45 1.079,46 2,47 -1.369,48 2,49 2.035,50 26,51 6,52 4,53 2,54 6.099,55 8.88,56 8.88,57 6.099,58 8.88,59 2.11,60 9.7,61 2,62 4}
{0 CHEMBL197388,1 0.819,2 0.943,3 0.86,4 -0.929,5 -0.13,6 0.981,7 2.596,8 7.505,9 10,10 7.435,11 7.431,12 0.788,13 0.436,14 4,15 45.1,16 33.203,17 18.264,18 0.4,19 1,20 117.186,21 1.651,22 0.273,23 0.624,24 0.738,25 0.817,26 35.3,27 1.651,28 0.044,29 1.118,30 0.686,31 0.291,32 0.665,33 2,34 2,35 2,36 2,37 2,38 2,39 2,40 -0.237,41 0.696,42 0.289,43 0.189,44 0.681,45 0.949,46 5,47 -2.546,48 2,49 2.035,50 26,51 6,52 4,53 2,54 6.068,55 8.77,56 8.77,57 6.068,58 8.77,59 1.902,60 15.7,61 1,62 4.42}
{0 CHEMBL197425,1 0.775,2 0.91,3 0.871,4 -0.671,5 -0.101,6 0.872,7 2.223,8 7.817,9 10,10 7.43,11 7.426,12 0.743,13 0.392,14 4,15 42.4,16 33.203,17 18.723,18 0.6,19 1,20 129.005,21 1.651,22 0.266,23 0.602,24 0.792,25 0.908,26 40.7,27 1.651,28 0.043,29 1.125,30 0.655,31 0.281,32 0.635,33 2,34 2,35 2,36 2,37 2,38 2,39 2,40 -0.317,41 0.791,42 0.279,43 0.195,44 0.667,45 1.021,46 5,47 -1.458,48 2,49 2.035,50 26,51 6,52 4,53 2,54 6.343,55 9.445,56 9.445,57 6.343,58 9.445,59 2.145,60 10.2,61 1,62 4}
{0 CHEMBL197441,1 0.674,2 0.843,3 0.908,4 1.363,5 -0.061,6 1.421,7 2.216,8 12.115,9 10,10 7.432,11 7.428,12 0.806,13 0.387,14 4,15 45.1,16 69.225,17 18.352,18 0.6,19 1,20 131.165,21 1.624,22 0.269,23 0.618,24 0.774,25 0.843,26 39.2,27 1.624,28 0.042,29 1.121,30 0.67,31 0.286,32 0.659,33 2,34 2,35 2,36 2,37 2,38 2,39 2,40 -0.178,41 0.68,42 0.288,43 0.194,44 0.685,45 0.915,46 2,47 -1.268,48 2,49 2.035,50 25,51 6,52 4,53 2,54 6.05,55 8.687,56 8.687,57 6.05,58 8.687,59 1.936,60 7.8,61 1,62 4}
{0 CHEMBL197484,1 0.663,2 0.819,3 0.885,4 0.849,5 -0.052,6 1.439,7 2.039,8 6.287,9 5,10 7.43,11 6.818,12 0.735,13 0.364,14 2,15 41.9,16 34.612,17 8.883,18 0.8,19 1,20 65.583,21 1.554,22 0.296,23 0.703,24 0.844,25 0.952,26 45.2,27 1.554,28 0.046,29 1.126,30 0.633,31 0.314,32 0.744,33 1,34 1,35 1,36 1,37 1,38 1,39 1,40 -0.176,41 0.607,42 0.262,43 0.218,44 0.661,45 1.026,46 1,47 -0.313,48 1,49 1.058,50 12.5,51 3,52 2,53 1,54 6.049,55 8.685,56 8.685,57 6.049,58 8.685,59 1.266,60 6.5,61 1,62 4}
{0 CHEMBL197486,1 0.525,2 0.698,3 0.948,4 3.013,5 -0.014,6 1.892,7 2.085,8 14.247,9 7,10 7.43,11 6.818,12 0.804,13 0.371,14 2,15 47.4,16 34.612,17 9.156,18 0.6,19 1,20 126.3,21 1.625,22 0.289,23 0.634,24 0.598,25 0.847,26 39.5,27 1.625,28 0.045,29 1.112,30 0.684,31 0.31,32 0.678,33 1,34 1,35 1,36 1,37 1,38 1,39 1,40 -0.092,41 0.634,42 0.293,43 0.191,44 0.713,45 0.905,46 1,47 -0.376,48 1,49 1.081,50 18.5,51 3,52 2,53 1,54 6.051,55 8.693,56 8.693,57 6.051,58 8.693,59 1.688,60 5.3,62 4}
{0 CHEMBL197490,1 0.49,2 0.658,3 0.946,4 1.486,5 0.008,6 1.523,7 2.194,8 18.061,9 8,10 7.432,11 7.427,12 0.857,13 0.427,14 4,15 47.8,16 69.225,17 18.31,18 0.6,19 1,20 150.118,21 1.542,22 0.26,23 0.549,24 0.741,25 0.858,26 39.1,27 1.542,28 0.035,29 1.116,30 0.678,31 0.279,32 0.59,33 2,34 2,35 2,36 2,37 2,38 2,39 2,40 -0.208,41 0.623,42 0.301,43 0.186,44 0.701,45 0.931,46 2,47 -1.111,48 2,49 2.035,50 24,51 6,52 4,53 2,54 6.05,55 8.685,56 8.685,57 6.05,58 8.685,59 2.266,60 4.3,62 4}
{0 CHEMBL197530,1 0.544,2 0.827,3 0.911,4 3.206,5 0.002,6 1.113,7 2.213,8 10.056,9 8,10 7.432,11 7.428,12 0.703,13 0.507,14 4,15 41.5,16 69.225,17 18.777,18 0.9,19 1,20 176.719,21 1.615,22 0.255,23 0.567,24 0.764,25 1.011,26 43.1,27 1.615,28 0.04,29 1.127,30 0.641,31 0.268,32 0.595,33 2,34 2,35 2,36 2,37 2,38 2,39 2,40 -0.131,41 0.805,42 0.281,43 0.202,44 0.66,45 1.212,46 2,47 -1.258,48 2,49 2.035,50 26,51 6,52 4,53 2,54 6.177,55 9.177,56 9.177,57 6.177,58 9.177,59 2.44,60 9.2,61 1,62 4}
{0 CHEMBL197531,1 0.65,2 0.824,3 0.907,4 1.23,5 -0.034,6 1.12,7 2.138,8 12.564,9 8,10 7.432,11 7.428,12 0.735,13 0.353,14 4,15 43.3,16 69.225,17 18.424,18 0.8,19 1,20 131.165,21 1.567,22 0.251,23 0.589,24 0.822,25 0.916,26 43.3,27 1.567,28 0.033,29 1.123,30 0.646,31 0.265,32 0.621,33 2,34 2,35 2,36 2,37 2,38 2,39 2,40 -0.13,41 0.78,42 0.262,43 0.221,44 0.67,45 0.986,46 2,47 -1.026,48 2,49 2.035,50 25,51 6,52 4,53 2,54 6.052,55 8.706,56 8.706,57 6.052,58 8.706,59 2.237,60 6.7,61 4,62 4}
{0 CHEMBL197534,1 0.505,2 0.757,3 0.922,4 2.714,5 0.029,6 1.324,7 2.084,8 14.235,9 8,10 7.432,11 7.428,12 0.694,13 0.427,14 4,15 42.4,16 69.225,17 18.635,18 0.8,19 1,20 163.418,21 1.532,22 0.242,23 0.556,24 0.814,25 1.007,26 45.5,27 1.532,28 0.032,29 1.125,30 0.633,31 0.253,32 0.583,33 2,34 2,35 2,36 2,37 2,38 2,39 2,40 -0.096,41 0.824,42 0.261,43 0.225,44 0.663,45 1.138,46 2,47 -0.776,48 2,49 2.035,50 25,51 6,52 4,53 2,54 6.053,55 8.718,56 8.718,57 6.053,58 8.718,59 2.519,60 6.1,61 4,62 4}
{0 CHEMBL198459,1 0.548,2 0.809,3 0.892,4 1.844,5 0.006,6 1.01,7 2.038,8 5.193,9 4,10 7.43,11 6.818,12 0.65,13 0.481,14 2,15 39.5,16 34.612,17 9.049,18 1,19 1,20 88.359,21 1.553,22 0.283,23 0.635,24 0.829,25 1.083,26 47.4,27 1.553,28 0.042,29 1.13,30 0.616,31 0.296,32 0.665,33 1,34 1,35 1,36 1,37 1,38 1,39 1,40 -0.127,41 0.699,42 0.26,43 0.223,44 0.644,45 1.269,46 1,47 -0.31,48 1,49 1.058,50 13,51 3,52 2,53 1,54 6.177,55 9.177,56 9.177,57 6.177,58 9.177,59 1.759,60 7.9,61 1,62 4}
{0 CHEMBL198466,1 0.914,2 1.055,3 0.847,4 -3.944,5 -0.19,6 0.628,7 2.491,8 4.124,10 7.432,11 7.427,12 0.794,13 0.353,14 4,15 42.3,16 69.225,17 18.357,18 0.1,19 1,20 93.26,21 1.755,22 0.289,23 0.629,24 0.797,25 0.724,26 34.6,27 1.755,28 0.044,29 1.126,30 0.683,31 0.308,32 0.669,33 2,34 2,35 2,36 2,37 2,38 2,39 2,40 -0.181,41 0.703,42 0.292,43 0.18,44 0.673,45 0.81,46 2,47 -2.425,48 2,49 2.035,50 27,51 6,52 4,53 2,54 6.315,55 9.35,56 9.35,57 6.315,58 9.35,59 1.885,60 15.4,62 5.77}
{0 CHEMBL198484,1 0.524,2 0.698,3 0.948,4 2.777,5 -0.012,6 1.905,7 2.108,8 14.357,9 9,10 7.43,11 6.818,12 0.804,13 0.371,14 2,15 47.4,16 34.612,17 9.175,18 0.6,19 1,20 126.3,21 1.625,22 0.289,23 0.634,24 0.598,25 0.847,26 39.5,27 1.625,28 0.043,29 1.112,30 0.684,31 0.31,32 0.678,33 1,34 1,35 1,36 1,37 1,38 1,39 1,40 -0.091,41 0.644,42 0.293,43 0.191,44 0.713,45 0.905,46 1,47 -0.435,48 1,49 1.081,50 18.5,51 3,52 2,53 1,54 6.157,55 9.044,56 9.044,57 6.157,58 9.044,59 1.688,60 5.3,62 4}
{0 CHEMBL198512,1 0.776,2 0.916,3 0.86,4 -0.079,5 -0.103,6 0.967,7 2.119,8 4.069,9 3,10 7.43,11 6.818,12 0.722,13 0.344,14 2,15 40.6,16 34.612,17 8.89,18 0.8,19 1,20 56.106,21 1.62,22 0.306,23 0.719,24 0.843,25 0.918,26 43.8,27 1.62,28 0.047,29 1.129,30 0.636,31 0.324,32 0.76,33 1,34 1,35 1,36 1,37 1,38 1,39 1,40 -0.174,41 0.626,42 0.262,43 0.215,44 0.654,45 0.997,46 1,47 -0.5,48 1,49 1.058,50 13,51 3,52 2,53 1,54 6.068,55 8.769,56 8.769,57 6.068,58 8.769,59 1.2,60 9.4,61 1,62 4}
{0 CHEMBL198513,1 0.495,2 0.609,3 0.916,4 1.181,5 0.01,6 1.647,7 2.033,8 7.068,9 7,10 7.43,11 6.818,12 0.706,13 0.364,14 2,15 43.3,16 34.612,17 8.926,18 0.8,19 1,20 69.083,21 1.633,22 0.314,23 0.691,24 0.614,25 0.904,26 43.3,27 1.633,28 0.043,29 1.121,30 0.658,31 0.333,32 0.733,33 1,34 1,35 1,36 1,37 1,38 1,39 1,40 -0.186,41 0.668,42 0.253,43 0.228,44 0.696,45 0.92,46 1,47 -0.305,48 1,49 1.058,50 12,51 3,52 2,53 1,54 6.156,55 9.042,56 9.042,57 6.156,58 9.042,59 1.309,60 3.3,61 1,62 4}
{0 CHEMBL198520,1 0.475,2 0.652,3 0.94,4 1.589,5 0.031,6 1.757,7 2.065,8 18.403,9 12,10 7.432,11 7.428,12 0.774,13 0.387,14 4,15 45.5,16 69.225,17 18.388,18 0.8,19 1,20 150.118,21 1.488,22 0.243,23 0.545,24 0.804,25 0.931,26 43.6,27 1.488,28 0.032,29 1.119,30 0.651,31 0.257,32 0.578,33 2,34 2,35 2,36 2,37 2,38 2,39 2,40 -0.126,41 0.728,42 0.272,43 0.216,44 0.683,45 0.999,46 2,47 -0.672,48 2,49 2.035,50 24,51 6,52 4,53 2,54 6.049,55 8.681,56 8.681,57 6.049,58 8.681,59 2.44,60 3.6,61 3,62 4}
{0 CHEMBL198528,1 0.673,2 0.841,3 0.923,4 2.439,5 -0.066,6 1.664,7 2.114,8 13.542,9 7,10 7.43,11 6.818,12 0.826,13 0.371,14 2,15 46.2,16 34.612,17 9.133,18 0.6,19 1,20 122.8,21 1.547,22 0.274,23 0.636,24 0.77,25 0.878,26 41,27 1.547,28 0.045,29 1.116,30 0.663,31 0.293,32 0.679,33 1,34 1,35 1,36 1,37 1,38 1,39 1,40 -0.093,41 0.596,42 0.3,43 0.183,44 0.685,45 0.975,46 1,47 -0.444,48 1,49 1.081,50 19,51 3,52 2,53 1,54 6.051,55 8.693,56 8.693,57 6.051,58 8.693,59 1.696,60 7.7,62 4}
{0 CHEMBL198541,1 0.641,2 0.765,3 0.906,4 1.199,5 -0.052,6 1.337,7 2.743,8 11.457,9 12,10 7.478,11 7.472,12 0.75,13 0.49,14 6,15 44.8,16 69.225,17 18.486,18 0.6,19 1,20 139.356,21 1.654,22 0.266,23 0.605,24 0.74,25 0.853,26 37.9,27 1.654,28 0.037,29 1.12,30 0.674,31 0.282,32 0.643,33 2,34 2,35 2,36 2,37 2,38 2,39 2,40 -0.023,41 0.746,42 0.278,43 0.201,44 0.683,45 0.943,46 2,47 -3.572,48 2,49 2.035,50 27,51 8,52 6,53 2,54 6.053,55 8.702,56 8.702,57 6.053,58 8.702,59 2.09,60 10.3,61 2,62 4}
{0 CHEMBL198573,1 0.791,2 0.961,3 0.869,4 -1.356,5 -0.106,6 0.789,7 2.314,8 5.062,9 2,10 7.432,11 7.428,12 0.711,13 0.405,14 4,15 40.6,16 69.225,17 18.629,18 0.6,19 1,20 125.513,21 1.681,22 0.267,23 0.619,24 0.794,25 0.903,26 40.6,27 1.681,28 0.042,29 1.129,30 0.65,31 0.28,32 0.65,33 2,34 2,35 2,36 2,37 2,38 2,39 2,40 -0.067,41 0.813,42 0.274,43 0.203,44 0.657,45 1.049,46 2,47 -1.757,48 2,49 2.035,50 27,51 6,52 4,53 2,54 6.377,55 9.619,56 9.619,57 6.377,58 9.619,59 2.099,60 12.5,61 2,62 5.097}
{0 CHEMBL198585,1 0.491,2 0.65,3 0.914,4 0.852,5 0.017,6 1.681,7 1.979,8 9.324,9 5,10 7.43,11 6.818,12 0.75,13 0.387,14 2,15 43.3,16 34.612,17 8.878,18 0.8,19 1,20 75.059,21 1.46,22 0.28,23 0.643,24 0.849,25 0.987,26 46.7,27 1.46,28 0.037,29 1.123,30 0.631,31 0.298,32 0.682,33 1,34 1,35 1,36 1,37 1,38 1,39 1,40 -0.195,41 0.593,42 0.264,43 0.222,44 0.668,45 1.056,46 1,47 -0.173,48 1,49 1.058,50 12,51 3,52 2,53 1,54 6.048,55 8.681,56 8.681,57 6.048,58 8.681,59 1.559,60 3.3,61 1,62 4}
{0 CHEMBL198593,1 0.512,2 0.764,3 0.924,4 2.63,5 0.016,6 1.348,7 2.137,8 14.094,9 6,10 7.432,11 7.428,12 0.735,13 0.452,14 4,15 43.3,16 69.225,17 18.6,18 0.8,19 1,20 163.418,21 1.567,22 0.251,23 0.578,24 0.781,25 0.973,26 43.3,27 1.567,28 0.034,29 1.123,30 0.646,31 0.265,32 0.609,33 2,34 2,35 2,36 2,37 2,38 2,39 2,40 -0.057,41 0.764,42 0.277,43 0.209,44 0.67,45 1.111,46 2,47 -0.963,48 2,49 2.035,50 25,51 6,52 4,53 2,54 6.053,55 8.718,56 8.718,57 6.053,58 8.718,59 2.309,60 6.7,61 2,62 4}
{0 CHEMBL198621,1 0.509,2 0.747,3 0.901,4 1.541,5 0.039,6 1.937,7 1.982,8 7.211,9 7,10 7.43,11 6.818,12 0.595,13 0.376,14 2,15 39.5,16 34.612,17 9.095,18 1,19 1,20 81.709,21 1.436,22 0.254,23 0.584,24 0.919,25 1.113,26 51.2,27 1.436,28 0.037,29 1.129,30 0.599,31 0.265,32 0.607,33 1,34 1,35 1,36 1,37 1,38 1,39 1,40 -0.104,41 0.773,42 0.224,43 0.262,44 0.64,45 1.227,46 1,47 -0.194,48 1,49 1.058,50 12.5,51 3,52 2,53 1,54 6.049,55 8.688,56 8.688,57 6.049,58 8.688,59 2.13,60 4.7,61 4,62 4}
{0 CHEMBL198626,1 0.684,2 0.852,3 0.908,4 1.004,5 -0.074,6 0.957,7 2.3,8 12.189,9 4,10 7.432,11 7.427,12 0.833,13 0.399,14 4,15 45.8,16 69.225,17 18.327,18 0.4,19 1,20 131.165,21 1.644,22 0.275,23 0.616,24 0.757,25 0.813,26 37.5,27 1.644,28 0.037,29 1.12,30 0.68,31 0.294,32 0.66,33 2,34 2,35 2,36 2,37 2,38 2,39 2,40 -0.218,41 0.649,42 0.297,43 0.184,44 0.691,45 0.887,46 2,47 -1.585,48 2,49 2.035,50 25,51 6,52 4,53 2,54 6.054,55 8.71,56 8.71,57 6.054,58 8.71,59 1.9,60 8.3,62 4}
{0 CHEMBL198627,1 0.523,2 0.774,3 0.927,4 2.5,5 -0.001,6 1.096,7 2.239,8 13.884,9 4,10 7.432,11 7.427,12 0.781,13 0.479,14 4,15 44.4,16 69.225,17 18.557,18 0.6,19 1,20 163.418,21 1.604,22 0.263,23 0.589,24 0.745,25 0.934,26 40.7,27 1.604,28 0.035,29 1.122,30 0.661,31 0.279,32 0.625,33 2,34 2,35 2,36 2,37 2,38 2,39 2,40 -0.156,41 0.701,42 0.294,43 0.19,44 0.68,45 1.081,46 2,47 -1.311,48 2,49 2.035,50 25,51 6,52 4,53 2,54 6.055,55 8.721,56 8.721,57 6.055,58 8.721,59 2.156,60 7.4,62 4}
{0 CHEMBL198649,1 0.465,2 0.397,3 0.898,4 0.541,5 0.043,6 1.38,7 2.498,8 5.682,9 9,10 7.815,11 7.43,12 0.682,13 0.519,14 2,15 39,16 34.612,17 9.054,18 0.8,19 1,20 68.339,21 1.596,22 0.283,23 0.613,24 0.793,25 1.048,26 46.3,27 1.596,28 0.036,29 1.133,30 0.62,31 0.298,32 0.646,33 1,34 1,35 1,36 1,37 1,38 1,39 1,40 -0.09,41 0.721,42 0.238,43 0.242,44 0.646,45 1.113,46 1,47 -0.429,48 1,49 2.035,50 15,51 3,52 2,53 1,54 6.053,55 8.701,56 8.701,57 6.053,58 8.701,59 1.895,60 7.3,61 4,62 4}
{0 CHEMBL198671,1 0.522,2 0.754,3 0.901,4 1.451,5 0.01,6 1.161,7 2.012,8 7.196,9 3,10 7.43,11 6.818,12 0.694,13 0.439,14 2,15 41.2,16 34.612,17 8.973,18 0.8,19 1,20 81.709,21 1.52,22 0.284,23 0.66,24 0.837,25 1.039,26 47.1,27 1.52,28 0.037,29 1.127,30 0.622,31 0.299,32 0.695,33 1,34 1,35 1,36 1,37 1,38 1,39 1,40 -0.147,41 0.646,42 0.261,43 0.222,44 0.654,45 1.172,46 1,47 -0.251,48 1,49 1.058,50 12.5,51 3,52 2,53 1,54 6.053,55 8.717,56 8.717,57 6.053,58 8.717,59 1.554,60 5.9,61 1,62 4}
{0 CHEMBL198672,1 0.522,2 0.754,3 0.901,4 1.528,5 0.01,6 1.657,7 2.004,8 7.155,9 6,10 7.43,11 6.818,12 0.694,13 0.439,14 2,15 41.2,16 34.612,17 8.954,18 0.8,19 1,20 81.709,21 1.52,22 0.284,23 0.66,24 0.837,25 1.039,26 47.1,27 1.52,28 0.043,29 1.127,30 0.622,31 0.299,32 0.695,33 1,34 1,35 1,36 1,37 1,38 1,39 1,40 -0.184,41 0.64,42 0.261,43 0.222,44 0.654,45 1.172,46 1,47 -0.233,48 1,49 1.058,50 12.5,51 3,52 2,53 1,54 6.049,55 8.687,56 8.687,57 6.049,58 8.687,59 1.554,60 5.9,61 1,62 4}
{0 CHEMBL198683,1 0.507,2 0.734,3 0.906,4 1.93,5 0.031,6 2.038,7 1.962,8 7.732,9 7,10 7.43,11 6.818,12 0.568,13 0.354,14 2,15 38.3,16 34.612,17 9.154,18 1,19 1,20 88.256,21 1.386,22 0.241,23 0.557,24 0.977,25 1.157,26 53.2,27 1.386,28 0.036,29 1.133,30 0.587,31 0.25,32 0.577,33 1,34 1,35 1,36 1,37 1,38 1,39 1,40 -0.121,41 0.817,42 0.218,43 0.263,44 0.635,45 1.258,46 1,47 -0.149,48 1,49 1.058,50 12.5,51 3,52 2,53 1,54 6.053,55 8.701,56 8.701,57 6.053,58 8.701,59 2.347,60 2.1,61 4,62 4}
{0 CHEMBL198699,1 0.674,2 0.843,3 0.908,4 1.081,5 -0.061,6 1.088,7 2.237,8 12.313,9 6,10 7.432,11 7.428,12 0.806,13 0.387,14 4,15 45.1,16 69.225,17 18.356,18 0.6,19 1,20 131.165,21 1.624,22 0.269,23 0.618,24 0.774,25 0.843,26 39.2,27 1.624,28 0.036,29 1.121,30 0.67,31 0.286,32 0.659,33 2,34 2,35 2,36 2,37 2,38 2,39 2,40 -0.207,41 0.683,42 0.288,43 0.194,44 0.685,45 0.915,46 2,47 -1.372,48 2,49 2.035,50 25,51 6,52 4,53 2,54 6.052,55 8.707,56 8.707,57 6.052,58 8.707,59 1.936,60 7.8,61 1,62 4}
{0 CHEMBL198705,1 0.86,2 0.998,3 0.853,4 -1.002,5 -0.156,6 0.968,7 2.58,8 7.45,9 4,10 7.432,11 7.428,12 0.765,13 0.353,14 4,15 42.6,16 69.225,17 18.376,18 0.1,19 1,20 112.213,21 1.715,22 0.281,23 0.643,24 0.795,25 0.78,26 37,27 1.715,28 0.045,29 1.126,30 0.672,31 0.298,32 0.682,33 2,34 2,35 2,36 2,37 2,38 2,39 2,40 -0.176,41 0.728,42 0.285,43 0.19,44 0.672,45 0.861,46 2,47 -2.281,48 2,49 2.035,50 26,51 6,52 4,53 2,54 6.07,55 8.776,56 8.776,57 6.07,58 8.776,59 1.828,60 13,61 1,62 5.292}
{0 CHEMBL198751,1 0.549,2 0.792,3 0.935,4 3.064,5 -0.01,6 1.461,7 2.087,8 14.512,9 5,10 7.43,11 6.818,12 0.792,13 0.425,14 2,15 45.2,16 34.612,17 9.223,18 0.6,19 1,20 138.926,21 1.523,22 0.266,23 0.598,24 0.765,25 0.948,26 42.9,27 1.523,28 0.039,29 1.118,30 0.652,31 0.282,32 0.636,33 1,34 1,35 1,36 1,37 1,38 1,39 1,40 -0.086,41 0.629,42 0.298,43 0.188,44 0.678,45 1.089,46 1,47 -0.382,48 1,49 1.081,50 19,51 3,52 2,53 1,54 6.055,55 8.724,56 8.724,57 6.055,58 8.724,59 1.965,60 7.1,62 4}
{0 CHEMBL198783,1 0.535,2 0.817,3 0.91,4 3.348,5 0.017,6 1.219,7 2.139,8 10.197,9 10,10 7.432,11 7.428,12 0.667,13 0.481,14 4,15 40.8,16 69.225,17 18.806,18 0.9,19 1,20 176.719,21 1.581,22 0.246,23 0.548,24 0.794,25 1.04,26 45.1,27 1.581,28 0.038,29 1.128,30 0.63,31 0.257,32 0.573,33 2,34 2,35 2,36 2,37 2,38 2,39 2,40 -0.095,41 0.86,42 0.267,43 0.218,44 0.654,45 1.23,46 2,47 -1.001,48 2,49 2.035,50 26,51 6,52 4,53 2,54 6.177,55 9.177,56 9.177,57 6.177,58 9.177,59 2.625,60 8.5,61 3,62 4}
{0 CHEMBL198787,1 0.517,2 0.769,3 0.925,4 2.746,5 0.008,6 1.691,7 2.17,8 13.91,9 12,10 7.432,11 7.428,12 0.758,13 0.465,14 4,15 43.9,16 69.225,17 18.536,18 0.8,19 1,20 163.418,21 1.585,22 0.257,23 0.586,24 0.763,25 0.954,26 42.1,27 1.585,28 0.04,29 1.123,30 0.653,31 0.272,32 0.62,33 2,34 2,35 2,36 2,37 2,38 2,39 2,40 -0.185,41 0.726,42 0.285,43 0.2,44 0.675,45 1.097,46 2,47 -1.065,48 2,49 2.035,50 25,51 6,52 4,53 2,54 6.05,55 8.689,56 8.689,57 6.05,58 8.689,59 2.215,60 7,61 1,62 4}
{0 CHEMBL198793,1 0.665,2 0.836,3 0.907,4 1.418,5 -0.051,6 1.477,7 2.173,8 12.218,9 10,10 7.432,11 7.428,12 0.781,13 0.375,14 4,15 44.4,16 69.225,17 18.378,18 0.6,19 1,20 131.165,21 1.604,22 0.263,23 0.611,24 0.79,25 0.869,26 40.7,27 1.604,28 0.041,29 1.122,30 0.661,31 0.279,32 0.649,33 2,34 2,35 2,36 2,37 2,38 2,39 2,40 -0.063,41 0.713,42 0.279,43 0.203,44 0.68,45 0.941,46 2,47 -1.12,48 2,49 2.035,50 25,51 6,52 4,53 2,54 6.049,55 8.686,56 8.686,57 6.049,58 8.686,59 2.023,60 7.4,61 2,62 4}
{0 CHEMBL198838,1 0.499,2 0.511,3 0.932,4 2.05,5 0.003,6 1.459,7 2.514,8 12.764,9 10,10 7.815,11 7.43,12 0.86,13 0.543,14 2,15 45,16 34.612,17 9.162,18 0.4,19 1,20 125.556,21 1.662,22 0.29,23 0.64,24 0.667,25 0.886,26 37.5,27 1.662,28 0.042,29 1.121,30 0.677,31 0.312,32 0.689,33 1,34 1,35 1,36 1,37 1,38 1,39 1,40 -0.095,41 0.585,42 0.308,43 0.174,44 0.685,45 0.972,46 1,47 -0.598,48 1,49 2.035,50 21.5,51 3,52 2,53 1,54 6.055,55 8.708,56 8.708,57 6.055,58 8.708,59 1.653,60 10,62 4}
{0 CHEMBL198839,1 0.657,2 0.829,3 0.907,4 1.19,5 -0.042,6 1.161,7 2.162,8 12.496,9 8,10 7.432,11 7.428,12 0.758,13 0.364,14 4,15 43.9,16 69.225,17 18.404,18 0.8,19 1,20 131.165,21 1.585,22 0.257,23 0.601,24 0.806,25 0.894,26 42.1,27 1.585,28 0.034,29 1.123,30 0.653,31 0.272,32 0.635,33 2,34 2,35 2,36 2,37 2,38 2,39 2,40 -0.14,41 0.749,42 0.27,43 0.212,44 0.675,45 0.964,46 2,47 -1.111,48 2,49 2.035,50 25,51 6,52 4,53 2,54 6.052,55 8.706,56 8.706,57 6.052,58 8.706,59 2.126,60 7,61 3,62 4}
{0 CHEMBL198841,1 0.484,2 0.615,3 0.941,4 2.392,5 0.024,6 1.409,7 2.115,8 13.761,9 8,10 7.432,11 7.428,12 0.727,13 0.364,14 4,15 45.5,16 69.225,17 18.474,18 0.8,19 1,20 138.166,21 1.669,22 0.272,23 0.59,24 0.585,25 0.849,26 40,27 1.669,28 0.034,29 1.117,30 0.681,31 0.289,32 0.625,33 2,34 2,35 2,36 2,37 2,38 2,39 2,40 -0.133,41 0.813,42 0.26,43 0.222,44 0.714,45 0.865,46 2,47 -0.897,48 2,49 2.035,50 24,51 6,52 4,53 2,54 6.052,55 8.706,56 8.706,57 6.052,58 8.706,59 2.167,60 3.6,61 3,62 4}
{0 CHEMBL198857,1 0.514,2 0.731,3 0.908,4 1.917,5 0.006,6 1.709,7 1.985,8 7.676,9 6,10 7.43,11 6.818,12 0.658,13 0.41,14 2,15 39.5,16 34.612,17 9.013,18 1,19 1,20 88.256,21 1.457,22 0.265,23 0.622,24 0.905,25 1.096,26 50,27 1.457,28 0.041,29 1.132,30 0.605,31 0.278,32 0.65,33 1,34 1,35 1,36 1,37 1,38 1,39 1,40 -0.181,41 0.693,42 0.252,43 0.225,44 0.646,45 1.212,46 1,47 -0.188,48 1,49 1.058,50 12.5,51 3,52 2,53 1,54 6.053,55 8.701,56 8.701,57 6.053,58 8.701,59 1.835,60 2.6,61 1,62 4}
{0 CHEMBL198885,1 0.638,2 0.804,3 0.888,4 0.863,5 -0.015,6 1.631,7 2.017,8 6.343,9 6,10 7.43,11 6.818,12 0.625,13 0.309,14 2,15 40,16 34.612,17 9.025,18 1,19 1,20 65.583,21 1.461,22 0.263,23 0.617,24 0.925,25 1.05,26 50,27 1.461,28 0.039,29 1.129,30 0.605,31 0.275,32 0.644,33 1,34 1,35 1,36 1,37 1,38 1,39 1,40 -0.085,41 0.746,42 0.223,43 0.26,44 0.644,45 1.116,46 1,47 -0.275,48 1,49 1.058,50 12.5,51 3,52 2,53 1,54 6.049,55 8.685,56 8.685,57 6.049,58 8.685,59 1.893,60 5,61 4,62 4}
{0 CHEMBL198889,1 0.64,2 0.781,3 0.921,4 2.301,5 -0.066,6 1.515,7 2.701,8 13.115,9 8,10 7.475,11 7.43,12 0.8,13 0.453,14 3,15 46.3,16 34.612,17 9.176,18 0.6,19 1,20 126.895,21 1.584,22 0.277,23 0.645,24 0.734,25 0.867,26 39,27 1.584,28 0.042,29 1.116,30 0.673,31 0.296,32 0.69,33 1,34 1,35 1,36 1,37 1,38 1,39 1,40 -0.058,41 0.62,42 0.298,43 0.183,44 0.687,45 0.975,46 1,47 -1.592,48 1,49 1.437,50 20,51 4,52 3,53 1,54 6.055,55 8.708,56 8.708,57 6.055,58 8.708,59 1.662,60 9.8,62 4}
{0 CHEMBL198901,1 0.684,2 0.852,3 0.908,4 1.292,5 -0.074,6 1.307,7 2.278,8 11.987,9 8,10 7.432,11 7.427,12 0.833,13 0.399,14 4,15 45.8,16 69.225,17 18.323,18 0.4,19 1,20 131.165,21 1.644,22 0.275,23 0.616,24 0.757,25 0.813,26 37.5,27 1.644,28 0.043,29 1.12,30 0.68,31 0.294,32 0.66,33 2,34 2,35 2,36 2,37 2,38 2,39 2,40 -0.187,41 0.646,42 0.297,43 0.184,44 0.691,45 0.887,46 2,47 -1.478,48 2,49 2.035,50 25,51 6,52 4,53 2,54 6.051,55 8.69,56 8.69,57 6.051,58 8.69,59 1.9,60 8.3,62 4}
{0 CHEMBL198911,1 0.665,2 0.866,3 0.895,4 1.393,5 -0.036,6 1.149,7 2.17,8 9.145,9 10,10 7.432,11 7.428,12 0.684,13 0.405,14 4,15 41.2,16 69.225,17 18.609,18 0.9,19 1,20 144.466,21 1.597,22 0.251,23 0.589,24 0.814,25 0.975,26 44.1,27 1.597,28 0.037,29 1.127,30 0.636,31 0.262,32 0.617,33 2,34 2,35 2,36 2,37 2,38 2,39 2,40 -0.146,41 0.84,42 0.261,43 0.221,44 0.657,45 1.109,46 2,47 -1.167,48 2,49 2.035,50 26,51 6,52 4,53 2,54 6.099,55 8.879,56 8.879,57 6.099,58 8.879,59 2.332,60 8.8,61 4,62 4}
{0 CHEMBL198915,1 0.814,2 0.984,3 0.867,4 -1.619,5 -0.132,6 0.628,7 2.43,8 4.919,10 7.432,11 7.427,12 0.75,13 0.427,14 4,15 41.4,16 69.225,17 18.588,18 0.3,19 1,20 125.513,21 1.718,22 0.277,23 0.634,24 0.771,25 0.855,26 37.9,27 1.718,28 0.043,29 1.128,30 0.665,31 0.293,32 0.67,33 2,34 2,35 2,36 2,37 2,38 2,39 2,40 -0.155,41 0.755,42 0.29,43 0.187,44 0.664,45 1.009,46 2,47 -2.152,48 2,49 2.035,50 27,51 6,52 4,53 2,54 6.377,55 9.619,56 9.619,57 6.377,58 9.619,59 1.935,60 13.8,62 5.046}
{0 CHEMBL198947,1 0.479,2 0.653,3 0.942,4 1.563,5 0.025,6 1.762,7 2.094,8 18.311,9 10,10 7.432,11 7.428,12 0.8,13 0.399,14 4,15 46.2,16 69.225,17 18.365,18 0.6,19 1,20 150.118,21 1.505,22 0.248,23 0.552,24 0.784,25 0.908,26 42.3,27 1.505,28 0.033,29 1.118,30 0.659,31 0.264,32 0.588,33 2,34 2,35 2,36 2,37 2,38 2,39 2,40 -0.072,41 0.694,42 0.281,43 0.207,44 0.688,45 0.978,46 2,47 -0.774,48 2,49 2.035,50 24,51 6,52 4,53 2,54 6.049,55 8.681,56 8.681,57 6.049,58 8.681,59 2.351,60 3.8,61 2,62 4}
{0 CHEMBL198967,1 0.671,2 0.872,3 0.895,4 1.338,5 -0.044,6 1.19,7 2.195,8 9.089,9 10,10 7.432,11 7.428,12 0.703,13 0.416,14 4,15 41.5,16 69.225,17 18.592,18 0.9,19 1,20 144.466,21 1.615,22 0.255,23 0.602,24 0.801,25 0.957,26 43.1,27 1.615,28 0.038,29 1.127,30 0.641,31 0.268,32 0.631,33 2,34 2,35 2,36 2,37 2,38 2,39 2,40 -0.154,41 0.812,42 0.268,43 0.214,44 0.66,45 1.094,46 2,47 -1.255,48 2,49 2.035,50 26,51 6,52 4,53 2,54 6.099,55 8.879,56 8.879,57 6.099,58 8.879,59 2.219,60 9.2,61 3,62 4}
{0 CHEMBL198971,1 0.508,2 0.76,3 0.923,4 2.842,5 0.022,6 1.765,7 2.098,8 14.086,9 14,10 7.432,11 7.428,12 0.714,13 0.439,14 4,15 42.9,16 69.225,17 18.576,18 0.8,19 1,20 163.418,21 1.549,22 0.246,23 0.567,24 0.798,25 0.99,26 44.4,27 1.549,28 0.038,29 1.124,30 0.639,31 0.259,32 0.596,33 2,34 2,35 2,36 2,37 2,38 2,39 2,40 -0.133,41 0.787,42 0.269,43 0.217,44 0.666,45 1.125,46 2,47 -0.817,48 2,49 2.035,50 25,51 6,52 4,53 2,54 6.05,55 8.688,56 8.688,57 6.05,58 8.688,59 2.412,60 6.3,61 3,62 4}
{0 CHEMBL199005,1 0.484,2 0.655,3 0.944,4 1.529,5 0.017,6 1.681,7 2.135,8 18.2,9 10,10 7.432,11 7.428,12 0.828,13 0.412,14 4,15 46.9,16 69.225,17 18.339,18 0.6,19 1,20 150.118,21 1.523,22 0.254,23 0.556,24 0.763,25 0.884,26 40.8,27 1.523,28 0.034,29 1.117,30 0.668,31 0.271,32 0.594,33 2,34 2,35 2,36 2,37 2,38 2,39 2,40 -0.197,41 0.659,42 0.291,43 0.196,44 0.694,45 0.956,46 2,47 -0.913,48 2,49 2.035,50 24,51 6,52 4,53 2,54 6.049,55 8.682,56 8.682,57 6.049,58 8.682,59 2.281,60 4.1,61 1,62 4}
{0 CHEMBL199009,1 0.686,2 0.869,3 0.913,4 2.391,5 -0.066,6 1.289,7 2.159,8 11.878,9 6,10 7.43,11 6.818,12 0.78,13 0.408,14 2,15 44.2,16 34.612,17 9.21,18 0.6,19 1,20 129.45,21 1.571,22 0.273,23 0.634,24 0.769,25 0.924,26 41.9,27 1.571,28 0.043,29 1.12,30 0.654,31 0.29,32 0.673,33 1,34 1,35 1,36 1,37 1,38 1,39 1,40 -0.129,41 0.643,42 0.296,43 0.187,44 0.673,45 1.066,46 1,47 -0.549,48 1,49 1.081,50 19.5,51 3,52 2,53 1,54 6.1,55 8.882,56 8.882,57 6.1,58 8.882,59 1.777,60 9.3,62 4}
{0 CHEMBL199010,1 0.775,2 0.913,3 0.901,4 1.425,5 -0.112,6 1.181,7 2.194,8 11.223,9 5,10 7.43,11 6.818,12 0.813,13 0.356,14 2,15 45,16 34.612,17 9.14,18 0.6,19 1,20 113.323,21 1.595,22 0.281,23 0.656,24 0.776,25 0.852,26 40,27 1.595,28 0.046,29 1.119,30 0.665,31 0.3,32 0.699,33 1,34 1,35 1,36 1,37 1,38 1,39 1,40 -0.097,41 0.613,42 0.298,43 0.182,44 0.679,45 0.95,46 1,47 -0.63,48 1,49 1.081,50 19.5,51 3,52 2,53 1,54 6.069,55 8.774,56 8.774,57 6.069,58 8.774,59 1.6,60 10,62 4}
{0 CHEMBL199105,1 0.517,2 0.769,3 0.925,4 2.573,5 0.008,6 1.257,7 2.178,8 14.001,9 6,10 7.432,11 7.428,12 0.758,13 0.465,14 4,15 43.9,16 69.225,17 18.58,18 0.8,19 1,20 163.418,21 1.585,22 0.257,23 0.586,24 0.763,25 0.954,26 42.1,27 1.585,28 0.035,29 1.123,30 0.653,31 0.272,32 0.62,33 2,34 2,35 2,36 2,37 2,38 2,39 2,40 -0.151,41 0.733,42 0.285,43 0.2,44 0.675,45 1.097,46 2,47 -1.106,48 2,49 2.035,50 25,51 6,52 4,53 2,54 6.054,55 8.718,56 8.718,57 6.054,58 8.718,59 2.215,60 7,61 1,62 4}
{0 CHEMBL199112,1 0.483,2 0.615,3 0.941,4 2.117,5 0.026,6 1.698,7 2.13,8 13.905,9 16,10 7.432,11 7.428,12 0.727,13 0.364,14 4,15 45.5,16 69.225,17 18.499,18 0.8,19 1,20 138.166,21 1.669,22 0.272,23 0.59,24 0.585,25 0.849,26 40,27 1.669,28 0.038,29 1.117,30 0.681,31 0.289,32 0.625,33 2,34 2,35 2,36 2,37 2,38 2,39 2,40 -0.115,41 0.823,42 0.261,43 0.222,44 0.714,45 0.865,46 2,47 -0.974,48 2,49 2.035,50 24,51 6,52 4,53 2,54 6.156,55 9.042,56 9.042,57 6.156,58 9.042,59 2.167,60 3.6,61 3,62 4}
{0 CHEMBL199184,1 0.524,2 0.721,3 0.954,4 3.365,5 -0.009,6 1.745,7 2.066,8 14.778,9 5,10 7.43,11 6.818,12 0.804,13 0.371,14 2,15 47.4,16 80.567,17 9.185,18 0.6,19 1,20 125.855,21 1.625,22 0.289,23 0.634,24 0.494,25 0.82,26 39.5,27 1.625,28 0.04,29 1.11,30 0.689,31 0.31,32 0.678,33 1,34 1,35 1,36 1,37 1,38 1,39 1,40 -0.11,41 0.699,42 0.281,43 0.202,44 0.726,45 0.799,46 1,47 -0.333,48 1,49 1.081,50 18.5,51 3,52 2,53 1,54 6.054,55 8.713,56 8.713,57 6.054,58 8.713,59 1.688,60 5.3,62 4}
{0 CHEMBL199185,1 0.478,2 0.612,3 0.939,4 2.158,5 0.031,6 1.631,7 2.107,8 13.967,9 16,10 7.432,11 7.428,12 0.706,13 0.353,14 4,15 44.8,16 69.225,17 18.518,18 0.8,19 1,20 138.166,21 1.647,22 0.266,23 0.578,24 0.599,25 0.871,26 41.4,27 1.647,28 0.037,29 1.118,30 0.672,31 0.281,32 0.611,33 2,34 2,35 2,36 2,37 2,38 2,39 2,40 -0.106,41 0.853,42 0.253,43 0.231,44 0.707,45 0.887,46 2,47 -0.893,48 2,49 2.035,50 24,51 6,52 4,53 2,54 6.156,55 9.042,56 9.042,57 6.156,58 9.042,59 2.28,60 3.4,61 4,62 4}
{0 CHEMBL199213,1 0.626,2 0.752,3 0.905,4 1.288,5 -0.038,6 1.273,7 2.73,8 11.624,9 14,10 7.478,11 7.472,12 0.711,13 0.465,14 6,15 43.8,16 69.225,17 18.525,18 0.7,19 1,20 139.356,21 1.62,22 0.256,23 0.586,24 0.769,25 0.898,26 40.6,27 1.62,28 0.036,29 1.122,30 0.659,31 0.27,32 0.619,33 2,34 2,35 2,36 2,37 2,38 2,39 2,40 -0.069,41 0.804,42 0.264,43 0.216,44 0.674,45 0.985,46 2,47 -3.338,48 2,49 2.035,50 27,51 8,52 6,53 2,54 6.053,55 8.701,56 8.701,57 6.053,58 8.701,59 2.285,60 9.4,61 4,62 4}
{0 CHEMBL199265,1 0.504,2 0.631,3 0.947,4 1.921,5 0.003,6 1.506,7 2.265,8 13.627,9 12,10 7.432,11 7.427,12 0.8,13 0.399,14 4,15 47.8,16 69.225,17 18.429,18 0.4,19 1,20 138.166,21 1.739,22 0.293,23 0.604,24 0.544,25 0.772,26 34.8,27 1.739,28 0.041,29 1.113,30 0.714,31 0.315,32 0.649,33 2,34 2,35 2,36 2,37 2,38 2,39 2,40 -0.2,41 0.727,42 0.287,43 0.195,44 0.739,45 0.79,46 2,47 -1.436,48 2,49 2.035,50 24,51 6,52 4,53 2,54 6.157,55 9.043,56 9.043,57 6.157,58 9.043,59 1.94,60 4.3,62 4}
{0 CHEMBL199469,1 0.896,2 1.037,3 0.849,4 -3.791,5 -0.172,6 0.721,7 2.421,8 4.208,9 2,10 7.432,11 7.428,12 0.771,13 0.344,14 4,15 41.8,16 69.225,17 18.385,18 0.1,19 1,20 93.26,21 1.736,22 0.283,23 0.63,24 0.804,25 0.759,26 36.4,27 1.736,28 0.043,29 1.127,30 0.673,31 0.3,32 0.668,33 2,34 2,35 2,36 2,37 2,38 2,39 2,40 -0.175,41 0.734,42 0.284,43 0.189,44 0.668,45 0.844,46 2,47 -2.187,48 2,49 2.035,50 27,51 6,52 4,53 2,54 6.315,55 9.349,56 9.349,57 6.315,58 9.349,59 1.919,60 14.5,61 1,62 5.77}
{0 CHEMBL200345,1 0.55,2 0.833,3 0.912,4 3.107,5 -0.007,6 0.968,7 2.275,8 9.96,9 6,10 7.432,11 7.427,12 0.722,13 0.52,14 4,15 41.9,16 69.225,17 18.76,18 0.8,19 1,20 176.719,21 1.633,22 0.261,23 0.57,24 0.748,25 0.995,26 41.9,27 1.633,28 0.041,29 1.126,30 0.648,31 0.274,32 0.6,33 2,34 2,35 2,36 2,37 2,38 2,39 2,40 -0.134,41 0.776,42 0.289,43 0.194,44 0.663,45 1.203,46 2,47 -1.468,48 2,49 2.035,50 26,51 6,52 4,53 2,54 6.177,55 9.177,56 9.177,57 6.177,58 9.177,59 2.379,60 9.7,62 4}
{0 CHEMBL200380,1 0.534,2 0.796,3 0.893,4 1.863,5 0.036,6 1.354,7 2.015,8 5.236,9 5,10 7.43,11 6.818,12 0.565,13 0.419,14 2,15 38.3,16 34.612,17 9.191,18 1,19 1,20 88.359,21 1.473,22 0.256,23 0.568,24 0.902,25 1.145,26 51.1,27 1.473,28 0.038,29 1.132,30 0.595,31 0.265,32 0.588,33 1,34 1,35 1,36 1,37 1,38 1,39 1,40 -0.075,41 0.82,42 0.226,43 0.259,44 0.633,45 1.305,46 1,47 -0.272,48 1,49 1.058,50 13,51 3,52 2,53 1,54 6.177,55 9.177,56 9.177,57 6.177,58 9.177,59 2.287,60 6.4,61 4,62 4}
{0 CHEMBL200843,1 0.465,2 0.397,3 0.898,4 0.373,5 0.043,6 1.219,7 2.517,8 5.809,9 6,10 7.815,11 7.43,12 0.682,13 0.519,14 2,15 39,16 34.612,17 9.064,18 0.8,19 1,20 68.339,21 1.596,22 0.283,23 0.613,24 0.793,25 1.048,26 46.3,27 1.596,28 0.035,29 1.133,30 0.62,31 0.298,32 0.646,33 1,34 1,35 1,36 1,37 1,38 1,39 1,40 -0.111,41 0.725,42 0.238,43 0.242,44 0.646,45 1.113,46 1,47 -0.513,48 1,49 2.035,50 15,51 3,52 2,53 1,54 6.07,55 8.795,56 8.795,57 6.07,58 8.795,59 1.895,60 7.3,61 4,62 4}
{0 CHEMBL200917,1 0.478,2 0.605,3 0.913,4 1.197,5 0.037,6 1.877,7 2.01,8 7.119,9 8,10 7.43,11 6.818,12 0.6,13 0.309,14 2,15 41,16 34.612,17 9.067,18 1,19 1,20 69.083,21 1.524,22 0.276,23 0.605,24 0.69,25 1.002,26 48.7,27 1.524,28 0.037,29 1.125,30 0.624,31 0.288,32 0.633,33 1,34 1,35 1,36 1,37 1,38 1,39 1,40 -0.078,41 0.803,42 0.215,43 0.269,44 0.671,45 1.017,46 1,47 -0.266,48 1,49 1.058,50 12,51 3,52 2,53 1,54 6.156,55 9.042,56 9.042,57 6.156,58 9.042,59 1.941,60 2.6,61 4,62 4}
{0 CHEMBL200918,1 0.48,2 0.605,3 0.913,4 1.41,5 0.036,6 1.866,7 1.987,8 6.998,9 6,10 7.43,11 6.818,12 0.6,13 0.309,14 2,15 41,16 34.612,17 9.048,18 1,19 1,20 69.083,21 1.524,22 0.276,23 0.605,24 0.69,25 1.002,26 48.7,27 1.524,28 0.039,29 1.125,30 0.624,31 0.288,32 0.633,33 1,34 1,35 1,36 1,37 1,38 1,39 1,40 -0.081,41 0.791,42 0.215,43 0.269,44 0.671,45 1.017,46 1,47 -0.207,48 1,49 1.058,50 12,51 3,52 2,53 1,54 6.049,55 8.685,56 8.685,57 6.049,58 8.685,59 1.941,60 2.6,61 4,62 4}
{0 CHEMBL200929,1 0.653,2 0.841,3 0.88,4 0.875,5 -0.016,6 1.302,7 2.061,8 4.702,9 5,10 7.43,11 6.818,12 0.591,13 0.359,14 2,15 38.6,16 34.612,17 9.102,18 1,19 1,20 72.233,21 1.497,22 0.264,23 0.615,24 0.907,25 1.088,26 50,27 1.497,28 0.037,29 1.131,30 0.601,31 0.274,32 0.639,33 1,34 1,35 1,36 1,37 1,38 1,39 1,40 -0.124,41 0.788,42 0.225,43 0.257,44 0.636,45 1.207,46 1,47 -0.38,48 1,49 1.058,50 13,51 3,52 2,53 1,54 6.099,55 8.879,56 8.879,57 6.099,58 8.879,59 1.972,60 6.8,61 4,62 4}
{0 CHEMBL2062731,1 0.576,2 0.647,3 0.981,4 1.843,5 -0.081,6 1.051,7 1.855,8 5.1,10 7.429,11 5.024,12 0.625,13 0.716,14 1,15 47.6,16 18.011,18 0.4,19 1,20 43.32,21 2.067,22 0.43,23 0.748,24 0.551,25 0.54,26 23.8,27 2.067,28 0.036,29 1.08,30 0.826,31 0.471,32 0.818,40 -0.159,41 0.752,42 0.236,43 0.235,44 0.893,45 0.525,47 0.818,48 1,49 1.059,50 10,51 3,52 3,53 2,54 6.154,55 9.121,56 9.121,57 6.154,58 9.121,59 0.798,60 4.8,62 4.742}
{0 CHEMBL2062743,1 0.589,2 0.772,3 0.929,4 1.823,5 -0.036,6 1.043,7 1.675,8 7.781,9 6,10 7.428,11 4.865,12 0.457,13 0.659,14 1,15 37.8,18 1,19 1,20 67.831,21 1.634,22 0.287,23 0.6,24 0.697,25 1.016,26 48.9,27 1.634,28 0.034,29 1.12,30 0.625,31 0.298,32 0.623,40 -0.192,41 0.901,42 0.21,43 0.268,44 0.685,45 0.961,46 1,47 1.299,48 1,49 1.192,50 10.5,51 3,52 3,53 2,54 6.644,55 10.527,56 10.527,57 6.644,58 10.527,59 2.069,60 4.4,61 1,62 5.155}
{0 CHEMBL2062753,1 0.636,2 0.773,3 0.931,4 1.792,5 -0.056,6 1.073,7 1.728,8 7.737,9 6,10 7.428,11 4.868,12 0.479,13 0.67,14 1,15 39.1,18 1,19 1,20 83.598,21 1.629,22 0.283,23 0.63,24 0.693,25 0.994,26 47.8,27 1.629,28 0.037,29 1.118,30 0.633,31 0.295,32 0.656,40 -0.123,41 0.868,42 0.224,43 0.256,44 0.692,45 0.946,46 1,47 1.155,48 2,49 1.22,50 11.5,51 3,52 3,53 3,54 6.647,55 10.555,56 10.555,57 6.647,58 10.555,59 1.898,60 4.3,61 1,62 5.229}
{0 CHEMBL2062756,1 0.657,2 0.729,3 0.977,4 1.498,5 -0.087,6 1.162,7 2.759,8 7.522,9 5,10 7.475,11 7.427,12 0.614,13 0.729,14 2,15 46.7,18 0.4,19 0.667,20 51.697,21 2.013,22 0.376,23 0.789,24 0.603,25 0.611,26 26.7,27 2.013,28 0.043,29 1.083,30 0.789,31 0.41,32 0.862,40 -0.201,41 0.847,42 0.236,43 0.239,44 0.841,45 0.6,47 -0.786,48 1,49 2.376,50 13.5,51 3,52 4,53 2,54 6.67,55 10.68,56 10.68,57 6.67,58 10.68,59 0.679,60 10,62 4}
{0 CHEMBL307346,1 1.805,2 1.462,3 0.853,5 -0.225,6 0.856,7 0.377,10 4.417,11 4.249,13 0.126,15 30.6,18 0.3,20 25.189,21 1,22 0.169,23 0.23,24 1.524,25 1.606,26 67.7,27 1,28 0.015,29 1.145,30 0.497,31 0.168,32 0.229,40 -0.005,41 1.324,42 0.039,43 0.439,44 0.574,45 1.66,54 6.394,55 9.951,56 9.951,57 6.394,58 9.951,59 4.589,61 14,62 5.36}
{0 CHEMBL321384,1 0.609,2 0.826,3 0.868,5 0.003,6 2.14,7 1.452,9 2,10 7.429,11 4.361,12 0.075,13 0.301,14 1,15 30.4,16 18.011,18 0.4,20 21.497,21 1.207,22 0.208,23 0.334,24 1.312,25 1.524,26 64.3,27 1.207,28 0.014,29 1.148,30 0.513,31 0.208,32 0.334,40 0.076,41 1.163,42 0.083,43 0.4,44 0.579,45 1.628,47 0.214,49 0.8,50 1.5,52 1,54 5.04,55 6.106,56 6.106,57 5.04,58 6.106,59 3.87,60 1.8,61 11,62 5.053}
{0 CHEMBL324402,1 1.838,2 1.459,3 0.846,5 -0.252,6 0.861,7 0.309,10 4.406,11 4.23,13 0.15,15 30.2,18 0.3,20 16.793,21 1.009,22 0.177,23 0.259,24 1.528,25 1.625,26 67.9,27 1.009,28 0.018,29 1.146,30 0.495,31 0.176,32 0.258,40 0.043,41 1.27,42 0.046,43 0.432,44 0.572,45 1.69,54 6.688,55 10.76,56 10.76,57 6.688,58 10.76,59 4.252,61 10,62 4.994}
{0 CHEMBL325636,1 1.826,2 1.46,3 0.849,5 -0.242,6 0.858,7 0.377,10 4.417,11 4.241,13 0.141,15 30.4,18 0.3,20 25.189,21 1.005,22 0.174,23 0.241,24 1.526,25 1.618,26 67.9,27 1.005,28 0.017,29 1.146,30 0.496,31 0.173,32 0.24,40 -0.007,41 1.274,42 0.043,43 0.432,44 0.573,45 1.679,54 6.394,55 9.951,56 9.951,57 6.394,58 9.951,59 4.414,61 12,62 5.089}
{0 CHEMBL325871,1 1.566,2 1.525,3 0.872,5 -0.147,6 0.828,7 0.628,10 5.007,11 4.248,15 30.4,18 0.3,21 1.026,22 0.187,23 0.27,24 1.532,25 1.536,26 67.4,27 1.026,28 0.007,29 1.146,30 0.498,31 0.186,32 0.268,40 -0.009,41 1.193,42 0.02,43 0.474,44 0.574,45 1.538,54 3.95,55 3.895,56 3.895,57 3.95,58 3.895,59 4.041,61 12,62 5.058}
{0 CHEMBL331817,1 1.558,2 1.52,3 0.877,5 -0.13,6 0.777,7 0.627,10 5.007,11 4.264,15 31,18 0.2,21 1.01,22 0.173,23 0.239,24 1.526,25 1.528,26 67.2,27 1.01,28 0.005,29 1.145,30 0.501,31 0.172,32 0.238,40 -0.005,41 1.303,42 0.016,43 0.48,44 0.577,45 1.529,54 3.97,55 3.937,56 3.937,57 3.97,58 3.937,59 4.461,61 16,62 4.508}
{0 CHEMBL358494,1 0.767,2 0.914,3 0.892,4 -0.688,5 -0.097,6 0.939,7 2.21,8 7.815,9 8,10 7.43,11 7.426,12 0.765,13 0.392,14 4,15 44.4,16 33.203,17 18.83,18 0.4,19 1,20 112.213,21 1.681,22 0.274,23 0.602,24 0.747,25 0.83,26 37,27 1.681,28 0.042,29 1.122,30 0.678,31 0.292,32 0.641,33 2,34 2,35 2,36 2,37 2,38 2,39 2,40 -0.16,41 0.75,42 0.284,43 0.193,44 0.682,45 0.94,46 4,47 -1.431,48 2,49 2.035,50 26,51 6,52 4,53 2,54 6.428,55 9.803,56 9.803,57 6.428,58 9.803,59 2.065,60 11.1,62 4}
{0 CHEMBL358746,1 0.881,2 1.022,3 0.851,4 -3.668,5 -0.156,6 0.771,7 2.39,8 4.275,9 2,10 7.432,11 7.428,12 0.75,13 0.334,14 4,15 41.4,16 69.225,17 18.41,18 0.3,19 1,20 93.26,21 1.718,22 0.277,23 0.623,24 0.812,25 0.791,26 37.9,27 1.718,28 0.042,29 1.128,30 0.665,31 0.293,32 0.658,33 2,34 2,35 2,36 2,37 2,38 2,39 2,40 -0.075,41 0.764,42 0.276,43 0.198,44 0.664,45 0.874,46 2,47 -2.016,48 2,49 2.035,50 27,51 6,52 4,53 2,54 6.315,55 9.349,56 9.349,57 6.315,58 9.349,59 2.001,60 13.8,61 2,62 5.678}
{0 CHEMBL369901,1 0.508,2 0.76,3 0.923,4 2.676,5 0.022,6 1.363,7 2.107,8 14.171,9 8,10 7.432,11 7.428,12 0.714,13 0.439,14 4,15 42.9,16 69.225,17 18.618,18 0.8,19 1,20 163.418,21 1.549,22 0.246,23 0.567,24 0.798,25 0.99,26 44.4,27 1.549,28 0.033,29 1.124,30 0.639,31 0.259,32 0.596,33 2,34 2,35 2,36 2,37 2,38 2,39 2,40 -0.102,41 0.794,42 0.269,43 0.217,44 0.666,45 1.125,46 2,47 -0.857,48 2,49 2.035,50 25,51 6,52 4,53 2,54 6.053,55 8.718,56 8.718,57 6.053,58 8.718,59 2.412,60 6.3,61 3,62 4}
{0 CHEMBL370661,1 0.686,2 0.887,3 0.895,4 1.187,5 -0.063,6 1.117,7 2.272,8 8.938,9 8,10 7.432,11 7.428,12 0.743,13 0.439,14 4,15 42.4,16 69.225,17 18.553,18 0.6,19 1,20 144.466,21 1.651,22 0.266,23 0.624,24 0.772,25 0.917,26 40.7,27 1.651,28 0.04,29 1.125,30 0.655,31 0.281,32 0.658,33 2,34 2,35 2,36 2,37 2,38 2,39 2,40 -0.205,41 0.753,42 0.283,43 0.197,44 0.667,45 1.062,46 2,47 -1.524,48 2,49 2.035,50 26,51 6,52 4,53 2,54 6.099,55 8.88,56 8.88,57 6.099,58 8.88,59 2.009,60 10.2,61 1,62 4}
{0 CHEMBL370812,1 0.478,2 0.628,3 0.919,4 1.751,5 0.041,6 1.761,7 1.969,8 7.493,9 4,10 7.43,11 6.818,12 0.6,13 0.309,14 2,15 41,16 80.567,17 9.077,18 1,19 1,20 68.638,21 1.524,22 0.276,23 0.605,24 0.525,25 0.967,26 48.7,27 1.524,28 0.034,29 1.123,30 0.629,31 0.288,32 0.633,33 1,34 1,35 1,36 1,37 1,38 1,39 1,40 -0.095,41 0.866,42 0.201,43 0.282,44 0.684,45 0.889,46 1,47 -0.164,48 1,49 1.058,50 12,51 3,52 2,53 1,54 6.052,55 8.706,56 8.706,57 6.052,58 8.706,59 1.941,60 2.6,61 4,62 4}
{0 CHEMBL370851,1 0.523,2 0.774,3 0.927,4 2.679,5 -0.001,6 1.536,7 2.23,8 13.789,9 10,10 7.432,11 7.427,12 0.781,13 0.479,14 4,15 44.4,16 69.225,17 18.512,18 0.6,19 1,20 163.418,21 1.604,22 0.263,23 0.589,24 0.745,25 0.934,26 40.7,27 1.604,28 0.041,29 1.122,30 0.661,31 0.279,32 0.625,33 2,34 2,35 2,36 2,37 2,38 2,39 2,40 -0.192,41 0.693,42 0.294,43 0.19,44 0.68,45 1.081,46 2,47 -1.268,48 2,49 2.035,50 25,51 6,52 4,53 2,54 6.051,55 8.692,56 8.692,57 6.051,58 8.692,59 2.156,60 7.4,62 4}
{0 CHEMBL371021,1 0.785,2 0.929,3 0.898,4 -0.043,5 -0.111,6 1.002,7 2.399,8 16.833,9 6,10 7.432,11 7.428,12 0.78,13 0.341,14 4,15 44.8,16 69.225,17 18.942,18 0.3,19 1,20 162.779,21 1.632,22 0.254,23 0.596,24 0.778,25 0.827,26 38.8,27 1.632,28 0.04,29 1.12,30 0.67,31 0.269,32 0.631,33 2,34 2,35 2,36 2,37 2,38 2,39 2,40 -0.067,41 0.792,42 0.289,43 0.192,44 0.68,45 0.915,46 2,47 -2.005,48 2,49 2.035,50 32,51 6,52 4,53 2,54 6.071,55 8.779,56 8.779,57 6.071,58 8.779,59 2.236,60 10.4,61 1,62 4}
{0 CHEMBL371093,1 0.607,2 0.727,3 0.888,4 0.777,5 -0.021,6 1.447,7 2.68,8 6.002,9 7,10 7.475,11 7.43,12 0.614,13 0.412,14 3,15 40.5,16 34.612,17 9.068,18 1,19 1,20 69.678,21 1.519,22 0.269,23 0.619,24 0.865,25 1.025,26 47.6,27 1.519,28 0.036,29 1.128,30 0.617,31 0.282,32 0.648,33 1,34 1,35 1,36 1,37 1,38 1,39 1,40 -0.055,41 0.761,42 0.228,43 0.253,44 0.648,45 1.108,46 1,47 -1.402,48 1,49 1.437,50 13.5,51 4,52 3,53 1,54 6.053,55 8.701,56 8.701,57 6.053,58 8.701,59 1.898,60 7.1,61 4,62 4}
{0 CHEMBL371102,1 0.773,2 0.943,3 0.871,4 -1.18,5 -0.086,6 0.78,7 2.253,8 5.157,9 4,10 7.432,11 7.428,12 0.675,13 0.386,14 4,15 40,16 69.225,17 18.663,18 0.6,19 1,20 125.513,21 1.646,22 0.257,23 0.595,24 0.817,25 0.943,26 42.9,27 1.646,28 0.04,29 1.13,30 0.638,31 0.269,32 0.622,33 2,34 2,35 2,36 2,37 2,38 2,39 2,40 -0.104,41 0.867,42 0.261,43 0.218,44 0.651,45 1.082,46 2,47 -1.539,48 2,49 2.035,50 27,51 6,52 4,53 2,54 6.377,55 9.619,56 9.619,57 6.377,58 9.619,59 2.315,60 11.4,61 4,62 4.097}
{0 CHEMBL371250,1 0.493,2 0.629,3 0.924,4 1.736,5 0.013,6 1.444,7 1.991,8 7.44,9 3,10 7.43,11 6.818,12 0.706,13 0.364,14 2,15 43.3,16 80.567,17 8.936,18 0.8,19 1,20 68.638,21 1.633,22 0.314,23 0.691,24 0.499,25 0.865,26 43.3,27 1.633,28 0.039,29 1.118,30 0.665,31 0.333,32 0.733,33 1,34 1,35 1,36 1,37 1,38 1,39 1,40 -0.22,41 0.737,42 0.237,43 0.244,44 0.713,45 0.788,46 1,47 -0.203,48 1,49 1.058,50 12,51 3,52 2,53 1,54 6.052,55 8.706,56 8.706,57 6.052,58 8.706,59 1.309,60 3.3,61 1,62 4}
{0 CHEMBL371303,1 0.763,2 0.918,3 0.888,4 -0.752,5 -0.087,6 1.057,7 2.327,8 7.779,9 8,10 7.432,11 7.427,12 0.722,13 0.326,14 4,15 43.3,16 69.225,17 18.932,18 0.7,19 1,20 112.213,21 1.644,22 0.263,23 0.613,24 0.794,25 0.829,26 40,27 1.644,28 0.048,29 1.123,30 0.661,31 0.278,32 0.648,33 2,34 2,35 2,36 2,37 2,38 2,39 2,40 -0.009,41 0.847,42 0.26,43 0.218,44 0.673,45 0.898,46 2,47 -1.764,48 2,49 2.035,50 26,51 6,52 4,53 2,54 6.257,55 9.44,56 9.44,57 6.257,58 9.44,59 2.079,60 10,61 6,62 4.022}
{0 CHEMBL371526,1 0.804,2 0.93,3 0.862,4 -0.833,5 -0.115,6 1.113,7 2.543,8 7.602,9 8,10 7.435,11 7.431,12 0.765,13 0.424,14 4,15 44.4,16 33.203,17 18.294,18 0.4,19 1,20 117.186,21 1.635,22 0.268,23 0.616,24 0.75,25 0.844,26 37,27 1.635,28 0.043,29 1.119,30 0.676,31 0.284,32 0.654,33 2,34 2,35 2,36 2,37 2,38 2,39 2,40 -0.116,41 0.728,42 0.28,43 0.198,44 0.676,45 0.973,46 4,47 -2.362,48 2,49 2.035,50 26,51 6,52 4,53 2,54 6.068,55 8.769,56 8.769,57 6.068,58 8.769,59 1.991,60 14.8,61 2,62 4.215}
{0 CHEMBL371657,1 0.633,2 0.758,3 0.905,4 1.248,5 -0.045,6 1.322,7 2.736,8 11.548,9 14,10 7.478,11 7.472,12 0.73,13 0.477,14 6,15 44.3,16 69.225,17 18.506,18 0.5,19 1,20 139.356,21 1.637,22 0.26,23 0.596,24 0.755,25 0.876,26 39.3,27 1.637,28 0.037,29 1.121,30 0.666,31 0.276,32 0.632,33 2,34 2,35 2,36 2,37 2,38 2,39 2,40 -0.074,41 0.776,42 0.271,43 0.209,44 0.678,45 0.965,46 2,47 -3.44,48 2,49 2.035,50 27,51 8,52 6,53 2,54 6.053,55 8.702,56 8.702,57 6.053,58 8.702,59 2.183,60 9.8,61 3,62 4}
{0 CHEMBL371711,1 0.635,2 0.746,3 0.886,4 0.763,5 -0.054,6 1.349,7 2.684,8 5.946,9 6,10 7.475,11 7.43,12 0.711,13 0.477,14 3,15 42.4,16 34.612,17 8.927,18 0.8,19 1,20 69.678,21 1.609,22 0.3,23 0.697,24 0.788,25 0.931,26 42.4,27 1.609,28 0.041,29 1.125,30 0.647,31 0.319,32 0.74,33 1,34 1,35 1,36 1,37 1,38 1,39 1,40 -0.123,41 0.632,42 0.264,43 0.214,44 0.665,45 1.022,46 1,47 -1.445,48 1,49 1.437,50 13.5,51 4,52 3,53 1,54 6.053,55 8.701,56 8.701,57 6.053,58 8.701,59 1.311,60 9.1,61 1,62 4}
{0 CHEMBL371714,1 0.48,2 0.612,3 0.939,4 2.429,5 0.029,6 1.355,7 2.092,8 13.826,9 8,10 7.432,11 7.428,12 0.706,13 0.353,14 4,15 44.8,16 69.225,17 18.494,18 0.8,19 1,20 138.166,21 1.647,22 0.266,23 0.578,24 0.599,25 0.871,26 41.4,27 1.647,28 0.033,29 1.118,30 0.672,31 0.281,32 0.611,33 2,34 2,35 2,36 2,37 2,38 2,39 2,40 -0.122,41 0.843,42 0.252,43 0.231,44 0.707,45 0.887,46 2,47 -0.816,48 2,49 2.035,50 24,51 6,52 4,53 2,54 6.052,55 8.706,56 8.706,57 6.052,58 8.706,59 2.28,60 3.4,61 4,62 4}
{0 CHEMBL371768,1 0.499,2 0.511,3 0.932,4 1.857,5 0.003,6 1.276,7 2.535,8 12.86,9 7,10 7.815,11 7.43,12 0.86,13 0.543,14 2,15 45,16 34.612,17 9.172,18 0.4,19 1,20 125.556,21 1.662,22 0.29,23 0.64,24 0.667,25 0.886,26 37.5,27 1.662,28 0.04,29 1.121,30 0.677,31 0.312,32 0.689,33 1,34 1,35 1,36 1,37 1,38 1,39 1,40 -0.118,41 0.589,42 0.308,43 0.174,44 0.685,45 0.972,46 1,47 -0.682,48 1,49 2.035,50 21.5,51 3,52 2,53 1,54 6.072,55 8.799,56 8.799,57 6.072,58 8.799,59 1.653,60 10,62 4}
{0 CHEMBL371943,1 0.505,2 0.757,3 0.922,4 2.876,5 0.029,6 1.702,7 2.076,8 14.151,9 14,10 7.432,11 7.428,12 0.694,13 0.427,14 4,15 42.4,16 69.225,17 18.593,18 0.8,19 1,20 163.418,21 1.532,22 0.242,23 0.556,24 0.814,25 1.007,26 45.5,27 1.532,28 0.037,29 1.125,30 0.633,31 0.253,32 0.583,33 2,34 2,35 2,36 2,37 2,38 2,39 2,40 -0.125,41 0.817,42 0.261,43 0.225,44 0.663,45 1.138,46 2,47 -0.737,48 2,49 2.035,50 25,51 6,52 4,53 2,54 6.049,55 8.688,56 8.688,57 6.049,58 8.688,59 2.519,60 6.1,61 4,62 4}
{0 CHEMBL372329,1 0.673,2 0.841,3 0.923,4 2.297,5 -0.066,6 1.287,7 2.133,8 13.624,9 5,10 7.43,11 6.818,12 0.826,13 0.371,14 2,15 46.2,16 34.612,17 9.134,18 0.6,19 1,20 122.8,21 1.547,22 0.274,23 0.636,24 0.77,25 0.878,26 41,27 1.547,28 0.04,29 1.116,30 0.663,31 0.293,32 0.679,33 1,34 1,35 1,36 1,37 1,38 1,39 1,40 -0.113,41 0.598,42 0.3,43 0.183,44 0.685,45 0.975,46 1,47 -0.49,48 1,49 1.081,50 19,51 3,52 2,53 1,54 6.054,55 8.713,56 8.713,57 6.054,58 8.713,59 1.696,60 7.7,62 4}
{0 CHEMBL372539,1 0.76,2 0.909,3 0.9,4 -0.751,5 -0.111,6 0.801,7 2.472,8 15.662,9 4,10 7.434,11 7.428,12 0.798,13 0.329,14 5,15 44.8,16 87.236,17 18.949,18 0.1,19 1,20 167.484,21 1.67,22 0.259,23 0.581,24 0.769,25 0.793,26 37.3,27 1.67,28 0.041,29 1.121,30 0.677,31 0.275,32 0.617,33 2,34 2,35 2,36 2,37 2,38 2,39 2,40 -0.108,41 0.784,42 0.292,43 0.186,44 0.684,45 0.868,46 2,47 -2.774,48 2,49 2.035,50 33.5,51 7,52 5,53 2,54 6.075,55 8.792,56 8.792,57 6.075,58 8.792,59 2.322,60 10.4,61 1,62 4}
{0 CHEMBL372628,1 0.741,2 0.888,3 0.867,4 -0.06,5 -0.057,6 1.162,7 2.096,8 4.112,9 4,10 7.43,11 6.818,12 0.619,13 0.295,14 2,15 39,16 34.612,17 9.031,18 1,19 1,20 56.106,21 1.524,22 0.273,23 0.632,24 0.914,25 1.022,26 48.8,27 1.524,28 0.041,29 1.131,30 0.608,31 0.284,32 0.659,33 1,34 1,35 1,36 1,37 1,38 1,39 1,40 -0.091,41 0.759,42 0.225,43 0.255,44 0.64,45 1.095,46 1,47 -0.461,48 1,49 1.058,50 13,51 3,52 2,53 1,54 6.068,55 8.769,56 8.769,57 6.068,58 8.769,59 1.826,60 7.3,61 4,62 4}
{0 CHEMBL372752,1 0.488,2 0.619,3 0.942,4 2.066,5 0.019,6 1.71,7 2.161,8 13.83,9 14,10 7.432,11 7.428,12 0.75,13 0.375,14 4,15 46.2,16 69.225,17 18.478,18 0.6,19 1,20 138.166,21 1.691,22 0.279,23 0.6,24 0.571,25 0.825,26 38.5,27 1.691,28 0.039,29 1.116,30 0.691,31 0.297,32 0.638,33 2,34 2,35 2,36 2,37 2,38 2,39 2,40 -0.06,41 0.792,42 0.269,43 0.214,44 0.721,45 0.842,46 2,47 -1.082,48 2,49 2.035,50 24,51 6,52 4,53 2,54 6.156,55 9.042,56 9.042,57 6.156,58 9.042,59 2.062,60 3.8,61 2,62 4}
{0 CHEMBL373193,1 0.809,2 0.953,3 0.862,4 -3.183,5 -0.081,6 0.633,7 2.341,8 4.541,9 4,10 7.432,11 7.428,12 0.614,13 0.275,14 4,15 39,16 69.225,17 18.541,18 0.7,19 1,20 93.26,21 1.584,22 0.24,23 0.532,24 0.89,25 0.965,26 46.3,27 1.584,28 0.036,29 1.131,30 0.619,31 0.249,32 0.552,33 2,34 2,35 2,36 2,37 2,38 2,39 2,40 -0.086,41 0.973,42 0.226,43 0.253,44 0.641,45 1.041,46 2,47 -1.486,48 2,49 2.035,50 27,51 6,52 4,53 2,54 6.315,55 9.349,56 9.349,57 6.315,58 9.349,59 2.845,60 9.8,61 10,62 4}
{0 CHEMBL380566,1 0.696,2 0.896,3 0.895,4 1.083,5 -0.075,6 0.988,7 2.336,8 8.835,9 6,10 7.432,11 7.427,12 0.765,13 0.452,14 4,15 42.9,16 69.225,17 18.529,18 0.6,19 1,20 144.466,21 1.671,22 0.272,23 0.629,24 0.757,25 0.895,26 39.3,27 1.671,28 0.041,29 1.125,30 0.663,31 0.288,32 0.666,33 2,34 2,35 2,36 2,37 2,38 2,39 2,40 -0.212,41 0.723,42 0.292,43 0.188,44 0.671,45 1.044,46 2,47 -1.741,48 2,49 2.035,50 26,51 6,52 4,53 2,54 6.1,55 8.881,56 8.881,57 6.1,58 8.881,59 1.942,60 10.7,62 4}
{0 CHEMBL381002,1 0.657,2 0.829,3 0.907,4 1.463,5 -0.042,6 1.468,7 2.142,8 12.302,9 12,10 7.432,11 7.428,12 0.758,13 0.364,14 4,15 43.9,16 69.225,17 18.4,18 0.8,19 1,20 131.165,21 1.585,22 0.257,23 0.601,24 0.806,25 0.894,26 42.1,27 1.585,28 0.04,29 1.123,30 0.653,31 0.272,32 0.635,33 2,34 2,35 2,36 2,37 2,38 2,39 2,40 -0.116,41 0.745,42 0.27,43 0.212,44 0.675,45 0.964,46 2,47 -1.011,48 2,49 2.035,50 25,51 6,52 4,53 2,54 6.049,55 8.686,56 8.686,57 6.049,58 8.686,59 2.126,60 7,61 3,62 4}
{0 CHEMBL381414,1 0.532,2 0.813,3 0.91,4 3.4,5 0.023,6 1.194,7 2.116,8 10.25,9 10,10 7.432,11 7.428,12 0.65,13 0.47,14 4,15 40.5,16 69.225,17 18.819,18 0.9,19 1,20 176.719,21 1.565,22 0.242,23 0.538,24 0.809,25 1.054,26 45.9,27 1.565,28 0.038,29 1.128,30 0.625,31 0.252,32 0.561,33 2,34 2,35 2,36 2,37 2,38 2,39 2,40 -0.09,41 0.887,42 0.26,43 0.225,44 0.651,45 1.238,46 2,47 -0.918,48 2,49 2.035,50 26,51 6,52 4,53 2,54 6.177,55 9.177,56 9.177,57 6.177,58 9.177,59 2.724,60 8.1,61 4,62 4}
{0 CHEMBL381439,1 0.571,2 0.828,3 0.924,4 3.414,5 -0.012,6 1.287,7 2.113,8 12.488,9 6,10 7.43,11 6.818,12 0.75,13 0.457,14 2,15 43.5,16 34.612,17 9.299,18 0.8,19 1,20 145.576,21 1.548,22 0.265,23 0.589,24 0.765,25 0.987,26 43.5,27 1.548,28 0.042,29 1.121,30 0.644,31 0.28,32 0.622,33 1,34 1,35 1,36 1,37 1,38 1,39 1,40 -0.083,41 0.677,42 0.294,43 0.191,44 0.667,45 1.167,46 1,47 -0.441,48 1,49 1.081,50 19.5,51 3,52 2,53 1,54 6.177,55 9.178,56 9.178,57 6.177,58 9.178,59 2.086,60 8.7,62 4}
{0 CHEMBL381671,1 0.487,2 0.402,3 0.898,4 0.528,5 0.021,6 1.308,7 2.507,8 5.626,9 8,10 7.815,11 7.43,12 0.789,13 0.601,14 2,15 40.6,16 34.612,17 8.913,18 0.8,19 1,20 68.339,21 1.696,22 0.317,23 0.693,24 0.703,25 0.956,26 40.6,27 1.696,28 0.041,29 1.131,30 0.651,31 0.339,32 0.742,33 1,34 1,35 1,36 1,37 1,38 1,39 1,40 -0.165,41 0.589,42 0.276,43 0.202,44 0.662,45 1.021,46 1,47 -0.468,48 1,49 2.035,50 15,51 3,52 2,53 1,54 6.053,55 8.701,56 8.701,57 6.053,58 8.701,59 1.289,60 9.4,61 1,62 4}
{0 CHEMBL382271,1 0.472,2 0.651,3 0.938,4 1.61,5 0.037,6 1.692,7 2.044,8 18.479,9 12,10 7.432,11 7.428,12 0.75,13 0.375,14 4,15 44.8,16 69.225,17 18.408,18 0.8,19 1,20 150.118,21 1.471,22 0.238,23 0.536,24 0.823,25 0.951,26 44.8,27 1.471,28 0.031,29 1.12,30 0.643,31 0.251,32 0.567,33 2,34 2,35 2,36 2,37 2,38 2,39 2,40 -0.116,41 0.76,42 0.264,43 0.225,44 0.678,45 1.018,46 2,47 -0.595,48 2,49 2.035,50 24,51 6,52 4,53 2,54 6.048,55 8.681,56 8.681,57 6.048,58 8.681,59 2.539,60 3.4,61 4,62 4}
{0 CHEMBL382303,1 0.549,2 0.792,3 0.935,4 3.148,5 -0.01,6 1.92,7 2.08,8 14.475,9 8,10 7.43,11 6.818,12 0.792,13 0.425,14 2,15 45.2,16 34.612,17 9.204,18 0.6,19 1,20 138.926,21 1.523,22 0.266,23 0.598,24 0.765,25 0.948,26 42.9,27 1.523,28 0.043,29 1.118,30 0.652,31 0.282,32 0.636,33 1,34 1,35 1,36 1,37 1,38 1,39 1,40 -0.11,41 0.625,42 0.298,43 0.188,44 0.678,45 1.089,46 1,47 -0.363,48 1,49 1.081,50 19,51 3,52 2,53 1,54 6.052,55 8.695,56 8.695,57 6.052,58 8.695,59 1.965,60 7.1,62 4}
{0 CHEMBL382758,1 0.541,2 0.781,3 0.938,4 3.553,5 -0.009,6 1.973,7 2.06,8 15.034,9 8,10 7.43,11 6.818,12 0.76,13 0.404,14 2,15 43.5,16 34.612,17 9.262,18 0.8,19 1,20 145.473,21 1.492,22 0.256,23 0.602,24 0.816,25 0.995,26 45.7,27 1.492,28 0.042,29 1.123,30 0.636,31 0.27,32 0.636,33 1,34 1,35 1,36 1,37 1,38 1,39 1,40 -0.123,41 0.669,42 0.29,43 0.192,44 0.669,45 1.123,46 1,47 -0.318,48 1,49 1.081,50 19,51 3,52 2,53 1,54 6.055,55 8.708,56 8.708,57 6.055,58 8.708,59 2.013,60 4.3,62 4}
{0 CHEMBL383809,1 0.65,2 0.824,3 0.907,4 1.5,5 -0.034,6 1.414,7 2.118,8 12.372,9 12,10 7.432,11 7.428,12 0.735,13 0.353,14 4,15 43.3,16 69.225,17 18.421,18 0.8,19 1,20 131.165,21 1.567,22 0.251,23 0.589,24 0.822,25 0.916,26 43.3,27 1.567,28 0.039,29 1.123,30 0.646,31 0.265,32 0.621,33 2,34 2,35 2,36 2,37 2,38 2,39 2,40 -0.108,41 0.776,42 0.262,43 0.221,44 0.67,45 0.986,46 2,47 -0.927,48 2,49 2.035,50 25,51 6,52 4,53 2,54 6.049,55 8.686,56 8.686,57 6.049,58 8.686,59 2.237,60 6.7,61 4,62 4}
{0 CHEMBL424841,1 0.638,2 0.804,3 0.888,4 0.735,5 -0.015,6 1.294,7 2.035,8 6.438,9 4,10 7.43,11 6.818,12 0.625,13 0.309,14 2,15 40,16 34.612,17 9.026,18 1,19 1,20 65.583,21 1.461,22 0.263,23 0.617,24 0.925,25 1.05,26 50,27 1.461,28 0.034,29 1.129,30 0.605,31 0.275,32 0.644,33 1,34 1,35 1,36 1,37 1,38 1,39 1,40 -0.103,41 0.749,42 0.223,43 0.26,44 0.644,45 1.116,46 1,47 -0.321,48 1,49 1.058,50 12.5,51 3,52 2,53 1,54 6.052,55 8.706,56 8.706,57 6.052,58 8.706,59 1.893,60 5,61 4,62 4}
{0 CHEMBL425028,1 0.497,2 0.624,3 0.944,4 2.481,5 0.01,6 1.632,7 2.177,8 13.471,9 10,10 7.432,11 7.428,12 0.774,13 0.387,14 4,15 46.9,16 69.225,17 18.412,18 0.6,19 1,20 138.166,21 1.715,22 0.286,23 0.607,24 0.558,25 0.8,26 36.7,27 1.715,28 0.042,29 1.115,30 0.702,31 0.305,32 0.648,33 2,34 2,35 2,36 2,37 2,38 2,39 2,40 -0.19,41 0.743,42 0.277,43 0.204,44 0.729,45 0.817,46 2,47 -1.096,48 2,49 2.035,50 24,51 6,52 4,53 2,54 6.05,55 8.687,56 8.687,57 6.05,58 8.687,59 1.974,60 4.1,61 1,62 4}
{0 CHEMBL425207,1 0.78,2 0.909,3 0.864,4 -0.691,5 -0.091,6 1.125,7 2.475,8 7.746,9 10,10 7.435,11 7.431,12 0.722,13 0.401,14 4,15 43.3,16 33.203,17 18.342,18 0.8,19 1,20 117.186,21 1.603,22 0.257,23 0.594,24 0.776,25 0.893,26 40,27 1.603,28 0.041,29 1.121,30 0.659,31 0.271,32 0.626,33 2,34 2,35 2,36 2,37 2,38 2,39 2,40 -0.126,41 0.788,42 0.264,43 0.214,44 0.667,45 1.015,46 4,47 -2.125,48 2,49 2.035,50 26,51 6,52 4,53 2,54 6.068,55 8.769,56 8.769,57 6.068,58 8.769,59 2.209,60 13.3,61 4,62 4}
{0 CHEMBL425212,1 0.677,2 0.86,3 0.877,4 0.857,5 -0.053,6 1.04,7 2.084,8 4.659,9 4,10 7.43,11 6.818,12 0.684,13 0.416,14 2,15 40,16 34.612,17 8.961,18 1,19 1,20 72.233,21 1.585,22 0.294,23 0.697,24 0.834,25 1.007,26 45.7,27 1.585,28 0.042,29 1.129,30 0.625,31 0.309,32 0.733,33 1,34 1,35 1,36 1,37 1,38 1,39 1,40 -0.203,41 0.661,42 0.261,43 0.219,44 0.649,45 1.144,46 1,47 -0.419,48 1,49 1.058,50 13,51 3,52 2,53 1,54 6.099,55 8.879,56 8.879,57 6.099,58 8.879,59 1.371,60 8.6,61 1,62 4}
{0 CHEMBL425390,1 0.662,2 0.783,3 0.906,4 1.063,5 -0.072,6 1.23,7 2.763,8 11.209,9 10,10 7.478,11 7.472,12 0.794,13 0.518,14 6,15 46.2,16 69.225,17 18.437,18 0.4,19 1,20 139.356,21 1.689,22 0.276,23 0.608,24 0.711,25 0.801,26 34.6,27 1.689,28 0.039,29 1.118,30 0.693,31 0.296,32 0.652,33 2,34 2,35 2,36 2,37 2,38 2,39 2,40 -0.126,41 0.685,42 0.294,43 0.183,44 0.694,45 0.893,46 2,47 -3.987,48 2,49 2.035,50 27,51 8,52 6,53 2,54 6.055,55 8.705,56 8.705,57 6.055,58 8.705,59 1.985,60 11.5,62 4}
{0 CHEMBL427373,1 0.506,2 0.631,3 0.947,4 2.214,5 0.001,6 1.173,7 2.248,8 13.47,9 4,10 7.432,11 7.427,12 0.8,13 0.399,14 4,15 47.8,16 69.225,17 18.403,18 0.4,19 1,20 138.166,21 1.739,22 0.293,23 0.604,24 0.544,25 0.772,26 34.8,27 1.739,28 0.037,29 1.113,30 0.714,31 0.315,32 0.649,33 2,34 2,35 2,36 2,37 2,38 2,39 2,40 -0.221,41 0.717,42 0.286,43 0.195,44 0.739,45 0.79,46 2,47 -1.354,48 2,49 2.035,50 24,51 6,52 4,53 2,54 6.054,55 8.71,56 8.71,57 6.054,58 8.71,59 1.94,60 4.3,62 4}
{0 CHEMBL427553,1 0.509,2 0.747,3 0.901,4 1.466,5 0.039,6 1.518,7 1.989,8 7.25,9 4,10 7.43,11 6.818,12 0.595,13 0.376,14 2,15 39.5,16 34.612,17 9.115,18 1,19 1,20 81.709,21 1.436,22 0.254,23 0.584,24 0.919,25 1.113,26 51.2,27 1.436,28 0.033,29 1.129,30 0.599,31 0.265,32 0.607,33 1,34 1,35 1,36 1,37 1,38 1,39 1,40 -0.077,41 0.778,42 0.224,43 0.262,44 0.64,45 1.227,46 1,47 -0.212,48 1,49 1.058,50 12.5,51 3,52 2,53 1,54 6.053,55 8.718,56 8.718,57 6.053,58 8.718,59 2.13,60 4.7,61 4,62 4}
{0 CHEMBL436325,1 0.79,2 0.943,3 0.872,4 -0.828,5 -0.106,6 1.015,7 2.378,8 7.675,9 6,10 7.432,11 7.428,12 0.703,13 0.371,14 4,15 41.3,16 69.225,17 18.721,18 0.7,19 1,20 112.213,21 1.659,22 0.264,23 0.631,24 0.809,25 0.892,26 41.3,27 1.659,28 0.041,29 1.127,30 0.649,31 0.277,32 0.664,33 2,34 2,35 2,36 2,37 2,38 2,39 2,40 -0.139,41 0.831,42 0.267,43 0.211,44 0.66,45 1.002,46 2,47 -1.932,48 2,49 2.035,50 26,51 6,52 4,53 2,54 6.071,55 8.779,56 8.779,57 6.071,58 8.779,59 2.008,60 11.1,61 2,62 4}
{0 CHEMBL445859,1 0.837,2 0.96,3 0.859,4 -1.051,5 -0.148,6 0.994,7 2.674,8 7.383,9 8,10 7.436,11 7.431,12 0.813,13 0.45,14 4,15 45.8,16 33.203,17 18.229,18 0.4,19 1,20 117.186,21 1.666,22 0.279,23 0.622,24 0.726,25 0.786,26 33.3,27 1.666,28 0.045,29 1.116,30 0.697,31 0.298,32 0.666,33 2,34 2,35 2,36 2,37 2,38 2,39 2,40 -0.186,41 0.664,42 0.297,43 0.179,44 0.687,45 0.923,46 4,47 -2.809,48 2,49 2.035,50 26,51 6,52 4,53 2,54 6.069,55 8.772,56 8.772,57 6.069,58 8.772,59 1.865,60 16.7,62 4.377}
{0 CHEMBL483059,1 0.503,2 0.783,3 0.931,4 0.918,5 0.054,6 1.513,7 1.949,8 10.212,9 7,10 7.43,11 6.818,12 0.467,13 0.251,14 2,15 37.9,16 34.612,17 9.548,18 1,19 0.5,20 96.14,21 1.344,22 0.215,23 0.505,24 1.004,25 1.179,26 54.5,27 1.344,28 0.021,29 1.134,30 0.579,31 0.222,32 0.522,33 1,34 1,35 1,36 1,37 1,38 1,39 1,40 -0.148,41 1.005,42 0.194,43 0.292,44 0.631,45 1.283,46 2,47 -0.118,48 1,49 1.058,50 14,51 3,52 2,53 1,54 6.755,55 11.096,56 11.096,57 6.755,58 11.096,59 2.891,60 1.5,61 7,62 5.301}
{0 CHEMBL496625,1 0.515,2 0.785,3 0.929,4 2.058,5 0.047,6 1.929,7 1.945,8 8.226,9 10,10 7.43,11 6.818,12 0.452,13 0.243,14 2,15 37.7,16 34.612,17 9.638,18 1,19 0.5,20 89.849,21 1.331,22 0.211,23 0.495,24 1.018,25 1.19,26 55.1,27 1.331,28 0.027,29 1.134,30 0.576,31 0.218,32 0.511,33 1,34 1,35 1,36 1,37 1,38 1,39 1,40 -0.127,41 1.078,42 0.19,43 0.293,44 0.629,45 1.29,46 2,47 -0.106,48 1,49 1.058,50 14,51 3,52 2,53 1,54 7.011,55 11.95,56 11.95,57 7.011,58 11.95,59 2.986,60 1.4,61 7,62 4.967}
{0 CHEMBL496626,1 0.516,2 0.788,3 0.928,4 2.037,5 0.05,6 1.876,7 1.944,8 8.199,9 9,10 7.43,11 6.818,12 0.438,13 0.236,14 2,15 37.5,16 34.612,17 9.655,18 1,19 0.5,20 89.849,21 1.319,22 0.207,23 0.483,24 1.032,25 1.201,26 55.6,27 1.319,28 0.026,29 1.134,30 0.573,31 0.214,32 0.497,33 1,34 1,35 1,36 1,37 1,38 1,39 1,40 -0.024,41 1.102,42 0.184,43 0.3,44 0.628,45 1.298,46 1,47 -0.108,48 1,49 1.058,50 14,51 3,52 2,53 1,54 7.011,55 11.951,56 11.951,57 7.011,58 11.951,59 3.102,60 1.4,61 8,62 4.235}
{0 CHEMBL496824,1 0.515,2 0.78,3 0.932,4 2.052,5 0.039,6 1.995,7 1.951,8 8.207,9 10,10 7.43,11 6.818,12 0.483,13 0.26,14 2,15 38.1,16 34.612,17 9.579,18 1,19 0.5,20 89.849,21 1.358,22 0.219,23 0.523,24 0.988,25 1.167,26 54,27 1.358,28 0.028,29 1.134,30 0.583,31 0.227,32 0.542,33 1,34 1,35 1,36 1,37 1,38 1,39 1,40 -0.14,41 1.023,42 0.203,43 0.279,44 0.633,45 1.274,46 2,47 -0.118,48 1,49 1.058,50 14,51 3,52 2,53 1,54 7.011,55 11.95,56 11.95,57 7.011,58 11.95,59 2.739,60 1.6,61 5,62 4.845}
{0 CHEMBL523731,1 0.515,2 0.783,3 0.931,4 2.033,5 0.043,6 1.927,7 1.949,8 8.184,9 9,10 7.43,11 6.818,12 0.467,13 0.251,14 2,15 37.9,16 34.612,17 9.611,18 1,19 0.5,20 89.849,21 1.344,22 0.215,23 0.509,24 1.004,25 1.179,26 54.5,27 1.344,28 0.027,29 1.134,30 0.579,31 0.222,32 0.526,33 1,34 1,35 1,36 1,37 1,38 1,39 1,40 -0.027,41 1.048,42 0.196,43 0.287,44 0.631,45 1.283,46 1,47 -0.116,48 1,49 1.058,50 14,51 3,52 2,53 1,54 7.011,55 11.951,56 11.951,57 7.011,58 11.951,59 2.865,60 1.5,61 6,62 4.879}
{0 CHEMBL55860,1 1.558,2 1.52,3 0.877,5 -0.13,6 0.777,7 0.627,10 5.007,11 4.264,15 31,18 0.2,21 1.01,22 0.173,23 0.239,24 1.526,25 1.528,26 67.2,27 1.01,28 0.005,29 1.145,30 0.501,31 0.172,32 0.238,40 -0.005,41 1.303,42 0.016,43 0.48,44 0.577,45 1.529,54 3.97,55 3.937,56 3.937,57 3.97,58 3.937,59 4.461,61 16,62 4.551}
{0 CHEMBL67535,1 0.8,2 0.954,3 0.877,4 -0.722,5 -0.121,6 1.003,7 2.318,8 7.713,9 6,10 7.432,11 7.428,12 0.788,13 0.364,14 4,15 43.4,16 69.225,17 18.369,18 0.5,19 1,20 112.213,21 1.69,22 0.278,23 0.634,24 0.788,25 0.801,26 37.7,27 1.69,28 0.044,29 1.124,30 0.671,31 0.295,32 0.674,33 2,34 2,35 2,36 2,37 2,38 2,39 2,40 -0.176,41 0.706,42 0.286,43 0.191,44 0.676,45 0.878,46 2,47 -1.728,48 2,49 2.035,50 26,51 6,52 4,53 2,54 6.068,55 8.77,56 8.77,57 6.068,58 8.77,59 1.868,60 11.3,61 1,62 5.77}
{0 CHEMBL69590,1 1.551,2 1.535,3 0.879,5 -0.169,6 0.863,7 0.64,10 5.012,11 5.002,15 28.6,18 0.4,21 1.116,22 0.208,23 0.317,24 1.5,25 1.502,26 66.7,27 1.116,28 0.008,29 1.152,30 0.497,31 0.207,32 0.314,40 -0.02,41 1.102,42 0.043,43 0.451,44 0.569,45 1.506,54 3.942,55 3.878,56 3.878,57 3.942,58 3.878,59 3.697,61 10,62 4.402}
{0 CHEMBL77030,1 1.027,2 1.143,3 0.87,4 0.055,5 -0.266,6 0.897,7 1.927,8 4.158,9 1,10 6.82,11 6.53,12 0.867,13 0.412,14 2,15 43.5,16 16.602,17 8.684,18 0.4,19 1,20 52.115,21 1.862,22 0.379,23 0.738,24 0.643,25 0.606,26 34.8,27 1.862,28 0.052,29 1.112,30 0.706,31 0.412,32 0.801,33 1,34 1,35 1,36 1,37 1,38 1,39 1,40 0.024,41 0.517,42 0.297,43 0.172,44 0.733,45 0.52,47 0.139,48 1,49 1.058,50 13,51 3,52 2,53 1,54 6.009,55 8.577,56 8.577,57 6.009,58 8.577,59 0.902,60 8.7,62 4.155}
