"molecule_id","Mv","AMW","pXC50"
{1 0.613,2 7.863,3 7.509}
{0 CHEMBL129903,1 0.616,2 8.084,3 6.777}
{0 CHEMBL1791423,1 0.649,2 8.568,3 7.699}
{0 CHEMBL2070507,1 0.623,2 7.961,3 7.056}
{0 CHEMBL2070508,1 0.615,2 7.742,3 7.31}
{0 CHEMBL2092773,1 0.603,2 7.382,3 7.255}
{0 CHEMBL2092859,1 0.603,2 7.382,3 7.889}
{0 CHEMBL2113434,1 0.634,2 8.62,3 7.237}
{0 CHEMBL2113436,1 0.606,2 7.645,3 5.164}
{0 CHEMBL2113489,1 0.608,2 7.551,3 7.745}
{0 CHEMBL2113492,1 0.6,2 7.456,3 7.921}
{0 CHEMBL261482,1 0.631,2 8.214,3 7.018}
{0 CHEMBL464859,1 0.622,2 8.114,3 7.501}
{0 CHEMBL519809,1 0.631,2 8.409,3 7.292}
{0 CHEMBL605866,1 0.643,2 8.759,3 7.194}
{0 CHEMBL607717,1 0.648,2 8.231,3 7.377}
{0 CHEMBL607719,1 0.595,2 7.289,3 7.721}
{0 CHEMBL608000,1 0.612,2 7.402,3 5.983}
{0 CHEMBL608003,1 0.635,2 8.122,3 6.854}
{0 CHEMBL608293,1 0.609,2 7.831,3 7.699}
{0 CHEMBL608296,1 0.585,2 7.009,3 7.678}
{0 CHEMBL608587,1 0.624,2 8.316,3 7.174}
{0 CHEMBL608591,1 0.603,2 7.382,3 7.158}
{0 CHEMBL608595,1 0.645,2 8.978,3 7.387}
{0 CHEMBL608596,1 0.616,2 7.642,3 6.194}
{0 CHEMBL608888,1 0.59,2 7.141,3 7.699}
{0 CHEMBL608893,1 0.597,2 7.231,3 7.638}
{0 CHEMBL608895,1 0.606,2 7.645,3 6.703}
{0 CHEMBL609179,1 0.618,2 7.556,3 6.079}
{0 CHEMBL609186,1 0.606,2 7.645,3 7.77}
{0 CHEMBL609485,1 0.572,2 6.598,3 6.788}
{0 CHEMBL609487,1 0.588,2 7.136,3 8}
{0 CHEMBL609768,1 0.575,2 6.686,3 6.91}
{0 CHEMBL609769,1 0.582,2 6.891,3 7.509}
{0 CHEMBL609773,1 0.603,2 7.382,3 7.658}
{0 CHEMBL609774,1 0.612,2 7.402,3 5.699}
{0 CHEMBL609775,1 0.62,2 8.12,3 7.337}
{0 CHEMBL609776,1 0.583,2 7.027,3 7.538}
{0 CHEMBL612154,1 0.578,2 6.784,3 7.569}
