{
  "data_features": {
    "feature": [
      {
        "data_type": "nominal",
        "index": "0",
        "is_ignore": "false",
        "is_row_identifier": "true",
        "is_target": "false",
        "name": "molecule_id",
        "nominal_value": [
          "CHEMBL100539",
          "CHEMBL1094106",
          "CHEMBL1094153",
          "CHEMBL1094411",
          "CHEMBL1094481",
          "CHEMBL1094482",
          "CHEMBL1094485",
          "CHEMBL1094641",
          "CHEMBL1094736",
          "CHEMBL1094737",
          "CHEMBL1094738",
          "CHEMBL1094739",
          "CHEMBL1094744",
          "CHEMBL1094984",
          "CHEMBL1095080",
          "CHEMBL1095395",
          "CHEMBL1095454",
          "CHEMBL1095731",
          "CHEMBL1095773",
          "CHEMBL1095774",
          "CHEMBL1095781",
          "CHEMBL1095782",
          "CHEMBL1095783",
          "CHEMBL1096023",
          "CHEMBL1096029",
          "CHEMBL1096030",
          "CHEMBL1096031",
          "CHEMBL1096047",
          "CHEMBL1096048",
          "CHEMBL1096049",
          "CHEMBL1096073",
          "CHEMBL1096082",
          "CHEMBL1096083",
          "CHEMBL1096084",
          "CHEMBL1096096",
          "CHEMBL1096097",
          "CHEMBL1096098",
          "CHEMBL1096099",
          "CHEMBL1096100",
          "CHEMBL1096314",
          "CHEMBL1096660",
          "CHEMBL1096699",
          "CHEMBL1097013",
          "CHEMBL1097762",
          "CHEMBL1098099",
          "CHEMBL1098380",
          "CHEMBL1098381",
          "CHEMBL1098653",
          "CHEMBL1098722",
          "CHEMBL1098723",
          "CHEMBL1210369",
          "CHEMBL1210435",
          "CHEMBL1210436",
          "CHEMBL1210437",
          "CHEMBL1210438",
          "CHEMBL1210439",
          "CHEMBL1210440",
          "CHEMBL1210498",
          "CHEMBL1210499",
          "CHEMBL1210500",
          "CHEMBL1210501",
          "CHEMBL1210502",
          "CHEMBL1210503",
          "CHEMBL1210504",
          "CHEMBL1210558",
          "CHEMBL1210559",
          "CHEMBL1210560",
          "CHEMBL1210561",
          "CHEMBL1210562",
          "CHEMBL1210563",
          "CHEMBL1210621",
          "CHEMBL1210622",
          "CHEMBL1210623",
          "CHEMBL1222519",
          "CHEMBL1222601",
          "CHEMBL1222602",
          "CHEMBL1222603",
          "CHEMBL1222604",
          "CHEMBL1222605",
          "CHEMBL1222606",
          "CHEMBL1222669",
          "CHEMBL1222670",
          "CHEMBL1222671",
          "CHEMBL1222672",
          "CHEMBL1222673",
          "CHEMBL1222674",
          "CHEMBL1222738",
          "CHEMBL1222739",
          "CHEMBL1222740",
          "CHEMBL1222741",
          "CHEMBL1222742",
          "CHEMBL1222743",
          "CHEMBL1222744",
          "CHEMBL1222818",
          "CHEMBL1222819",
          "CHEMBL1222820",
          "CHEMBL1222821",
          "CHEMBL1222822",
          "CHEMBL1222823",
          "CHEMBL1222824",
          "CHEMBL1222881",
          "CHEMBL1222882",
          "CHEMBL1222883",
          "CHEMBL1269248",
          "CHEMBL1269249",
          "CHEMBL1269250",
          "CHEMBL1269330",
          "CHEMBL1271548",
          "CHEMBL1271604",
          "CHEMBL1271605",
          "CHEMBL1271655",
          "CHEMBL1271656",
          "CHEMBL1271707",
          "CHEMBL1271708",
          "CHEMBL1271767",
          "CHEMBL1271768",
          "CHEMBL1271769",
          "CHEMBL1271826",
          "CHEMBL1271884",
          "CHEMBL1271885",
          "CHEMBL1271939",
          "CHEMBL128101",
          "CHEMBL128110",
          "CHEMBL128537",
          "CHEMBL128634",
          "CHEMBL128907",
          "CHEMBL129982",
          "CHEMBL130590",
          "CHEMBL130840",
          "CHEMBL131162",
          "CHEMBL131241",
          "CHEMBL131543",
          "CHEMBL131774",
          "CHEMBL131883",
          "CHEMBL132722",
          "CHEMBL134194",
          "CHEMBL1628690",
          "CHEMBL1628691",
          "CHEMBL175530",
          "CHEMBL1777815",
          "CHEMBL1777920",
          "CHEMBL1777921",
          "CHEMBL1777922",
          "CHEMBL1777923",
          "CHEMBL1777925",
          "CHEMBL1777926",
          "CHEMBL1777927",
          "CHEMBL1777928",
          "CHEMBL1777929",
          "CHEMBL1777930",
          "CHEMBL1777931",
          "CHEMBL1777932",
          "CHEMBL1777933",
          "CHEMBL1777934",
          "CHEMBL1777935",
          "CHEMBL1777936",
          "CHEMBL1777937",
          "CHEMBL1777938",
          "CHEMBL1777939",
          "CHEMBL1777940",
          "CHEMBL1777941",
          "CHEMBL1777942",
          "CHEMBL1777943",
          "CHEMBL1777944",
          "CHEMBL1777945",
          "CHEMBL1777946",
          "CHEMBL1777947",
          "CHEMBL1777948",
          "CHEMBL1777949",
          "CHEMBL1777950",
          "CHEMBL1777951",
          "CHEMBL1777952",
          "CHEMBL1777953",
          "CHEMBL1778008",
          "CHEMBL1778009",
          "CHEMBL1778010",
          "CHEMBL1778011",
          "CHEMBL1778012",
          "CHEMBL1778013",
          "CHEMBL1778014",
          "CHEMBL1778015",
          "CHEMBL1778016",
          "CHEMBL1778017",
          "CHEMBL1778018",
          "CHEMBL1778019",
          "CHEMBL1778020",
          "CHEMBL1778021",
          "CHEMBL1778022",
          "CHEMBL1778023",
          "CHEMBL1778024",
          "CHEMBL1778025",
          "CHEMBL1778026",
          "CHEMBL1778027",
          "CHEMBL1778028",
          "CHEMBL1778029",
          "CHEMBL1778030",
          "CHEMBL1778031",
          "CHEMBL1778032",
          "CHEMBL1778033",
          "CHEMBL1778107",
          "CHEMBL1778108",
          "CHEMBL1778109",
          "CHEMBL1778110",
          "CHEMBL1778111",
          "CHEMBL1778112",
          "CHEMBL1778113",
          "CHEMBL1778114",
          "CHEMBL1778115",
          "CHEMBL1778116",
          "CHEMBL1778117",
          "CHEMBL1778118",
          "CHEMBL1778119",
          "CHEMBL1778120",
          "CHEMBL1778121",
          "CHEMBL1778122",
          "CHEMBL1778123",
          "CHEMBL1778124",
          "CHEMBL1778125",
          "CHEMBL1778126",
          "CHEMBL1778127",
          "CHEMBL1779493",
          "CHEMBL1779494",
          "CHEMBL1779495",
          "CHEMBL1779497",
          "CHEMBL1779500",
          "CHEMBL1779501",
          "CHEMBL1779503",
          "CHEMBL1779508",
          "CHEMBL1779509",
          "CHEMBL1779510",
          "CHEMBL1779511",
          "CHEMBL1779512",
          "CHEMBL1779513",
          "CHEMBL178085",
          "CHEMBL178345",
          "CHEMBL178978",
          "CHEMBL179039",
          "CHEMBL179674",
          "CHEMBL1801365",
          "CHEMBL1801366",
          "CHEMBL1801367",
          "CHEMBL1801368",
          "CHEMBL1801369",
          "CHEMBL1801370",
          "CHEMBL1801371",
          "CHEMBL1801372",
          "CHEMBL1801454",
          "CHEMBL1801455",
          "CHEMBL1801456",
          "CHEMBL1801457",
          "CHEMBL1801458",
          "CHEMBL1801459",
          "CHEMBL1801460",
          "CHEMBL1801461",
          "CHEMBL1801462",
          "CHEMBL180397",
          "CHEMBL181167",
          "CHEMBL181561",
          "CHEMBL181838",
          "CHEMBL1823817",
          "CHEMBL1823818",
          "CHEMBL1823819",
          "CHEMBL1823820",
          "CHEMBL1824006",
          "CHEMBL1824007",
          "CHEMBL1824011",
          "CHEMBL1824012",
          "CHEMBL1824015",
          "CHEMBL1824016",
          "CHEMBL1824017",
          "CHEMBL1824018",
          "CHEMBL1824019",
          "CHEMBL1824020",
          "CHEMBL1824021",
          "CHEMBL1824022",
          "CHEMBL1824023",
          "CHEMBL1824024",
          "CHEMBL1824025",
          "CHEMBL1824026",
          "CHEMBL1824027",
          "CHEMBL183352",
          "CHEMBL1902935",
          "CHEMBL1923299",
          "CHEMBL1923300",
          "CHEMBL1923301",
          "CHEMBL1923302",
          "CHEMBL1923303",
          "CHEMBL1923304",
          "CHEMBL1923305",
          "CHEMBL1923306",
          "CHEMBL1923307",
          "CHEMBL1923308",
          "CHEMBL1923309",
          "CHEMBL1923310",
          "CHEMBL1923311",
          "CHEMBL1923312",
          "CHEMBL1923313",
          "CHEMBL1923314",
          "CHEMBL1923315",
          "CHEMBL1923316",
          "CHEMBL1923317",
          "CHEMBL1923318",
          "CHEMBL1923319",
          "CHEMBL1923320",
          "CHEMBL1923321",
          "CHEMBL1923322",
          "CHEMBL1923323",
          "CHEMBL1923324",
          "CHEMBL1923325",
          "CHEMBL1923326",
          "CHEMBL2046462",
          "CHEMBL2048251",
          "CHEMBL2048257",
          "CHEMBL2048259",
          "CHEMBL2048261",
          "CHEMBL2048262",
          "CHEMBL2048263",
          "CHEMBL2048264",
          "CHEMBL2048265",
          "CHEMBL2048266",
          "CHEMBL2048270",
          "CHEMBL2048271",
          "CHEMBL2048272",
          "CHEMBL2048273",
          "CHEMBL2048274",
          "CHEMBL2048277",
          "CHEMBL2048278",
          "CHEMBL2048279",
          "CHEMBL2048283",
          "CHEMBL2048284",
          "CHEMBL2048285",
          "CHEMBL2048286",
          "CHEMBL2048433",
          "CHEMBL2048434",
          "CHEMBL2048435",
          "CHEMBL2048436",
          "CHEMBL2048437",
          "CHEMBL2048438",
          "CHEMBL2048439",
          "CHEMBL2048440",
          "CHEMBL2048441",
          "CHEMBL206904",
          "CHEMBL207370",
          "CHEMBL207525",
          "CHEMBL207908",
          "CHEMBL207909",
          "CHEMBL208234",
          "CHEMBL208560",
          "CHEMBL2094196",
          "CHEMBL2094197",
          "CHEMBL2094198",
          "CHEMBL2094199",
          "CHEMBL2094200",
          "CHEMBL2094201",
          "CHEMBL2094202",
          "CHEMBL2094203",
          "CHEMBL2094204",
          "CHEMBL2094205",
          "CHEMBL2094206",
          "CHEMBL2094207",
          "CHEMBL2094208",
          "CHEMBL2094209",
          "CHEMBL2094210",
          "CHEMBL2094211",
          "CHEMBL2094212",
          "CHEMBL2094213",
          "CHEMBL2094214",
          "CHEMBL2094215",
          "CHEMBL2094216",
          "CHEMBL2094217",
          "CHEMBL2094218",
          "CHEMBL2094219",
          "CHEMBL2094220",
          "CHEMBL2094221",
          "CHEMBL2094222",
          "CHEMBL2094223",
          "CHEMBL2094224",
          "CHEMBL2094225",
          "CHEMBL2094226",
          "CHEMBL2094227",
          "CHEMBL2094228",
          "CHEMBL2094229",
          "CHEMBL2094230",
          "CHEMBL2094231",
          "CHEMBL2094232",
          "CHEMBL2094233",
          "CHEMBL2094234",
          "CHEMBL2094235",
          "CHEMBL2094236",
          "CHEMBL2094237",
          "CHEMBL2094238",
          "CHEMBL2094239",
          "CHEMBL2094240",
          "CHEMBL2094241",
          "CHEMBL2094242",
          "CHEMBL2094243",
          "CHEMBL2094244",
          "CHEMBL2094245",
          "CHEMBL2094246",
          "CHEMBL2094247",
          "CHEMBL2094248",
          "CHEMBL209607",
          "CHEMBL209608",
          "CHEMBL209780",
          "CHEMBL210144",
          "CHEMBL210272",
          "CHEMBL210284",
          "CHEMBL210320",
          "CHEMBL210367",
          "CHEMBL210834",
          "CHEMBL210835",
          "CHEMBL210889",
          "CHEMBL21149",
          "CHEMBL2180136",
          "CHEMBL2180137",
          "CHEMBL2180138",
          "CHEMBL2180149",
          "CHEMBL2180160",
          "CHEMBL2180171",
          "CHEMBL2180174",
          "CHEMBL2218065",
          "CHEMBL2218066",
          "CHEMBL2218067",
          "CHEMBL2218068",
          "CHEMBL2218069",
          "CHEMBL2218070",
          "CHEMBL2218071",
          "CHEMBL2218072",
          "CHEMBL2218073",
          "CHEMBL2218074",
          "CHEMBL2218075",
          "CHEMBL2218076",
          "CHEMBL2218077",
          "CHEMBL2218078",
          "CHEMBL2218079",
          "CHEMBL2218080",
          "CHEMBL2218081",
          "CHEMBL2218082",
          "CHEMBL2218083",
          "CHEMBL2218084",
          "CHEMBL2218085",
          "CHEMBL2218086",
          "CHEMBL2218087",
          "CHEMBL2218088",
          "CHEMBL2218089",
          "CHEMBL2218090",
          "CHEMBL2218091",
          "CHEMBL2218092",
          "CHEMBL2218093",
          "CHEMBL2218094",
          "CHEMBL2218095",
          "CHEMBL2218096",
          "CHEMBL2218097",
          "CHEMBL2218098",
          "CHEMBL2218099",
          "CHEMBL2218100",
          "CHEMBL2218101",
          "CHEMBL2218102",
          "CHEMBL2218103",
          "CHEMBL2218104",
          "CHEMBL2218105",
          "CHEMBL2218106",
          "CHEMBL2218107",
          "CHEMBL2218108",
          "CHEMBL2218109",
          "CHEMBL2218110",
          "CHEMBL2218111",
          "CHEMBL2218112",
          "CHEMBL2218113",
          "CHEMBL2218114",
          "CHEMBL2218115",
          "CHEMBL2218116",
          "CHEMBL2218117",
          "CHEMBL2218118",
          "CHEMBL2218119",
          "CHEMBL2218120",
          "CHEMBL2218121",
          "CHEMBL2218122",
          "CHEMBL2218123",
          "CHEMBL2218124",
          "CHEMBL2218125",
          "CHEMBL2218126",
          "CHEMBL2218127",
          "CHEMBL2218128",
          "CHEMBL2218129",
          "CHEMBL2218130",
          "CHEMBL2218131",
          "CHEMBL2218132",
          "CHEMBL2218133",
          "CHEMBL2218134",
          "CHEMBL2218135",
          "CHEMBL2218136",
          "CHEMBL2218137",
          "CHEMBL2218138",
          "CHEMBL2218139",
          "CHEMBL2218140",
          "CHEMBL2218141",
          "CHEMBL2218142",
          "CHEMBL2218143",
          "CHEMBL2218144",
          "CHEMBL2218145",
          "CHEMBL2218146",
          "CHEMBL2218147",
          "CHEMBL2218148",
          "CHEMBL2218149",
          "CHEMBL2218150",
          "CHEMBL2218151",
          "CHEMBL2218152",
          "CHEMBL2218153",
          "CHEMBL2218154",
          "CHEMBL2218155",
          "CHEMBL2218156",
          "CHEMBL2218157",
          "CHEMBL2218158",
          "CHEMBL2218159",
          "CHEMBL2218160",
          "CHEMBL2218161",
          "CHEMBL2218162",
          "CHEMBL2218163",
          "CHEMBL2218164",
          "CHEMBL2218165",
          "CHEMBL2218166",
          "CHEMBL2218167",
          "CHEMBL2218168",
          "CHEMBL2218169",
          "CHEMBL2218170",
          "CHEMBL2218171",
          "CHEMBL2218172",
          "CHEMBL2218173",
          "CHEMBL2218174",
          "CHEMBL2218175",
          "CHEMBL2218176",
          "CHEMBL2218177",
          "CHEMBL2218178",
          "CHEMBL2218179",
          "CHEMBL2218180",
          "CHEMBL2218181",
          "CHEMBL2218182",
          "CHEMBL2218183",
          "CHEMBL2218184",
          "CHEMBL2218185",
          "CHEMBL2218186",
          "CHEMBL2218187",
          "CHEMBL2218188",
          "CHEMBL2218189",
          "CHEMBL2218190",
          "CHEMBL2218191",
          "CHEMBL2218192",
          "CHEMBL2218193",
          "CHEMBL2218194",
          "CHEMBL2218195",
          "CHEMBL2218196",
          "CHEMBL2218197",
          "CHEMBL2218198",
          "CHEMBL2218199",
          "CHEMBL2218200",
          "CHEMBL2218201",
          "CHEMBL2218202",
          "CHEMBL2218203",
          "CHEMBL2218204",
          "CHEMBL2218205",
          "CHEMBL2218206",
          "CHEMBL2218207",
          "CHEMBL2218208",
          "CHEMBL2218209",
          "CHEMBL2218210",
          "CHEMBL2218211",
          "CHEMBL2218212",
          "CHEMBL2218213",
          "CHEMBL2218214",
          "CHEMBL2218215",
          "CHEMBL2218216",
          "CHEMBL2218217",
          "CHEMBL2218218",
          "CHEMBL2218219",
          "CHEMBL2218220",
          "CHEMBL2218221",
          "CHEMBL2218222",
          "CHEMBL2218223",
          "CHEMBL2218224",
          "CHEMBL2218225",
          "CHEMBL2218226",
          "CHEMBL2218227",
          "CHEMBL2218228",
          "CHEMBL2218229",
          "CHEMBL2218230",
          "CHEMBL2218231",
          "CHEMBL2218232",
          "CHEMBL2218233",
          "CHEMBL2218234",
          "CHEMBL2218235",
          "CHEMBL2218236",
          "CHEMBL2218237",
          "CHEMBL2218238",
          "CHEMBL2218239",
          "CHEMBL2218240",
          "CHEMBL2218241",
          "CHEMBL2218242",
          "CHEMBL2218243",
          "CHEMBL2218244",
          "CHEMBL2218245",
          "CHEMBL2218246",
          "CHEMBL2218247",
          "CHEMBL2218248",
          "CHEMBL2218249",
          "CHEMBL2218250",
          "CHEMBL2218251",
          "CHEMBL2218252",
          "CHEMBL2218253",
          "CHEMBL2218254",
          "CHEMBL2218255",
          "CHEMBL2218256",
          "CHEMBL2218257",
          "CHEMBL2218258",
          "CHEMBL2218259",
          "CHEMBL2218260",
          "CHEMBL2218261",
          "CHEMBL2218262",
          "CHEMBL2218263",
          "CHEMBL2218264",
          "CHEMBL2218265",
          "CHEMBL2218266",
          "CHEMBL2218267",
          "CHEMBL2218268",
          "CHEMBL2218269",
          "CHEMBL2218270",
          "CHEMBL2218271",
          "CHEMBL2218272",
          "CHEMBL2218273",
          "CHEMBL2218274",
          "CHEMBL2218275",
          "CHEMBL2218276",
          "CHEMBL2218277",
          "CHEMBL2218278",
          "CHEMBL2218279",
          "CHEMBL2218280",
          "CHEMBL2218281",
          "CHEMBL2218282",
          "CHEMBL2218283",
          "CHEMBL2218284",
          "CHEMBL2218285",
          "CHEMBL2218286",
          "CHEMBL2218287",
          "CHEMBL2218288",
          "CHEMBL2218289",
          "CHEMBL2218290",
          "CHEMBL2218291",
          "CHEMBL2218292",
          "CHEMBL2218293",
          "CHEMBL2218294",
          "CHEMBL2218295",
          "CHEMBL2218296",
          "CHEMBL2218297",
          "CHEMBL2218298",
          "CHEMBL2218299",
          "CHEMBL2218300",
          "CHEMBL2218301",
          "CHEMBL2218302",
          "CHEMBL2218303",
          "CHEMBL2218304",
          "CHEMBL2218305",
          "CHEMBL2218306",
          "CHEMBL2218307",
          "CHEMBL2218308",
          "CHEMBL2218309",
          "CHEMBL2218310",
          "CHEMBL2218311",
          "CHEMBL2218312",
          "CHEMBL2218313",
          "CHEMBL2218314",
          "CHEMBL2218315",
          "CHEMBL2218316",
          "CHEMBL2218317",
          "CHEMBL2218318",
          "CHEMBL2218319",
          "CHEMBL2218320",
          "CHEMBL2218321",
          "CHEMBL2218322",
          "CHEMBL2218323",
          "CHEMBL2218324",
          "CHEMBL2218325",
          "CHEMBL2218326",
          "CHEMBL2218327",
          "CHEMBL2218328",
          "CHEMBL2218329",
          "CHEMBL2218330",
          "CHEMBL2218331",
          "CHEMBL2218332",
          "CHEMBL2218333",
          "CHEMBL2218334",
          "CHEMBL2218335",
          "CHEMBL2218336",
          "CHEMBL2218337",
          "CHEMBL2218338",
          "CHEMBL2218339",
          "CHEMBL2218340",
          "CHEMBL2218341",
          "CHEMBL2218342",
          "CHEMBL2218343",
          "CHEMBL2218344",
          "CHEMBL2218345",
          "CHEMBL2218346",
          "CHEMBL2218347",
          "CHEMBL2218348",
          "CHEMBL2218349",
          "CHEMBL2218350",
          "CHEMBL2218351",
          "CHEMBL2218352",
          "CHEMBL2218353",
          "CHEMBL2218354",
          "CHEMBL2218355",
          "CHEMBL2218356",
          "CHEMBL2218357",
          "CHEMBL2218358",
          "CHEMBL2218359",
          "CHEMBL2218360",
          "CHEMBL2218361",
          "CHEMBL2218362",
          "CHEMBL2218363",
          "CHEMBL2218364",
          "CHEMBL2218365",
          "CHEMBL2218366",
          "CHEMBL2218367",
          "CHEMBL2218368",
          "CHEMBL2218369",
          "CHEMBL2218370",
          "CHEMBL2218371",
          "CHEMBL2218372",
          "CHEMBL2218373",
          "CHEMBL2218374",
          "CHEMBL2218375",
          "CHEMBL2218376",
          "CHEMBL2218377",
          "CHEMBL2218378",
          "CHEMBL2218379",
          "CHEMBL2218380",
          "CHEMBL2218381",
          "CHEMBL2218382",
          "CHEMBL2218383",
          "CHEMBL2218384",
          "CHEMBL2218385",
          "CHEMBL2218386",
          "CHEMBL2218387",
          "CHEMBL2218388",
          "CHEMBL2218389",
          "CHEMBL2218390",
          "CHEMBL2218391",
          "CHEMBL2218392",
          "CHEMBL2218393",
          "CHEMBL2218394",
          "CHEMBL2218395",
          "CHEMBL2218396",
          "CHEMBL2218397",
          "CHEMBL2218398",
          "CHEMBL2218399",
          "CHEMBL2218400",
          "CHEMBL2218401",
          "CHEMBL2218402",
          "CHEMBL2218403",
          "CHEMBL2218404",
          "CHEMBL2218405",
          "CHEMBL2218406",
          "CHEMBL2218407",
          "CHEMBL2218408",
          "CHEMBL2218409",
          "CHEMBL2218410",
          "CHEMBL2218411",
          "CHEMBL2218412",
          "CHEMBL2218413",
          "CHEMBL2218414",
          "CHEMBL2218415",
          "CHEMBL2218416",
          "CHEMBL2218417",
          "CHEMBL2218418",
          "CHEMBL2218419",
          "CHEMBL2218420",
          "CHEMBL2218421",
          "CHEMBL2218422",
          "CHEMBL2218423",
          "CHEMBL2218424",
          "CHEMBL2218425",
          "CHEMBL2218426",
          "CHEMBL2218427",
          "CHEMBL2218428",
          "CHEMBL2218429",
          "CHEMBL2218430",
          "CHEMBL2218431",
          "CHEMBL2218432",
          "CHEMBL2218433",
          "CHEMBL2218434",
          "CHEMBL2218435",
          "CHEMBL2218436",
          "CHEMBL2218437",
          "CHEMBL2218438",
          "CHEMBL2218439",
          "CHEMBL2218440",
          "CHEMBL2218441",
          "CHEMBL2218442",
          "CHEMBL2218443",
          "CHEMBL2218444",
          "CHEMBL2218445",
          "CHEMBL2218446",
          "CHEMBL2218447",
          "CHEMBL2218448",
          "CHEMBL2218449",
          "CHEMBL2218450",
          "CHEMBL2218451",
          "CHEMBL2218452",
          "CHEMBL2218453",
          "CHEMBL2218454",
          "CHEMBL2218455",
          "CHEMBL2218456",
          "CHEMBL2218457",
          "CHEMBL2218458",
          "CHEMBL2218459",
          "CHEMBL2218460",
          "CHEMBL2218461",
          "CHEMBL2218462",
          "CHEMBL2218463",
          "CHEMBL2218464",
          "CHEMBL2218465",
          "CHEMBL2218466",
          "CHEMBL2218467",
          "CHEMBL2218468",
          "CHEMBL2218469",
          "CHEMBL2218470",
          "CHEMBL2218471",
          "CHEMBL2218472",
          "CHEMBL2218473",
          "CHEMBL2218474",
          "CHEMBL2218475",
          "CHEMBL2218476",
          "CHEMBL2218477",
          "CHEMBL2218478",
          "CHEMBL2218479",
          "CHEMBL2218480",
          "CHEMBL2218481",
          "CHEMBL2218482",
          "CHEMBL2218483",
          "CHEMBL2218484",
          "CHEMBL2218485",
          "CHEMBL2218486",
          "CHEMBL2218487",
          "CHEMBL2218488",
          "CHEMBL2218489",
          "CHEMBL2218490",
          "CHEMBL2218491",
          "CHEMBL2218492",
          "CHEMBL2218493",
          "CHEMBL2218494",
          "CHEMBL2218495",
          "CHEMBL2218496",
          "CHEMBL2218497",
          "CHEMBL2218498",
          "CHEMBL2218499",
          "CHEMBL2218500",
          "CHEMBL2218501",
          "CHEMBL2218502",
          "CHEMBL2218503",
          "CHEMBL2218504",
          "CHEMBL2218505",
          "CHEMBL2218506",
          "CHEMBL2218507",
          "CHEMBL2218508",
          "CHEMBL2218509",
          "CHEMBL2218510",
          "CHEMBL2218511",
          "CHEMBL2218512",
          "CHEMBL2218513",
          "CHEMBL2218514",
          "CHEMBL2218515",
          "CHEMBL2218516",
          "CHEMBL2218517",
          "CHEMBL2218518",
          "CHEMBL2218519",
          "CHEMBL2218520",
          "CHEMBL2218521",
          "CHEMBL2218522",
          "CHEMBL2218523",
          "CHEMBL2218524",
          "CHEMBL2218525",
          "CHEMBL2218526",
          "CHEMBL2218527",
          "CHEMBL2218528",
          "CHEMBL2218529",
          "CHEMBL2218530",
          "CHEMBL2218531",
          "CHEMBL2218532",
          "CHEMBL2218533",
          "CHEMBL2218534",
          "CHEMBL2218535",
          "CHEMBL2218536",
          "CHEMBL2218537",
          "CHEMBL2218538",
          "CHEMBL2218539",
          "CHEMBL2218540",
          "CHEMBL2218541",
          "CHEMBL2218542",
          "CHEMBL2218543",
          "CHEMBL2218544",
          "CHEMBL2218545",
          "CHEMBL2218546",
          "CHEMBL2218547",
          "CHEMBL2218548",
          "CHEMBL2218549",
          "CHEMBL2218550",
          "CHEMBL2218551",
          "CHEMBL2218552",
          "CHEMBL2218553",
          "CHEMBL2218554",
          "CHEMBL2218555",
          "CHEMBL2218556",
          "CHEMBL2218557",
          "CHEMBL2218558",
          "CHEMBL2218559",
          "CHEMBL2218560",
          "CHEMBL2218561",
          "CHEMBL2218562",
          "CHEMBL2218563",
          "CHEMBL2218564",
          "CHEMBL2218565",
          "CHEMBL2218566",
          "CHEMBL2218567",
          "CHEMBL2218568",
          "CHEMBL2218569",
          "CHEMBL2218570",
          "CHEMBL2218571",
          "CHEMBL2218572",
          "CHEMBL2218573",
          "CHEMBL2218574",
          "CHEMBL2218575",
          "CHEMBL2218576",
          "CHEMBL2218577",
          "CHEMBL2218578",
          "CHEMBL2218579",
          "CHEMBL2218580",
          "CHEMBL2218581",
          "CHEMBL2218582",
          "CHEMBL2218583",
          "CHEMBL2218584",
          "CHEMBL2218585",
          "CHEMBL2218586",
          "CHEMBL2218587",
          "CHEMBL2218588",
          "CHEMBL2218589",
          "CHEMBL2218590",
          "CHEMBL2218591",
          "CHEMBL2218592",
          "CHEMBL2218593",
          "CHEMBL2218594",
          "CHEMBL2218595",
          "CHEMBL2218596",
          "CHEMBL2218597",
          "CHEMBL2218598",
          "CHEMBL2218599",
          "CHEMBL2218600",
          "CHEMBL2218601",
          "CHEMBL2218602",
          "CHEMBL2218603",
          "CHEMBL2218604",
          "CHEMBL2218605",
          "CHEMBL2218606",
          "CHEMBL2218607",
          "CHEMBL2218608",
          "CHEMBL2218609",
          "CHEMBL2218610",
          "CHEMBL2218611",
          "CHEMBL2218612",
          "CHEMBL2218613",
          "CHEMBL2218614",
          "CHEMBL2218615",
          "CHEMBL2218616",
          "CHEMBL2218617",
          "CHEMBL2218618",
          "CHEMBL2218619",
          "CHEMBL2218620",
          "CHEMBL2218621",
          "CHEMBL2218622",
          "CHEMBL2218623",
          "CHEMBL2218624",
          "CHEMBL2218625",
          "CHEMBL2218626",
          "CHEMBL2218627",
          "CHEMBL2218628",
          "CHEMBL2218629",
          "CHEMBL2218630",
          "CHEMBL2218631",
          "CHEMBL2218632",
          "CHEMBL2218633",
          "CHEMBL2218634",
          "CHEMBL2218635",
          "CHEMBL2218636",
          "CHEMBL2218637",
          "CHEMBL2218638",
          "CHEMBL2218639",
          "CHEMBL2218640",
          "CHEMBL2218641",
          "CHEMBL2218642",
          "CHEMBL2218643",
          "CHEMBL2218644",
          "CHEMBL2218645",
          "CHEMBL2218646",
          "CHEMBL2218647",
          "CHEMBL2218648",
          "CHEMBL2218649",
          "CHEMBL2218650",
          "CHEMBL2218651",
          "CHEMBL2218652",
          "CHEMBL2218653",
          "CHEMBL2218654",
          "CHEMBL2218655",
          "CHEMBL2218656",
          "CHEMBL2218657",
          "CHEMBL2218658",
          "CHEMBL2218659",
          "CHEMBL2218660",
          "CHEMBL2218661",
          "CHEMBL2218662",
          "CHEMBL2218663",
          "CHEMBL2218664",
          "CHEMBL2218665",
          "CHEMBL2218666",
          "CHEMBL2218667",
          "CHEMBL2218668",
          "CHEMBL2218669",
          "CHEMBL2218670",
          "CHEMBL2218671",
          "CHEMBL2218672",
          "CHEMBL2218673",
          "CHEMBL2218674",
          "CHEMBL2218675",
          "CHEMBL2218676",
          "CHEMBL2218677",
          "CHEMBL2218678",
          "CHEMBL2218679",
          "CHEMBL2218680",
          "CHEMBL2218681",
          "CHEMBL2218682",
          "CHEMBL2218683",
          "CHEMBL2218684",
          "CHEMBL2218685",
          "CHEMBL2218686",
          "CHEMBL2218687",
          "CHEMBL2218688",
          "CHEMBL2218689",
          "CHEMBL2218690",
          "CHEMBL2218691",
          "CHEMBL2218692",
          "CHEMBL2218693",
          "CHEMBL2218694",
          "CHEMBL2218695",
          "CHEMBL2218696",
          "CHEMBL2218697",
          "CHEMBL2218698",
          "CHEMBL2218699",
          "CHEMBL2218700",
          "CHEMBL2218701",
          "CHEMBL2218702",
          "CHEMBL2218703",
          "CHEMBL2218704",
          "CHEMBL2218705",
          "CHEMBL2218706",
          "CHEMBL2218707",
          "CHEMBL2218708",
          "CHEMBL2218709",
          "CHEMBL2218710",
          "CHEMBL2218711",
          "CHEMBL2218712",
          "CHEMBL2218713",
          "CHEMBL2218714",
          "CHEMBL2218715",
          "CHEMBL2218716",
          "CHEMBL2218717",
          "CHEMBL2218718",
          "CHEMBL2218719",
          "CHEMBL2218720",
          "CHEMBL2218721",
          "CHEMBL2218722",
          "CHEMBL2218723",
          "CHEMBL2218724",
          "CHEMBL2218725",
          "CHEMBL2218726",
          "CHEMBL2218727",
          "CHEMBL2218728",
          "CHEMBL2218729",
          "CHEMBL2218730",
          "CHEMBL2218731",
          "CHEMBL2218732",
          "CHEMBL2218733",
          "CHEMBL2218734",
          "CHEMBL2218735",
          "CHEMBL2218736",
          "CHEMBL2218737",
          "CHEMBL2218738",
          "CHEMBL2218739",
          "CHEMBL2218740",
          "CHEMBL2218741",
          "CHEMBL2218742",
          "CHEMBL2218743",
          "CHEMBL2218744",
          "CHEMBL2218745",
          "CHEMBL2218746",
          "CHEMBL2218747",
          "CHEMBL2218748",
          "CHEMBL2218749",
          "CHEMBL2218750",
          "CHEMBL2218751",
          "CHEMBL2218752",
          "CHEMBL2218753",
          "CHEMBL2218754",
          "CHEMBL2218755",
          "CHEMBL2218756",
          "CHEMBL2218757",
          "CHEMBL2218758",
          "CHEMBL2218759",
          "CHEMBL2218760",
          "CHEMBL2218761",
          "CHEMBL2218762",
          "CHEMBL2218763",
          "CHEMBL2218764",
          "CHEMBL2218765",
          "CHEMBL2218766",
          "CHEMBL2218767",
          "CHEMBL2218768",
          "CHEMBL2218769",
          "CHEMBL2218770",
          "CHEMBL2218771",
          "CHEMBL2218772",
          "CHEMBL2218773",
          "CHEMBL2218774",
          "CHEMBL2218775",
          "CHEMBL2218776",
          "CHEMBL2218777",
          "CHEMBL2218778",
          "CHEMBL2218779",
          "CHEMBL2218780",
          "CHEMBL230076",
          "CHEMBL230295",
          "CHEMBL230612",
          "CHEMBL230827",
          "CHEMBL230925",
          "CHEMBL230926",
          "CHEMBL230928",
          "CHEMBL231029",
          "CHEMBL231032",
          "CHEMBL231033",
          "CHEMBL231136",
          "CHEMBL231137",
          "CHEMBL231138",
          "CHEMBL231242",
          "CHEMBL231244",
          "CHEMBL231341",
          "CHEMBL231343",
          "CHEMBL231439",
          "CHEMBL231440",
          "CHEMBL231441",
          "CHEMBL231540",
          "CHEMBL231543",
          "CHEMBL231643",
          "CHEMBL231644",
          "CHEMBL231645",
          "CHEMBL231658",
          "CHEMBL2324343",
          "CHEMBL2338351",
          "CHEMBL2338352",
          "CHEMBL235357",
          "CHEMBL235579",
          "CHEMBL235580",
          "CHEMBL235581",
          "CHEMBL235789",
          "CHEMBL235790",
          "CHEMBL235791",
          "CHEMBL236006",
          "CHEMBL236859",
          "CHEMBL236860",
          "CHEMBL240177",
          "CHEMBL245754",
          "CHEMBL251893",
          "CHEMBL252899",
          "CHEMBL253079",
          "CHEMBL253101",
          "CHEMBL253487",
          "CHEMBL253488",
          "CHEMBL253637",
          "CHEMBL253720",
          "CHEMBL253721",
          "CHEMBL253722",
          "CHEMBL253889",
          "CHEMBL255534",
          "CHEMBL255536",
          "CHEMBL255578",
          "CHEMBL255614",
          "CHEMBL255638",
          "CHEMBL255742",
          "CHEMBL255784",
          "CHEMBL255787",
          "CHEMBL255788",
          "CHEMBL255980",
          "CHEMBL256883",
          "CHEMBL257045",
          "CHEMBL257092",
          "CHEMBL257216",
          "CHEMBL257273",
          "CHEMBL257275",
          "CHEMBL257516",
          "CHEMBL257523",
          "CHEMBL257635",
          "CHEMBL257838",
          "CHEMBL257897",
          "CHEMBL258111",
          "CHEMBL258112",
          "CHEMBL265502",
          "CHEMBL270019",
          "CHEMBL270421",
          "CHEMBL270436",
          "CHEMBL270438",
          "CHEMBL27051",
          "CHEMBL270678",
          "CHEMBL270679",
          "CHEMBL271030",
          "CHEMBL27106",
          "CHEMBL271213",
          "CHEMBL271462",
          "CHEMBL271464",
          "CHEMBL271602",
          "CHEMBL271679",
          "CHEMBL272275",
          "CHEMBL272579",
          "CHEMBL27274",
          "CHEMBL272933",
          "CHEMBL272934",
          "CHEMBL27390",
          "CHEMBL27632",
          "CHEMBL27711",
          "CHEMBL27837",
          "CHEMBL28048",
          "CHEMBL280614",
          "CHEMBL280780",
          "CHEMBL281026",
          "CHEMBL28152",
          "CHEMBL28210",
          "CHEMBL282173",
          "CHEMBL282227",
          "CHEMBL282319",
          "CHEMBL282334",
          "CHEMBL282552",
          "CHEMBL282553",
          "CHEMBL28262",
          "CHEMBL282807",
          "CHEMBL282808",
          "CHEMBL282815",
          "CHEMBL28324",
          "CHEMBL28374",
          "CHEMBL286496",
          "CHEMBL287429",
          "CHEMBL335466",
          "CHEMBL335550",
          "CHEMBL336517",
          "CHEMBL336545",
          "CHEMBL336619",
          "CHEMBL337419",
          "CHEMBL337873",
          "CHEMBL338117",
          "CHEMBL338236",
          "CHEMBL338578",
          "CHEMBL338579",
          "CHEMBL338637",
          "CHEMBL338932",
          "CHEMBL339140",
          "CHEMBL339386",
          "CHEMBL340015",
          "CHEMBL340983",
          "CHEMBL341226",
          "CHEMBL350311",
          "CHEMBL362848",
          "CHEMBL368431",
          "CHEMBL369558",
          "CHEMBL369745",
          "CHEMBL377219",
          "CHEMBL377837",
          "CHEMBL378749",
          "CHEMBL378928",
          "CHEMBL379421",
          "CHEMBL380023",
          "CHEMBL380239",
          "CHEMBL384209",
          "CHEMBL387801",
          "CHEMBL389354",
          "CHEMBL389547",
          "CHEMBL390054",
          "CHEMBL390887",
          "CHEMBL390888",
          "CHEMBL392378",
          "CHEMBL392558",
          "CHEMBL392559",
          "CHEMBL393348",
          "CHEMBL393384",
          "CHEMBL393717",
          "CHEMBL393821",
          "CHEMBL395075",
          "CHEMBL395076",
          "CHEMBL395710",
          "CHEMBL395737",
          "CHEMBL395958",
          "CHEMBL396009",
          "CHEMBL397195",
          "CHEMBL397196",
          "CHEMBL397423",
          "CHEMBL401531",
          "CHEMBL401561",
          "CHEMBL401582",
          "CHEMBL401822",
          "CHEMBL401828",
          "CHEMBL401873",
          "CHEMBL402132",
          "CHEMBL402133",
          "CHEMBL402243",
          "CHEMBL402411",
          "CHEMBL402412",
          "CHEMBL402602",
          "CHEMBL402614",
          "CHEMBL402832",
          "CHEMBL403105",
          "CHEMBL403222",
          "CHEMBL403410",
          "CHEMBL403601",
          "CHEMBL403763",
          "CHEMBL403897",
          "CHEMBL403907",
          "CHEMBL403916",
          "CHEMBL403965",
          "CHEMBL403978",
          "CHEMBL404091",
          "CHEMBL404143",
          "CHEMBL404339",
          "CHEMBL404528",
          "CHEMBL404878",
          "CHEMBL405790",
          "CHEMBL407751",
          "CHEMBL409519",
          "CHEMBL409534",
          "CHEMBL410039",
          "CHEMBL413070",
          "CHEMBL423337",
          "CHEMBL424451",
          "CHEMBL425820",
          "CHEMBL426137",
          "CHEMBL427223",
          "CHEMBL427851",
          "CHEMBL430223",
          "CHEMBL434773",
          "CHEMBL437403",
          "CHEMBL437703",
          "CHEMBL441479",
          "CHEMBL443337",
          "CHEMBL444215",
          "CHEMBL445485",
          "CHEMBL451353",
          "CHEMBL451692",
          "CHEMBL454045",
          "CHEMBL454799",
          "CHEMBL470749",
          "CHEMBL472135",
          "CHEMBL473020",
          "CHEMBL473617",
          "CHEMBL473804",
          "CHEMBL474645",
          "CHEMBL475019",
          "CHEMBL475059",
          "CHEMBL475368",
          "CHEMBL475451",
          "CHEMBL475452",
          "CHEMBL475566",
          "CHEMBL475567",
          "CHEMBL475568",
          "CHEMBL475633",
          "CHEMBL475835",
          "CHEMBL475836",
          "CHEMBL475868",
          "CHEMBL479358",
          "CHEMBL479359",
          "CHEMBL479376",
          "CHEMBL479398",
          "CHEMBL479577",
          "CHEMBL479578",
          "CHEMBL479798",
          "CHEMBL480151",
          "CHEMBL480152",
          "CHEMBL480700",
          "CHEMBL481481",
          "CHEMBL481483",
          "CHEMBL481668",
          "CHEMBL489714",
          "CHEMBL489741",
          "CHEMBL489916",
          "CHEMBL489917",
          "CHEMBL489919",
          "CHEMBL489931",
          "CHEMBL489932",
          "CHEMBL489939",
          "CHEMBL490117",
          "CHEMBL490118",
          "CHEMBL490558",
          "CHEMBL490696",
          "CHEMBL490741",
          "CHEMBL490912",
          "CHEMBL490917",
          "CHEMBL490918",
          "CHEMBL491102",
          "CHEMBL491103",
          "CHEMBL491369",
          "CHEMBL491370",
          "CHEMBL491552",
          "CHEMBL491553",
          "CHEMBL491713",
          "CHEMBL491728",
          "CHEMBL491729",
          "CHEMBL491730",
          "CHEMBL491740",
          "CHEMBL491741",
          "CHEMBL491766",
          "CHEMBL491781",
          "CHEMBL491907",
          "CHEMBL491916",
          "CHEMBL491933",
          "CHEMBL491934",
          "CHEMBL492101",
          "CHEMBL492112",
          "CHEMBL492113",
          "CHEMBL492123",
          "CHEMBL493436",
          "CHEMBL493437",
          "CHEMBL493802",
          "CHEMBL494161",
          "CHEMBL494625",
          "CHEMBL494678",
          "CHEMBL494815",
          "CHEMBL494989",
          "CHEMBL495159",
          "CHEMBL496085",
          "CHEMBL496087",
          "CHEMBL496088",
          "CHEMBL496299",
          "CHEMBL496300",
          "CHEMBL496301",
          "CHEMBL496498",
          "CHEMBL496499",
          "CHEMBL497967",
          "CHEMBL498560",
          "CHEMBL504419",
          "CHEMBL505953",
          "CHEMBL508761",
          "CHEMBL509756",
          "CHEMBL510265",
          "CHEMBL511126",
          "CHEMBL514786",
          "CHEMBL515591",
          "CHEMBL515608",
          "CHEMBL515918",
          "CHEMBL516041",
          "CHEMBL516911",
          "CHEMBL517225",
          "CHEMBL518152",
          "CHEMBL518308",
          "CHEMBL519095",
          "CHEMBL519124",
          "CHEMBL520580",
          "CHEMBL521670",
          "CHEMBL521858",
          "CHEMBL521882",
          "CHEMBL521962",
          "CHEMBL522067",
          "CHEMBL522068",
          "CHEMBL522120",
          "CHEMBL522647",
          "CHEMBL522955",
          "CHEMBL522967",
          "CHEMBL523112",
          "CHEMBL523157",
          "CHEMBL523319",
          "CHEMBL523385",
          "CHEMBL523478",
          "CHEMBL523540",
          "CHEMBL523548",
          "CHEMBL523873",
          "CHEMBL523908",
          "CHEMBL524039",
          "CHEMBL524108",
          "CHEMBL525541",
          "CHEMBL526307",
          "CHEMBL540946",
          "CHEMBL540965",
          "CHEMBL541709",
          "CHEMBL549618",
          "CHEMBL549620",
          "CHEMBL549883",
          "CHEMBL550030",
          "CHEMBL550167",
          "CHEMBL550436",
          "CHEMBL550438",
          "CHEMBL550496",
          "CHEMBL550777",
          "CHEMBL550902",
          "CHEMBL550980",
          "CHEMBL551170",
          "CHEMBL551301",
          "CHEMBL551360",
          "CHEMBL551362",
          "CHEMBL551377",
          "CHEMBL551382",
          "CHEMBL551503",
          "CHEMBL551581",
          "CHEMBL551707",
          "CHEMBL551708",
          "CHEMBL551765",
          "CHEMBL551766",
          "CHEMBL551767",
          "CHEMBL551984",
          "CHEMBL552512",
          "CHEMBL552513",
          "CHEMBL552515",
          "CHEMBL554711",
          "CHEMBL555033",
          "CHEMBL555561",
          "CHEMBL556680",
          "CHEMBL556805",
          "CHEMBL557697",
          "CHEMBL558104",
          "CHEMBL558293",
          "CHEMBL558295",
          "CHEMBL558748",
          "CHEMBL559078",
          "CHEMBL559079",
          "CHEMBL559773",
          "CHEMBL559913",
          "CHEMBL559968",
          "CHEMBL560048",
          "CHEMBL560167",
          "CHEMBL560219",
          "CHEMBL560222",
          "CHEMBL560226",
          "CHEMBL560241",
          "CHEMBL560367",
          "CHEMBL560423",
          "CHEMBL560429",
          "CHEMBL560506",
          "CHEMBL560563",
          "CHEMBL560616",
          "CHEMBL560844",
          "CHEMBL560845",
          "CHEMBL561368",
          "CHEMBL561771",
          "CHEMBL562308",
          "CHEMBL562690",
          "CHEMBL562698",
          "CHEMBL562809",
          "CHEMBL562936",
          "CHEMBL563152",
          "CHEMBL563255",
          "CHEMBL563379",
          "CHEMBL563551",
          "CHEMBL563569",
          "CHEMBL563784",
          "CHEMBL564366",
          "CHEMBL564463",
          "CHEMBL564535",
          "CHEMBL564607",
          "CHEMBL564737",
          "CHEMBL564882",
          "CHEMBL564885",
          "CHEMBL565027",
          "CHEMBL565068",
          "CHEMBL568802",
          "CHEMBL569036",
          "CHEMBL570177",
          "CHEMBL570438",
          "CHEMBL570672",
          "CHEMBL570852",
          "CHEMBL570854",
          "CHEMBL570992",
          "CHEMBL571076",
          "CHEMBL574539",
          "CHEMBL577761",
          "CHEMBL577974",
          "CHEMBL577975",
          "CHEMBL577977",
          "CHEMBL577979",
          "CHEMBL582937",
          "CHEMBL585553",
          "CHEMBL599760",
          "CHEMBL605325"
        ],
        "number_of_missing_values": "0"
      },
      {
        "data_type": "numeric",
        "index": "1",
        "is_ignore": "false",
        "is_row_identifier": "false",
        "is_target": "false",
        "name": "AMW",
        "number_of_missing_values": "0"
      },
      {
        "data_type": "numeric",
        "index": "2",
        "is_ignore": "false",
        "is_row_identifier": "false",
        "is_target": "false",
        "name": "C.",
        "number_of_missing_values": "0"
      },
      {
        "data_type": "numeric",
        "index": "3",
        "is_ignore": "false",
        "is_row_identifier": "false",
        "is_target": "false",
        "name": "H.",
        "number_of_missing_values": "0"
      },
      {
        "data_type": "numeric",
        "index": "4",
        "is_ignore": "false",
        "is_row_identifier": "false",
        "is_target": "false",
        "name": "Me",
        "number_of_missing_values": "0"
      },
      {
        "data_type": "numeric",
        "index": "5",
        "is_ignore": "false",
        "is_row_identifier": "false",
        "is_target": "false",
        "name": "Mi",
        "number_of_missing_values": "0"
      },
      {
        "data_type": "numeric",
        "index": "6",
        "is_ignore": "false",
        "is_row_identifier": "false",
        "is_target": "false",
        "name": "Mp",
        "number_of_missing_values": "0"
      },
      {
        "data_type": "numeric",
        "index": "7",
        "is_ignore": "false",
        "is_row_identifier": "false",
        "is_target": "false",
        "name": "Mv",
        "number_of_missing_values": "0"
      },
      {
        "data_type": "numeric",
        "index": "8",
        "is_ignore": "false",
        "is_row_identifier": "false",
        "is_target": "false",
        "name": "MW",
        "number_of_missing_values": "0"
      },
      {
        "data_type": "numeric",
        "index": "9",
        "is_ignore": "false",
        "is_row_identifier": "false",
        "is_target": "false",
        "name": "N.",
        "number_of_missing_values": "0"
      },
      {
        "data_type": "numeric",
        "index": "10",
        "is_ignore": "false",
        "is_row_identifier": "false",
        "is_target": "false",
        "name": "nAB",
        "number_of_missing_values": "0"
      },
      {
        "data_type": "numeric",
        "index": "11",
        "is_ignore": "false",
        "is_row_identifier": "false",
        "is_target": "false",
        "name": "nAT",
        "number_of_missing_values": "0"
      },
      {
        "data_type": "numeric",
        "index": "12",
        "is_ignore": "false",
        "is_row_identifier": "false",
        "is_target": "false",
        "name": "nB",
        "number_of_missing_values": "0"
      },
      {
        "data_type": "numeric",
        "index": "13",
        "is_ignore": "false",
        "is_row_identifier": "false",
        "is_target": "false",
        "name": "nBM",
        "number_of_missing_values": "0"
      },
      {
        "data_type": "numeric",
        "index": "14",
        "is_ignore": "false",
        "is_row_identifier": "false",
        "is_target": "false",
        "name": "nBO",
        "number_of_missing_values": "0"
      },
      {
        "data_type": "numeric",
        "index": "15",
        "is_ignore": "false",
        "is_row_identifier": "false",
        "is_target": "false",
        "name": "nBR",
        "number_of_missing_values": "0"
      },
      {
        "data_type": "numeric",
        "index": "16",
        "is_ignore": "false",
        "is_row_identifier": "false",
        "is_target": "false",
        "name": "nBT",
        "number_of_missing_values": "0"
      },
      {
        "data_type": "numeric",
        "index": "17",
        "is_ignore": "false",
        "is_row_identifier": "false",
        "is_target": "false",
        "name": "nC",
        "number_of_missing_values": "0"
      },
      {
        "data_type": "numeric",
        "index": "18",
        "is_ignore": "false",
        "is_row_identifier": "false",
        "is_target": "false",
        "name": "nCL",
        "number_of_missing_values": "0"
      },
      {
        "data_type": "numeric",
        "index": "19",
        "is_ignore": "false",
        "is_row_identifier": "false",
        "is_target": "false",
        "name": "nCsp",
        "number_of_missing_values": "0"
      },
      {
        "data_type": "numeric",
        "index": "20",
        "is_ignore": "false",
        "is_row_identifier": "false",
        "is_target": "false",
        "name": "nCsp2",
        "number_of_missing_values": "0"
      },
      {
        "data_type": "numeric",
        "index": "21",
        "is_ignore": "false",
        "is_row_identifier": "false",
        "is_target": "false",
        "name": "nCsp3",
        "number_of_missing_values": "0"
      },
      {
        "data_type": "numeric",
        "index": "22",
        "is_ignore": "false",
        "is_row_identifier": "false",
        "is_target": "false",
        "name": "nDB",
        "number_of_missing_values": "0"
      },
      {
        "data_type": "numeric",
        "index": "23",
        "is_ignore": "false",
        "is_row_identifier": "false",
        "is_target": "false",
        "name": "nF",
        "number_of_missing_values": "0"
      },
      {
        "data_type": "numeric",
        "index": "24",
        "is_ignore": "false",
        "is_row_identifier": "false",
        "is_target": "false",
        "name": "nH",
        "number_of_missing_values": "0"
      },
      {
        "data_type": "numeric",
        "index": "25",
        "is_ignore": "false",
        "is_row_identifier": "false",
        "is_target": "false",
        "name": "nHet",
        "number_of_missing_values": "0"
      },
      {
        "data_type": "numeric",
        "index": "26",
        "is_ignore": "false",
        "is_row_identifier": "false",
        "is_target": "false",
        "name": "nHM",
        "number_of_missing_values": "0"
      },
      {
        "data_type": "numeric",
        "index": "27",
        "is_ignore": "false",
        "is_row_identifier": "false",
        "is_target": "false",
        "name": "nI",
        "number_of_missing_values": "0"
      },
      {
        "data_type": "numeric",
        "index": "28",
        "is_ignore": "false",
        "is_row_identifier": "false",
        "is_target": "false",
        "name": "nN",
        "number_of_missing_values": "0"
      },
      {
        "data_type": "numeric",
        "index": "29",
        "is_ignore": "false",
        "is_row_identifier": "false",
        "is_target": "false",
        "name": "nO",
        "number_of_missing_values": "0"
      },
      {
        "data_type": "numeric",
        "index": "30",
        "is_ignore": "false",
        "is_row_identifier": "false",
        "is_target": "false",
        "name": "nP",
        "number_of_missing_values": "0"
      },
      {
        "data_type": "numeric",
        "index": "31",
        "is_ignore": "false",
        "is_row_identifier": "false",
        "is_target": "false",
        "name": "nS",
        "number_of_missing_values": "0"
      },
      {
        "data_type": "numeric",
        "index": "32",
        "is_ignore": "false",
        "is_row_identifier": "false",
        "is_target": "false",
        "name": "nSK",
        "number_of_missing_values": "0"
      },
      {
        "data_type": "numeric",
        "index": "33",
        "is_ignore": "false",
        "is_row_identifier": "false",
        "is_target": "false",
        "name": "nTB",
        "number_of_missing_values": "0"
      },
      {
        "data_type": "numeric",
        "index": "34",
        "is_ignore": "false",
        "is_row_identifier": "false",
        "is_target": "false",
        "name": "nX",
        "number_of_missing_values": "0"
      },
      {
        "data_type": "numeric",
        "index": "35",
        "is_ignore": "false",
        "is_row_identifier": "false",
        "is_target": "false",
        "name": "O.",
        "number_of_missing_values": "0"
      },
      {
        "data_type": "numeric",
        "index": "36",
        "is_ignore": "false",
        "is_row_identifier": "false",
        "is_target": "false",
        "name": "RBF",
        "number_of_missing_values": "0"
      },
      {
        "data_type": "numeric",
        "index": "37",
        "is_ignore": "false",
        "is_row_identifier": "false",
        "is_target": "false",
        "name": "RBN",
        "number_of_missing_values": "0"
      },
      {
        "data_type": "numeric",
        "index": "38",
        "is_ignore": "false",
        "is_row_identifier": "false",
        "is_target": "false",
        "name": "SCBO",
        "number_of_missing_values": "0"
      },
      {
        "data_type": "numeric",
        "index": "39",
        "is_ignore": "false",
        "is_row_identifier": "false",
        "is_target": "false",
        "name": "Se",
        "number_of_missing_values": "0"
      },
      {
        "data_type": "numeric",
        "index": "40",
        "is_ignore": "false",
        "is_row_identifier": "false",
        "is_target": "false",
        "name": "Si",
        "number_of_missing_values": "0"
      },
      {
        "data_type": "numeric",
        "index": "41",
        "is_ignore": "false",
        "is_row_identifier": "false",
        "is_target": "false",
        "name": "Sp",
        "number_of_missing_values": "0"
      },
      {
        "data_type": "numeric",
        "index": "42",
        "is_ignore": "false",
        "is_row_identifier": "false",
        "is_target": "false",
        "name": "Sv",
        "number_of_missing_values": "0"
      },
      {
        "data_type": "numeric",
        "index": "43",
        "is_ignore": "false",
        "is_row_identifier": "false",
        "is_target": "false",
        "name": "X.",
        "number_of_missing_values": "0"
      },
      {
        "data_type": "numeric",
        "index": "44",
        "is_ignore": "false",
        "is_row_identifier": "false",
        "is_target": "true",
        "name": "pXC50",
        "number_of_missing_values": "0"
      }
    ]
  }
}