{
  "data_features": {
    "feature": [
      {
        "data_type": "nominal",
        "index": "0",
        "is_ignore": "false",
        "is_row_identifier": "true",
        "is_target": "false",
        "name": "molecule_id",
        "nominal_value": [
          "CHEMBL1163460",
          "CHEMBL1163463",
          "CHEMBL1163467",
          "CHEMBL1163470",
          "CHEMBL1163471",
          "CHEMBL1163473",
          "CHEMBL1163474",
          "CHEMBL1163475",
          "CHEMBL1163476",
          "CHEMBL1163477",
          "CHEMBL1163479",
          "CHEMBL1164032",
          "CHEMBL1164523",
          "CHEMBL1164996",
          "CHEMBL1165145",
          "CHEMBL1165341",
          "CHEMBL1165734",
          "CHEMBL1165735",
          "CHEMBL1165764",
          "CHEMBL1165765",
          "CHEMBL1165766",
          "CHEMBL1165767",
          "CHEMBL1165793",
          "CHEMBL1165794",
          "CHEMBL1165795",
          "CHEMBL1165796",
          "CHEMBL1165797",
          "CHEMBL218698",
          "CHEMBL218994",
          "CHEMBL223905",
          "CHEMBL2348502",
          "CHEMBL2348511",
          "CHEMBL236396",
          "CHEMBL236800",
          "CHEMBL237877",
          "CHEMBL237878",
          "CHEMBL237879",
          "CHEMBL238066",
          "CHEMBL239199",
          "CHEMBL239250",
          "CHEMBL240916",
          "CHEMBL241128",
          "CHEMBL254356",
          "CHEMBL257767",
          "CHEMBL366221",
          "CHEMBL387916",
          "CHEMBL389653",
          "CHEMBL389654",
          "CHEMBL390094",
          "CHEMBL391354",
          "CHEMBL391355",
          "CHEMBL392142",
          "CHEMBL392166",
          "CHEMBL396443",
          "CHEMBL402303",
          "CHEMBL404177",
          "CHEMBL426020",
          "CHEMBL437430",
          "CHEMBL448403",
          "CHEMBL452403",
          "CHEMBL500949",
          "CHEMBL501579",
          "CHEMBL501794",
          "CHEMBL504097",
          "CHEMBL504723",
          "CHEMBL505288",
          "CHEMBL505358",
          "CHEMBL507406",
          "CHEMBL508811",
          "CHEMBL509009",
          "CHEMBL509042",
          "CHEMBL509604",
          "CHEMBL510618",
          "CHEMBL522770",
          "CHEMBL524855",
          "CHEMBL535141",
          "CHEMBL565388",
          "CHEMBL565395",
          "CHEMBL565416",
          "CHEMBL565580",
          "CHEMBL565806",
          "CHEMBL565937",
          "CHEMBL566056",
          "CHEMBL566144",
          "CHEMBL566145",
          "CHEMBL566187",
          "CHEMBL566364",
          "CHEMBL566366",
          "CHEMBL566389",
          "CHEMBL566433",
          "CHEMBL566565",
          "CHEMBL566894",
          "CHEMBL567075",
          "CHEMBL567303",
          "CHEMBL567713",
          "CHEMBL567736",
          "CHEMBL567759",
          "CHEMBL567866",
          "CHEMBL567949",
          "CHEMBL568089",
          "CHEMBL568123",
          "CHEMBL568165",
          "CHEMBL568316",
          "CHEMBL568358",
          "CHEMBL568388",
          "CHEMBL568637",
          "CHEMBL568764",
          "CHEMBL569238",
          "CHEMBL569688",
          "CHEMBL569689",
          "CHEMBL569923",
          "CHEMBL571216",
          "CHEMBL571535",
          "CHEMBL571537",
          "CHEMBL571625",
          "CHEMBL571683",
          "CHEMBL572138",
          "CHEMBL577518",
          "CHEMBL577772",
          "CHEMBL578203",
          "CHEMBL578204",
          "CHEMBL578205",
          "CHEMBL578206",
          "CHEMBL578207",
          "CHEMBL584545"
        ],
        "number_of_missing_values": "0"
      },
      {
        "data_type": "numeric",
        "index": "1",
        "is_ignore": "false",
        "is_row_identifier": "false",
        "is_target": "false",
        "name": "nBM",
        "number_of_missing_values": "0"
      },
      {
        "data_type": "numeric",
        "index": "2",
        "is_ignore": "false",
        "is_row_identifier": "false",
        "is_target": "false",
        "name": "nCsp2",
        "number_of_missing_values": "0"
      },
      {
        "data_type": "numeric",
        "index": "3",
        "is_ignore": "false",
        "is_row_identifier": "false",
        "is_target": "false",
        "name": "nC",
        "number_of_missing_values": "0"
      },
      {
        "data_type": "numeric",
        "index": "4",
        "is_ignore": "false",
        "is_row_identifier": "false",
        "is_target": "false",
        "name": "nHM",
        "number_of_missing_values": "0"
      },
      {
        "data_type": "numeric",
        "index": "5",
        "is_ignore": "false",
        "is_row_identifier": "false",
        "is_target": "false",
        "name": "nS",
        "number_of_missing_values": "0"
      },
      {
        "data_type": "numeric",
        "index": "6",
        "is_ignore": "false",
        "is_row_identifier": "false",
        "is_target": "false",
        "name": "MW",
        "number_of_missing_values": "0"
      },
      {
        "data_type": "numeric",
        "index": "7",
        "is_ignore": "false",
        "is_row_identifier": "false",
        "is_target": "false",
        "name": "nAT",
        "number_of_missing_values": "0"
      },
      {
        "data_type": "numeric",
        "index": "8",
        "is_ignore": "false",
        "is_row_identifier": "false",
        "is_target": "false",
        "name": "nBO",
        "number_of_missing_values": "0"
      },
      {
        "data_type": "numeric",
        "index": "9",
        "is_ignore": "false",
        "is_row_identifier": "false",
        "is_target": "false",
        "name": "nBT",
        "number_of_missing_values": "0"
      },
      {
        "data_type": "numeric",
        "index": "10",
        "is_ignore": "false",
        "is_row_identifier": "false",
        "is_target": "false",
        "name": "nSK",
        "number_of_missing_values": "0"
      },
      {
        "data_type": "numeric",
        "index": "11",
        "is_ignore": "false",
        "is_row_identifier": "false",
        "is_target": "false",
        "name": "SCBO",
        "number_of_missing_values": "0"
      },
      {
        "data_type": "numeric",
        "index": "12",
        "is_ignore": "false",
        "is_row_identifier": "false",
        "is_target": "false",
        "name": "Se",
        "number_of_missing_values": "0"
      },
      {
        "data_type": "numeric",
        "index": "13",
        "is_ignore": "false",
        "is_row_identifier": "false",
        "is_target": "false",
        "name": "Si",
        "number_of_missing_values": "0"
      },
      {
        "data_type": "numeric",
        "index": "14",
        "is_ignore": "false",
        "is_row_identifier": "false",
        "is_target": "false",
        "name": "Sp",
        "number_of_missing_values": "0"
      },
      {
        "data_type": "numeric",
        "index": "15",
        "is_ignore": "false",
        "is_row_identifier": "false",
        "is_target": "false",
        "name": "Sv",
        "number_of_missing_values": "0"
      },
      {
        "data_type": "numeric",
        "index": "16",
        "is_ignore": "false",
        "is_row_identifier": "false",
        "is_target": "false",
        "name": "nHet",
        "number_of_missing_values": "0"
      },
      {
        "data_type": "numeric",
        "index": "17",
        "is_ignore": "false",
        "is_row_identifier": "false",
        "is_target": "false",
        "name": "nH",
        "number_of_missing_values": "0"
      },
      {
        "data_type": "numeric",
        "index": "18",
        "is_ignore": "false",
        "is_row_identifier": "false",
        "is_target": "true",
        "name": "pXC50",
        "number_of_missing_values": "0"
      }
    ]
  }
}