{
  "data_set_description": {
    "collection_date": "November 2013",
    "creator": "Dr Jeremy Besnard, Dr Ivan Olier, Dr Noureddin Sadawi, Dr Larisa Soldatova, Dr Crina Grosan, Prof Ross King, Dr Richard Bickerton, Prof Andrew Hopkins and Dr Willem van Hoorn",
    "default_target_attribute": "pXC50",
    "description": "This dataset contains QSAR data (from ChEMBL version 17) showing activity values (unit is pseudo-pCI50) of several compounds on drug target ChEMBL_ID: CHEMBL4698 (TID: 100666), and it has 264 rows and 1269 features (not including molecule IDs and class feature: molecule_id and pXC50). The features represent Molecular Descriptors which were generated from SMILES strings. Missing value imputation was applied to this dataset (By choosing the Median).",
    "description_version": "1",
    "file_id": "3552524",
    "format": "ARFF",
    "id": "35241",
    "licence": "Public",
    "md5_checksum": "bd45eae10f034b400fb7d7c834bf8c13",
    "minio_url": "https://data.openml.org/datasets/0003/35241/dataset_35241.pq",
    "name": "QSAR-DATASET-FOR-DRUG-TARGET-CHEMBL4698",
    "original_data_url": "https://www.ebi.ac.uk/chembl/target/inspect/CHEMBL4698",
    "parquet_url": "https://data.openml.org/datasets/0003/35241/dataset_35241.pq",
    "processing_date": "2018-10-04 04:21:47",
    "row_id_attribute": "molecule_id",
    "status": "deactivated",
    "tag": [
      "MetaQSAR",
      "study_13"
    ],
    "upload_date": "2016-07-15T17:31:03",
    "url": "https://api.openml.org/data/v1/download/3552524/QSAR-DATASET-FOR-DRUG-TARGET-CHEMBL4698.arff",
    "version": "9",
    "visibility": "public"
  }
}