{
  "data_set_description": {
    "collection_date": "November 2013",
    "creator": "Dr Jeremy Besnard, Dr Ivan Olier, Dr Noureddin Sadawi, Dr Larisa Soldatova, Dr Crina Grosan, Prof Ross King, Dr Richard Bickerton, Prof Andrew Hopkins and Dr Willem van Hoorn",
    "default_target_attribute": "pXC50",
    "description": "This dataset contains QSAR data (from ChEMBL version 17) showing activity values (unit is pseudo-pCI50) of several compounds on drug target ChEMBL_ID: CHEMBL5200 (TID: 100861), and it has 81 rows and 43 features (not including molecule IDs and class feature: molecule_id and pXC50). The features represent Basic Molecular Descriptors which were generated from SMILES strings.  Missing value imputation was applied to this dataset (By choosing the Median).",
    "description_version": "1",
    "file_id": "3552009",
    "format": "ARFF",
    "id": "35232",
    "licence": "Public",
    "md5_checksum": "23f9a01d222c48e771fdf36093f71d2b",
    "minio_url": "https://data.openml.org/datasets/0003/35232/dataset_35232.pq",
    "name": "QSAR-DATASET-FOR-DRUG-TARGET-CHEMBL5200",
    "original_data_url": "https://www.ebi.ac.uk/chembl/target/inspect/CHEMBL5200",
    "parquet_url": "https://data.openml.org/datasets/0003/35232/dataset_35232.pq",
    "processing_date": "2018-10-04 04:19:19",
    "row_id_attribute": "molecule_id",
    "status": "deactivated",
    "tag": [
      "MetaQSAR",
      "study_13"
    ],
    "upload_date": "2016-07-15T17:29:29",
    "url": "https://api.openml.org/data/v1/download/3552009/QSAR-DATASET-FOR-DRUG-TARGET-CHEMBL5200.arff",
    "version": "11",
    "visibility": "public"
  }
}