{
  "data_set_description": {
    "collection_date": "November 2013",
    "creator": "Dr Jeremy Besnard, Dr Ivan Olier, Dr Noureddin Sadawi, Dr Larisa Soldatova, Dr Crina Grosan, Prof Ross King, Dr Richard Bickerton, Prof Andrew Hopkins and Dr Willem van Hoorn",
    "default_target_attribute": "pXC50",
    "description": "This dataset contains QSAR data (from ChEMBL version 17) showing activity values (unit is pseudo-pCI50) of several compounds on drug target ChEMBL_ID: CHEMBL1163125 (TID: 103454), and it has 127 rows and 1263 features (not including molecule IDs and class feature: molecule_id and pXC50). The features represent Molecular Descriptors which were generated from SMILES strings. Missing value imputation was applied to this dataset (By choosing the Median).",
    "description_version": "1",
    "file_id": "3551798",
    "format": "ARFF",
    "id": "35225",
    "licence": "Public",
    "md5_checksum": "5e99353ebcda39c866c20d5dcd960315",
    "minio_url": "https://data.openml.org/datasets/0003/35225/dataset_35225.pq",
    "name": "QSAR-DATASET-FOR-DRUG-TARGET-CHEMBL1163125",
    "original_data_url": "https://www.ebi.ac.uk/chembl/target/inspect/CHEMBL1163125",
    "parquet_url": "https://data.openml.org/datasets/0003/35225/dataset_35225.pq",
    "processing_date": "2018-10-04 04:24:55",
    "row_id_attribute": "molecule_id",
    "status": "deactivated",
    "tag": [
      "MetaQSAR",
      "study_13"
    ],
    "upload_date": "2016-07-15T17:28:20",
    "url": "https://api.openml.org/data/v1/download/3551798/QSAR-DATASET-FOR-DRUG-TARGET-CHEMBL1163125.arff",
    "version": "11",
    "visibility": "public"
  }
}