"molecule_id","MATS4p","ATSC6p","AAC","AECC","ALOGP","ALOGP2","AMR","AMW","ARR","ATS1e","ATS1i","ATS1m","ATS1p","ATS1s","ATS1v","ATS2e","ATS2i","ATS2m","ATS2p","ATS2s","ATS2v","ATS3e","ATS3i","ATS3m","ATS3p","ATS3s","ATS3v","ATS4e","ATS4i","ATS4m","ATS4p","ATS4s","ATS4v","ATS5e","ATS5i","ATS5m","ATS5p","ATS5s","ATS5v","ATS6e","ATS6i","ATS6m","ATS6p","ATS6s","ATS6v","ATS7e","ATS7i","ATS7m","ATS7p","ATS7s","ATS7v","ATS8e","ATS8i","ATS8m","ATS8p","ATS8s","ATS8v","ATSC1e","ATSC1i","ATSC1m","ATSC1p","ATSC1s","ATSC1v","ATSC2e","ATSC2i","ATSC2m","ATSC2p","ATSC2s","ATSC2v","ATSC3e","ATSC3i","ATSC3m","ATSC3p","ATSC3s","ATSC3v","ATSC4e","ATSC4i","ATSC4m","ATSC4p","ATSC4s","ATSC4v","ATSC5e","ATSC5i","ATSC5m","ATSC5p","ATSC5s","ATSC5v","ATSC6e","ATSC6i","ATSC6m","ATSC6s","ATSC6v","ATSC7e","ATSC7i","ATSC7m","ATSC7p","ATSC7s","ATSC7v","ATSC8e","ATSC8i","ATSC8m","ATSC8p","ATSC8s","ATSC8v","BAC","BBI","BIC0","BIC1","BIC2","BIC3","BIC4","BIC5","BID","BLI","BLTA96","BLTD48","BLTF96","Br.094","C.","C.001","C.002","C.005","C.006","C.008","C.016","C.017","C.018","C.022","C.024","C.025","C.026","C.027","C.028","C.031","C.034","C.035","C.040","CATS2D_00_DD","CATS2D_00_DP","CATS2D_00_PP","CATS2D_01_LL","CATS2D_02_AA","CATS2D_02_AL","CATS2D_02_DA","CATS2D_02_DL","CATS2D_02_LL","CATS2D_02_PL","CATS2D_03_AA","CATS2D_03_AL","CATS2D_03_DA","CATS2D_03_DD","CATS2D_03_DL","CATS2D_03_LL","CATS2D_03_PL","CATS2D_04_AA","CATS2D_04_AL","CATS2D_04_DA","CATS2D_04_DL","CATS2D_04_LL","CATS2D_04_PL","CATS2D_05_AA","CATS2D_05_AL","CATS2D_05_AP","CATS2D_05_DA","CATS2D_05_DD","CATS2D_05_DL","CATS2D_05_LL","CATS2D_05_PL","CATS2D_06_AA","CATS2D_06_AL","CATS2D_06_DA","pXC50"
{1 0.09,2 3.835,3 1.749,4 7,5 -2.004,6 4.016,7 56.923,8 8.071,10 3.62,11 3.712,12 3.196,13 2.938,14 4.872,15 3.005,16 4.176,17 4.306,18 3.624,19 3.348,20 5.45,21 3.401,22 4.488,23 4.633,24 3.774,25 3.463,26 5.954,27 3.517,28 4.538,29 4.73,30 3.597,31 3.382,32 6.011,33 3.409,34 4.35,35 4.549,36 3.442,37 3.264,38 5.783,39 3.265,40 4.249,41 4.442,42 3.222,43 3.095,44 5.721,45 3.094,46 4.008,47 4.215,48 2.871,49 2.806,50 5.564,51 2.764,52 3.658,53 3.919,54 2.163,55 2.291,56 5.076,57 2.186,58 0.279,59 0.43,60 6.464,61 2.545,62 40.505,63 3.162,64 0.625,65 0.653,66 12.933,67 4.298,68 72.893,69 5.545,70 1.126,71 0.738,72 19.618,73 5.009,74 131.987,75 7.109,76 1.326,77 0.681,78 23.118,79 4.636,80 175.898,81 6.908,82 0.947,83 0.588,84 18.679,85 4.508,86 132.873,87 6.744,88 0.966,89 0.487,90 17.437,91 134.052,92 5.598,93 0.753,94 0.357,95 13.789,96 3.055,97 123.703,98 4.661,99 0.553,100 0.202,101 10.903,102 1.997,103 89.234,104 3.384,105 38,106 28,107 0.338,108 0.696,109 0.857,110 0.914,111 0.926,112 0.926,113 2.962,114 0.853,115 0.05,116 -0.11,117 -0.3,119 31.3,120 1,123 1,124 3,126 1,127 1,137 1,141 1,142 2,143 2,144 3,145 1,149 2,150 4,151 1,152 1,155 3,156 2,157 2,162 2,164 2,165 2,166 1,169 1,171 1,172 4.77}
{0 CHEMBL240717,1 0.071,2 9.881,3 1.779,4 11.357,5 -0.9,6 0.811,7 100.355,8 8.891,10 4.056,11 4.162,12 3.732,13 3.462,14 5.23,15 3.474,16 4.622,17 4.771,18 4.062,19 3.844,20 5.81,21 3.827,22 4.946,23 5.14,24 4.186,25 3.969,26 6.161,27 3.949,28 4.958,29 5.149,30 4.267,31 3.97,32 6.29,33 3.957,34 4.956,35 5.142,36 4.415,37 3.964,38 6.305,39 3.958,40 4.917,41 5.098,42 4.228,43 3.962,44 6.245,45 3.94,46 4.922,47 5.098,48 4.337,49 3.914,50 6.436,51 3.888,52 4.824,53 5.03,54 4.108,55 3.846,56 6.067,57 3.764,58 0.255,59 0.703,60 9.313,61 4.617,62 36.471,63 5.689,64 0.759,65 1.06,66 23.005,67 7.891,68 77.9,69 10.065,70 1.35,71 1.238,72 37.283,73 9.847,74 137.99,75 13.246,76 1.416,77 1.23,78 35.352,79 9.612,80 181.556,81 12.715,82 1.523,83 1.213,84 44.123,85 9.316,86 171.174,87 12.632,88 1.242,89 1.18,90 36.785,91 157.314,92 12.512,93 1.575,94 1.122,95 42.707,96 9.775,97 227.532,98 12.319,99 1.13,100 1.035,101 39.282,102 9.514,103 152.701,104 12.139,105 68,106 39,107 0.304,108 0.672,109 0.874,110 0.927,111 0.927,112 0.927,113 3.375,114 1.014,115 -1.33,116 -1.41,117 -1.47,118 1,119 32.7,121 4,123 2,124 3,125 1,126 1,127 2,137 2,138 1,139 1,140 1,141 4,142 3,143 4,144 3,145 2,146 3,147 1,148 2,149 4,150 3,152 2,153 2,154 1,155 3,156 4,157 2,158 1,160 1,161 3,162 9,164 4,166 3,168 1,169 1,170 3,171 1,172 4.027}
{0 CHEMBL241408,1 -0.031,2 10.377,3 1.764,4 12.194,5 0.262,6 0.069,7 109.524,8 9.564,9 0.182,10 4.08,11 4.159,12 3.828,13 3.535,14 5.31,15 3.563,16 4.62,17 4.735,18 4.175,19 3.906,20 5.878,21 3.922,22 4.893,23 5.028,24 4.293,25 4.04,26 6.206,27 4.053,28 4.957,29 5.115,30 4.348,31 4.052,32 6.339,33 4.048,34 4.987,35 5.164,36 4.471,37 4.02,38 6.363,39 4.023,40 4.896,41 5.055,42 4.282,43 3.992,44 6.259,45 3.99,46 4.868,47 5.008,48 4.43,49 3.989,50 6.43,51 3.98,52 4.874,53 5.068,54 4.262,55 3.957,56 6.181,57 3.908,58 0.293,59 0.701,60 7.072,61 4.837,62 31.991,63 5.049,64 0.858,65 1.089,66 19.886,67 8.005,68 74.314,69 8.597,70 1.356,71 1.319,72 28.321,73 10.129,74 123.331,75 11.04,76 1.411,77 1.38,78 29.076,79 10.636,80 161.172,81 12.056,82 1.623,83 1.357,84 42.824,85 10.728,86 170.521,87 12.671,88 1.348,89 1.252,90 33.245,91 157.28,92 11.23,93 1.483,94 1.235,95 34.5,96 10.371,97 194.333,98 11.436,99 1.2,100 1.227,101 38.196,102 10.806,103 144.568,104 12.494,105 60,106 46,107 0.296,108 0.695,109 0.869,110 0.903,111 0.903,112 0.903,113 3.472,114 0.926,115 -2.03,116 -2.08,117 -2.07,118 1,119 38.5,121 1,122 1,123 1,124 3,125 1,126 1,127 2,129 4,130 1,131 1,137 2,141 6,142 3,143 6,144 3,145 1,146 7,148 2,149 6,150 3,152 1,153 5,155 3,156 7,157 2,161 3,162 12,164 4,166 2,169 1,170 3,171 1,172 4.409}
{0 CHEMBL243987,1 0.077,2 9.354,3 1.495,4 14.5,5 4.146,6 17.185,7 104.654,8 6.733,9 0.167,10 4.143,11 4.258,12 3.604,13 3.592,14 5.165,15 3.571,16 4.737,17 4.914,18 3.955,19 3.989,20 5.746,21 3.933,22 5.026,23 5.267,24 3.968,25 4.077,26 5.994,27 3.987,28 5.004,29 5.252,30 3.912,31 4.031,32 6.068,33 3.93,34 4.899,35 5.152,36 3.791,37 3.96,38 5.86,39 3.859,40 4.823,41 5.061,42 3.755,43 3.89,44 5.912,45 3.793,46 4.733,47 4.967,48 3.63,49 3.795,50 5.832,51 3.697,52 4.605,53 4.839,54 3.476,55 3.68,56 5.591,57 3.572,58 0.058,59 0.79,60 13.776,61 5.677,62 13.677,63 7.636,64 0.416,65 1.255,66 26.345,67 9.422,68 41.962,69 13.132,70 0.643,71 1.462,72 36.426,73 11.257,74 72.561,75 16.663,76 0.929,77 1.4,78 36.158,79 10.805,80 99.078,81 16.092,82 0.462,83 1.294,84 31.926,85 10.012,86 60.327,87 14.835,88 0.613,89 1.192,90 29.733,91 78.166,92 13.693,93 0.513,94 1.085,95 27.151,96 8.461,97 77.429,98 12.334,99 0.416,100 0.96,101 23.766,102 7.566,103 45.348,104 11.002,105 29,106 40,107 0.247,108 0.558,109 0.757,110 0.851,111 0.891,112 0.903,113 3.374,114 1.026,115 -4.27,116 -4.21,117 -3.97,119 36.2,120 1,121 8,123 1,124 2,125 2,127 1,129 1,130 1,135 1,136 1,141 10,142 5,143 7,145 1,146 9,149 3,150 2,153 9,155 4,156 6,157 1,158 1,159 9,162 5,164 1,167 8,169 1,170 5,171 2,172 4.187}
{0 CHEMBL244614,1 0.089,2 7.537,3 1.617,4 12.75,5 2.649,6 7.018,7 98.538,8 7.558,9 0.355,10 4.055,11 4.155,12 3.624,13 3.523,14 5.17,15 3.533,16 4.624,17 4.776,18 4.016,19 3.928,20 5.739,21 3.918,22 4.889,23 5.088,24 4.06,25 4.021,26 5.996,27 3.986,28 4.895,29 5.11,30 3.992,31 3.972,32 6.085,33 3.926,34 4.771,35 4.992,36 3.872,37 3.898,38 5.864,39 3.849,40 4.647,41 4.843,42 3.822,43 3.794,44 5.894,45 3.755,46 4.56,47 4.76,48 3.679,49 3.661,50 5.826,51 3.625,52 4.378,53 4.561,54 3.531,55 3.516,56 5.554,57 3.481,58 0.122,59 0.734,60 10.564,61 4.736,62 18.444,63 5.876,64 0.493,65 1.18,66 21.085,67 7.895,68 46.099,69 10.264,70 0.767,71 1.388,72 30.27,73 9.783,74 76.949,75 13.453,76 1.029,77 1.354,78 31.633,79 9.319,80 105.894,81 13.109,82 0.592,83 1.235,84 27.379,85 8.71,86 67.17,87 12.108,88 0.65,89 1.113,90 23.418,91 75.559,92 10.367,93 0.626,94 0.977,95 21.98,96 6.622,97 81.486,98 9.054,99 0.479,100 0.809,101 17.89,102 5.909,103 44.708,104 7.78,105 23,106 44,107 0.271,108 0.651,109 0.842,110 0.902,111 0.902,112 0.902,113 3.375,114 0.92,115 -2.76,116 -2.78,117 -2.69,119 39.2,120 1,121 4,123 1,124 2,127 1,129 3,130 2,132 1,133 1,135 1,136 1,141 7,142 5,143 8,145 1,146 5,148 1,149 6,150 2,153 5,155 4,156 7,157 1,158 1,159 6,161 1,162 5,164 1,167 5,169 2,170 5,171 2,172 4.469}
{0 CHEMBL244615,1 0.084,2 8.267,3 1.594,4 13.517,5 3.105,6 9.644,7 103.139,8 7.398,9 0.344,10 4.104,11 4.208,12 3.655,13 3.574,14 5.2,15 3.576,16 4.678,17 4.836,18 4.04,19 3.979,20 5.768,21 3.959,22 4.949,23 5.158,24 4.083,25 4.075,26 6.026,27 4.028,28 4.956,29 5.178,30 4.017,31 4.028,32 6.113,33 3.971,34 4.839,35 5.069,36 3.9,37 3.959,38 5.898,39 3.897,40 4.723,41 4.933,42 3.868,43 3.865,44 5.926,45 3.815,46 4.62,47 4.813,48 3.744,49 3.753,50 5.876,51 3.708,52 4.513,53 4.72,54 3.577,55 3.617,56 5.639,57 3.562,58 0.107,59 0.772,60 11.519,61 5.069,62 17.442,63 6.421,64 0.479,65 1.243,66 22.81,67 8.472,68 45.376,69 11.221,70 0.75,71 1.467,72 32.621,73 10.508,74 77.098,75 14.713,76 1.019,77 1.432,78 33.895,79 10.04,80 106.19,81 14.356,82 0.576,83 1.313,84 29.597,85 9.442,86 67.235,87 13.348,88 0.654,89 1.19,90 25.884,91 77.015,92 11.627,93 0.587,94 1.06,95 23.113,96 7.239,97 79.8,98 9.967,99 0.514,100 0.921,101 21.155,102 6.651,103 49.713,104 9.176,105 24,106 45,107 0.264,108 0.63,109 0.826,110 0.902,111 0.902,112 0.902,113 3.408,114 0.939,115 -2.99,116 -2.99,117 -2.88,119 38.9,120 1,121 5,123 1,124 2,127 1,129 3,130 2,132 1,133 1,135 1,136 1,141 8,142 5,143 8,145 1,146 6,148 1,149 6,150 2,153 6,155 4,156 7,157 1,158 1,159 7,161 1,162 5,164 1,167 6,169 2,170 5,171 2,172 5.377}
{0 CHEMBL244824,1 0.08,2 9.006,3 1.572,4 14.3,5 3.562,6 12.685,7 107.74,8 7.255,9 0.333,10 4.15,11 4.257,12 3.684,13 3.622,14 5.228,15 3.618,16 4.73,17 4.892,18 4.064,19 4.028,20 5.797,21 3.999,22 5.007,23 5.222,24 4.106,25 4.127,26 6.055,27 4.069,28 5.013,29 5.242,30 4.041,31 4.082,32 6.139,33 4.014,34 4.903,35 5.139,36 3.928,37 4.016,38 5.931,39 3.943,40 4.795,41 5.013,42 3.896,43 3.928,44 5.957,45 3.866,46 4.698,47 4.905,48 3.793,49 3.826,50 5.908,51 3.772,52 4.576,53 4.775,54 3.648,55 3.713,56 5.7,57 3.65,58 0.092,59 0.81,60 12.46,61 5.404,62 16.439,63 6.961,64 0.465,65 1.306,66 24.494,67 9.048,68 44.566,69 12.163,70 0.733,71 1.545,72 34.879,73 11.228,74 77.008,75 15.941,76 1.01,77 1.51,78 36.073,79 10.758,80 106.187,81 15.573,82 0.56,83 1.391,84 31.736,85 10.169,86 67.005,87 14.559,88 0.65,89 1.269,90 28.132,91 77.829,92 12.858,93 0.591,94 1.138,95 25.492,96 7.968,97 81.427,98 11.21,99 0.477,100 1.004,101 22.28,102 7.274,103 48.319,104 10.077,105 25,106 46,107 0.258,108 0.61,109 0.805,110 0.891,111 0.903,112 0.903,113 3.44,114 0.956,115 -3.21,116 -3.2,117 -3.07,119 38.6,120 1,121 6,123 1,124 2,127 1,129 3,130 2,132 1,133 1,135 1,136 1,141 9,142 5,143 8,145 1,146 7,148 1,149 6,150 2,153 7,155 4,156 7,157 1,158 1,159 8,161 1,162 5,164 1,167 7,169 2,170 5,171 2,172 5.432}
{0 CHEMBL244825,1 0.087,2 8.199,3 1.594,4 13.517,5 2.684,6 7.204,7 103.088,8 7.398,9 0.344,10 4.104,11 4.208,12 3.655,13 3.574,14 5.2,15 3.576,16 4.678,17 4.836,18 4.04,19 3.979,20 5.768,21 3.959,22 4.95,23 5.16,24 4.08,25 4.073,26 6.022,27 4.029,28 4.951,29 5.168,30 4.019,31 4.033,32 6.119,33 3.974,34 4.845,35 5.078,36 3.9,37 3.96,38 5.893,39 3.898,40 4.715,41 4.922,42 3.867,43 3.862,44 5.93,45 3.814,46 4.63,47 4.828,48 3.74,49 3.757,50 5.861,51 3.713,52 4.499,53 4.691,54 3.577,55 3.633,56 5.653,57 3.572,58 0.107,59 0.772,60 11.519,61 5.069,62 17.442,63 6.421,64 0.479,65 1.243,66 22.81,67 8.472,68 45.543,69 11.221,70 0.726,71 1.469,72 32.679,73 10.394,74 76.512,75 14.564,76 1.063,77 1.423,78 33.677,79 10.1,80 107.662,81 14.292,82 0.551,83 1.324,84 29.764,85 9.35,86 65.769,87 13.431,88 0.649,89 1.185,90 25.601,91 77.945,92 11.5,93 0.587,94 1.069,95 23.482,96 7.309,97 75.346,98 10.003,99 0.479,100 0.905,101 20.527,102 7.009,103 53.462,104 9.388,105 24,106 45,107 0.264,108 0.63,109 0.826,110 0.902,111 0.902,112 0.902,113 3.408,114 0.939,115 -2.72,116 -2.73,117 -2.66,119 38.9,120 1,121 5,123 1,124 2,127 1,129 3,130 2,132 1,133 1,135 1,136 1,141 7,142 5,143 10,145 1,146 6,149 5,150 2,153 6,155 5,156 8,157 1,158 1,159 7,162 6,164 1,167 5,169 2,170 6,171 2,172 4.745}
{0 CHEMBL244826,1 0.083,2 8.94,3 1.572,4 14.3,5 3.14,6 9.861,7 107.689,8 7.255,9 0.333,10 4.15,11 4.257,12 3.684,13 3.622,14 5.228,15 3.618,16 4.73,17 4.892,18 4.064,19 4.028,20 5.796,21 3.999,22 5.007,23 5.224,24 4.103,25 4.125,26 6.052,27 4.07,28 5.008,29 5.233,30 4.044,31 4.086,32 6.146,33 4.017,34 4.908,35 5.148,36 3.927,37 4.017,38 5.926,39 3.944,40 4.787,41 5.004,42 3.896,43 3.925,44 5.96,45 3.864,46 4.707,47 4.919,48 3.793,49 3.825,50 5.899,51 3.772,52 4.567,53 4.759,54 3.644,55 3.718,56 5.715,57 3.655,58 0.092,59 0.81,60 12.46,61 5.404,62 16.439,63 6.961,64 0.465,65 1.306,66 24.494,67 9.048,68 44.732,69 12.163,70 0.707,71 1.547,72 34.931,73 11.113,74 76.276,75 15.796,76 1.056,77 1.501,78 35.879,79 10.823,80 107.904,81 15.517,82 0.534,83 1.402,84 31.893,85 10.072,86 65.314,87 14.638,88 0.645,89 1.263,90 27.861,91 78.919,92 12.736,93 0.581,94 1.148,95 25.822,96 8.004,97 76.503,98 11.237,99 0.482,100 0.989,101 22.03,102 7.376,103 54.925,104 10.033,105 25,106 46,107 0.258,108 0.61,109 0.805,110 0.891,111 0.903,112 0.903,113 3.44,114 0.956,115 -2.94,116 -2.94,117 -2.84,119 38.6,120 1,121 6,123 1,124 2,127 1,129 3,130 2,132 1,133 1,135 1,136 1,141 8,142 5,143 10,145 1,146 7,149 5,150 2,153 7,155 5,156 8,157 1,158 1,159 8,162 6,164 1,167 6,169 2,170 6,171 2,172 4.523}
{0 CHEMBL245043,1 0.108,2 7.397,3 1.651,4 13.517,5 2.15,6 4.624,7 99.493,8 7.556,9 0.344,10 4.094,11 4.198,12 3.661,13 3.542,14 5.209,15 3.555,16 4.667,17 4.827,18 4.047,19 3.943,20 5.78,21 3.935,22 4.927,23 5.133,24 4.091,25 4.033,26 6.03,27 3.998,28 4.934,29 5.162,30 4.02,31 3.973,32 6.112,33 3.933,34 4.794,35 5.018,36 3.906,37 3.9,38 5.897,39 3.859,40 4.689,41 4.897,42 3.874,43 3.806,44 5.925,45 3.777,46 4.571,47 4.756,48 3.751,49 3.689,50 5.888,51 3.665,52 4.469,53 4.677,54 3.581,55 3.552,56 5.627,57 3.518,58 0.136,59 0.779,60 11.032,61 4.74,62 19.061,63 6.058,64 0.544,65 1.233,66 22.233,67 7.946,68 49.518,69 10.599,70 0.841,71 1.42,72 31.715,73 9.776,74 80.926,75 13.949,76 1.089,77 1.383,78 33.328,79 8.942,80 110.812,81 13.281,82 0.652,83 1.252,84 28.114,85 8.429,86 70.932,87 12.028,88 0.724,89 1.144,90 24.875,91 79.64,92 10.556,93 0.66,94 1.008,95 21.681,96 6.336,97 86.075,98 8.856,99 0.597,100 0.879,101 20.161,102 5.715,103 50.497,104 8.139,105 24,106 45,107 0.275,108 0.636,109 0.819,110 0.881,111 0.881,112 0.881,113 3.408,114 0.925,115 -2.84,116 -2.85,117 -2.76,119 37.7,120 1,121 5,123 1,124 2,127 1,129 1,130 2,132 2,134 1,135 1,136 1,141 6,142 6,143 8,145 1,146 4,148 2,149 6,150 2,153 3,155 4,156 8,157 1,158 1,159 3,161 2,162 5,164 1,167 3,169 3,170 4,171 2,172 4.62}
{0 CHEMBL248320,1 -0.02,2 7.388,3 1.806,4 10.654,5 1.827,6 3.339,7 96.325,8 11.469,9 0.379,10 3.881,11 3.95,12 3.793,13 3.43,14 5.11,15 3.428,16 4.413,17 4.511,18 4.285,19 3.868,20 5.672,21 3.841,22 4.687,23 4.83,24 4.487,25 3.981,26 5.958,27 3.921,28 4.691,29 4.858,30 4.132,31 3.883,32 6.018,33 3.811,34 4.546,35 4.727,36 3.989,37 3.734,38 5.795,39 3.699,40 4.434,41 4.588,42 4.174,43 3.663,44 5.823,45 3.629,46 4.32,47 4.483,48 4.034,49 3.6,50 5.733,51 3.505,52 4.112,53 4.249,54 3.933,55 3.363,56 5.482,57 3.304,58 0.242,59 0.574,60 2.103,61 3.919,62 30.221,63 3.483,64 0.566,65 0.957,66 5.919,67 6.905,68 50.615,69 6.314,70 0.898,71 1.179,72 27.072,73 10.741,74 85.035,75 9.154,76 1.134,77 1.154,78 43.488,79 11.028,80 112.591,81 9.624,82 0.793,83 1.006,84 17.873,85 8.007,86 84.026,87 8.224,88 0.772,89 0.908,90 15.926,91 86.103,92 6.617,93 0.649,94 0.825,95 19.706,96 7.408,97 76.068,98 6.485,99 0.552,100 0.643,101 9.497,102 5.299,103 52.28,104 4.585,105 27,106 43,107 0.316,108 0.733,109 0.869,110 0.921,111 0.921,112 0.921,113 3.305,114 0.931,115 -2.8,116 -2.82,117 -2.73,119 41.5,121 1,123 1,124 2,127 1,129 4,130 2,131 2,135 1,136 1,141 4,142 5,143 7,145 2,146 4,149 4,150 2,152 3,153 6,155 4,156 6,157 1,158 2,159 5,162 5,164 2,166 1,167 2,169 1,170 6,171 2,172 5.377}
{0 CHEMBL26672,1 0.044,2 8.051,3 1.85,4 9.12,5 -1.471,6 2.163,7 84.943,8 10.029,10 3.878,11 3.955,12 3.654,13 3.249,14 5.136,15 3.303,16 4.433,17 4.549,18 3.991,19 3.605,20 5.729,21 3.652,22 4.683,23 4.807,24 4.13,25 3.743,26 6.09,27 3.785,28 4.745,29 4.903,30 4.204,31 3.779,32 6.182,33 3.807,34 4.774,35 4.922,36 4.352,37 3.765,38 6.227,39 3.808,40 4.712,41 4.856,42 4.161,43 3.76,44 6.16,45 3.773,46 4.698,47 4.85,48 4.247,49 3.681,50 6.29,51 3.689,52 4.613,53 4.809,54 3.974,55 3.516,56 6.02,57 3.462,58 0.359,59 0.553,60 5.109,61 3.719,62 39.33,63 3.862,64 0.967,65 0.819,66 17.651,67 6.019,68 85.103,69 6.427,70 1.495,71 0.969,72 23.392,73 7.358,74 137.591,75 8.254,76 1.442,77 1.01,78 24.126,79 7.784,80 174.826,81 9.128,82 1.662,83 0.988,84 34.16,85 7.496,86 180.07,87 8.684,88 1.48,89 0.946,90 26.725,91 156.798,92 8.919,93 1.483,94 0.886,95 31.862,96 8.006,97 200.481,98 9.069,99 1.497,100 0.74,101 33.706,102 7.284,103 167.64,104 8.427,105 65,106 36,107 0.331,108 0.717,109 0.899,110 0.928,111 0.928,112 0.928,113 3.268,114 0.934,115 -0.61,116 -0.73,117 -0.86,118 1,119 33.3,122 1,123 2,124 3,125 1,126 1,127 2,137 2,141 1,142 3,143 2,144 3,145 1,146 1,148 4,149 2,150 3,152 1,153 1,155 3,156 2,157 2,161 3,162 5,164 4,166 1,169 3,170 1,171 2,172 4.456}
{0 CHEMBL375147,1 0.108,2 5.831,3 1.675,4 10,5 1.249,6 1.56,7 83.917,8 8.399,9 0.393,10 3.88,11 3.955,12 3.524,13 3.34,14 5.108,15 3.384,16 4.411,17 4.518,18 3.944,19 3.751,20 5.671,21 3.783,22 4.684,23 4.839,24 3.971,25 3.829,26 5.929,27 3.84,28 4.689,29 4.868,30 3.895,31 3.758,32 6.006,33 3.757,34 4.545,35 4.73,36 3.773,37 3.669,38 5.795,39 3.666,40 4.432,41 4.594,42 3.701,43 3.558,44 5.809,45 3.567,46 4.317,47 4.493,48 3.545,49 3.41,50 5.723,51 3.412,52 4.109,53 4.258,54 3.345,55 3.201,56 5.465,57 3.215,58 0.235,59 0.58,60 7.154,61 3.758,62 29,63 3.885,64 0.558,65 0.94,66 13.808,67 6.213,68 47.556,69 6.775,70 0.907,71 1.119,72 22.114,73 7.882,74 85.917,75 9.211,76 1.139,77 1.081,78 24.3,79 7.582,80 113.278,81 9.269,82 0.776,83 0.971,84 20.47,85 6.801,86 81.167,87 8.402,88 0.78,89 0.868,90 17.475,91 85.166,92 6.904,93 0.647,94 0.768,95 15.752,96 5.168,97 75.722,98 6.328,99 0.552,100 0.597,101 12.362,102 4.268,103 51.083,104 4.779,105 18,106 41,107 0.293,108 0.701,109 0.854,110 0.921,111 0.921,112 0.921,113 3.268,114 0.837,115 -2.07,116 -2.11,117 -2.1,119 41.5,121 1,123 1,124 2,127 1,129 5,130 2,131 1,135 1,136 1,141 5,142 5,143 7,145 3,146 5,149 4,150 2,152 2,153 5,155 4,156 6,157 1,158 2,159 4,162 6,164 2,166 1,167 3,169 1,170 5,171 2,172 5.585}
{0 CHEMBL396223,1 0.102,2 8.131,3 1.628,4 14.3,5 2.607,6 6.794,7 104.094,8 7.402,9 0.333,10 4.141,11 4.248,12 3.691,13 3.592,14 5.237,15 3.598,16 4.719,17 4.884,18 4.07,19 3.994,20 5.808,21 3.976,22 4.985,23 5.2,24 4.113,25 4.087,26 6.059,27 4.04,28 4.993,29 5.227,30 4.044,31 4.03,32 6.139,33 3.978,34 4.861,35 5.093,36 3.933,37 3.961,38 5.93,39 3.907,40 4.763,41 4.98,42 3.902,43 3.873,44 5.957,45 3.829,46 4.653,47 4.854,48 3.799,49 3.767,50 5.918,51 3.732,52 4.535,53 4.733,54 3.656,55 3.649,56 5.694,57 3.605,58 0.12,59 0.817,60 11.988,61 5.07,62 18.014,63 6.598,64 0.53,65 1.296,66 23.945,67 8.516,68 48.621,69 11.544,70 0.824,71 1.497,72 34.039,73 10.487,74 81.024,75 15.181,76 1.079,77 1.46,78 35.541,79 9.648,80 110.677,81 14.504,82 0.638,83 1.33,84 30.342,85 9.153,86 70.995,87 13.26,88 0.722,89 1.222,90 27.194,91 80.504,92 11.801,93 0.668,94 1.084,95 24.178,96 7.061,97 88.285,98 10.117,99 0.554,100 0.966,101 21.236,102 6.303,103 48.423,104 9.039,105 25,106 46,107 0.268,108 0.615,109 0.797,110 0.871,111 0.883,112 0.883,113 3.44,114 0.943,115 -3.06,116 -3.06,117 -2.95,119 37.5,120 1,121 6,123 1,124 2,127 1,129 1,130 2,132 2,134 1,135 1,136 1,141 7,142 6,143 8,145 1,146 5,148 2,149 6,150 2,153 4,155 4,156 8,157 1,158 1,159 4,161 2,162 5,164 1,167 4,169 3,170 4,171 2,172 4.824}
{0 CHEMBL397671,1 0.126,2 7.239,3 1.627,4 13.517,5 2.783,6 7.747,7 102.501,8 7.909,9 0.344,10 4.04,11 4.133,12 3.646,13 3.53,14 5.206,15 3.546,16 4.588,17 4.731,18 4.028,19 3.915,20 5.759,21 3.916,22 4.823,23 5.008,24 4.064,25 3.99,26 5.998,27 3.973,28 4.795,29 4.982,30 3.999,31 3.925,32 6.076,33 3.901,34 4.657,35 4.848,36 3.884,37 3.852,38 5.828,39 3.83,40 4.595,41 4.77,42 3.859,43 3.797,44 5.904,45 3.775,46 4.567,47 4.764,48 3.726,49 3.712,50 5.848,51 3.677,52 4.382,53 4.564,54 3.556,55 3.553,56 5.616,57 3.512,58 0.135,59 0.712,60 9.424,61 4.552,62 21.193,63 5.298,64 0.503,65 1.148,66 19.05,67 7.511,68 50.152,69 9.215,70 0.735,71 1.336,72 27.233,73 9.345,74 79.357,75 11.971,76 1.033,77 1.266,78 27.341,79 8.688,80 107.514,81 11.166,82 0.53,83 1.168,84 22.706,85 7.671,86 65.402,87 9.872,88 0.642,89 1.101,90 20.821,91 77.002,92 9.218,93 0.589,94 1.041,95 21.12,96 6.985,97 76.937,98 9.036,99 0.465,100 0.834,101 17.288,102 6.328,103 53.429,104 7.993,105 24,106 45,107 0.272,108 0.683,109 0.857,110 0.9,111 0.9,112 0.9,113 3.408,114 0.892,115 -2.64,116 -2.66,117 -2.59,119 42,120 1,121 3,123 1,124 2,127 1,128 2,129 3,130 2,132 1,133 1,135 1,136 1,141 7,142 5,143 10,145 1,146 6,149 5,150 2,153 6,155 5,156 8,157 1,158 1,159 7,162 6,164 1,167 5,169 2,170 6,171 2,172 5.538}
{0 CHEMBL399413,1 0.044,2 8.051,3 1.85,4 9.12,5 -1.471,6 2.163,7 84.943,8 10.029,10 3.878,11 3.955,12 3.654,13 3.249,14 5.136,15 3.303,16 4.433,17 4.549,18 3.991,19 3.605,20 5.729,21 3.652,22 4.683,23 4.807,24 4.13,25 3.743,26 6.09,27 3.785,28 4.745,29 4.903,30 4.204,31 3.779,32 6.182,33 3.807,34 4.774,35 4.922,36 4.352,37 3.765,38 6.227,39 3.808,40 4.712,41 4.856,42 4.161,43 3.76,44 6.16,45 3.773,46 4.698,47 4.85,48 4.247,49 3.681,50 6.29,51 3.689,52 4.613,53 4.809,54 3.974,55 3.516,56 6.02,57 3.462,58 0.359,59 0.553,60 5.109,61 3.719,62 39.33,63 3.862,64 0.967,65 0.819,66 17.651,67 6.019,68 85.103,69 6.427,70 1.495,71 0.969,72 23.392,73 7.358,74 137.591,75 8.254,76 1.442,77 1.01,78 24.126,79 7.784,80 174.826,81 9.128,82 1.662,83 0.988,84 34.16,85 7.496,86 180.07,87 8.684,88 1.48,89 0.946,90 26.725,91 156.798,92 8.919,93 1.483,94 0.886,95 31.862,96 8.006,97 200.481,98 9.069,99 1.497,100 0.74,101 33.706,102 7.284,103 167.64,104 8.427,105 65,106 36,107 0.331,108 0.717,109 0.899,110 0.928,111 0.928,112 0.928,113 3.268,114 0.934,115 -0.61,116 -0.73,117 -0.86,118 1,119 33.3,122 1,123 2,124 3,125 1,126 1,127 2,137 2,141 1,142 3,143 2,144 3,145 1,146 1,148 4,149 2,150 3,152 1,153 1,155 3,156 2,157 2,161 3,162 5,164 4,166 1,169 3,170 1,171 2,172 4.456}
{0 CHEMBL400233,1 0.079,2 8.813,3 1.84,4 9.769,5 -1.813,6 3.286,7 91.153,8 9.441,10 3.951,11 4.05,12 3.674,13 3.344,14 5.172,15 3.374,16 4.504,17 4.639,18 4.015,19 3.723,20 5.753,21 3.73,22 4.82,23 4.993,24 4.143,25 3.844,26 6.108,27 3.855,28 4.834,29 5.003,30 4.228,31 3.846,32 6.245,33 3.863,34 4.831,35 4.994,36 4.384,37 3.846,38 6.292,39 3.865,40 4.786,41 4.947,42 4.164,43 3.861,44 6.162,45 3.85,46 4.814,47 4.987,48 4.278,49 3.82,50 6.329,51 3.798,52 4.741,53 4.957,54 4.057,55 3.717,56 6.073,57 3.635,58 0.297,59 0.626,60 7.118,61 3.963,62 40.87,63 4.609,64 0.79,65 0.935,66 19.131,67 6.768,68 81.179,69 8.18,70 1.388,71 1.085,72 31.549,73 8.445,74 142.437,75 10.733,76 1.45,77 1.077,78 28.929,79 8.195,80 185.205,81 10.141,82 1.563,83 1.06,84 37.654,85 8.1,86 178.32,87 10.295,88 1.258,89 1.046,90 30.312,91 157.898,92 10.431,93 1.471,94 1.028,95 37.173,96 8.782,97 213.131,98 10.808,99 1.224,100 0.929,101 36.714,102 8.463,103 165.37,104 10.842,105 66,106 37,107 0.323,108 0.717,109 0.905,110 0.931,111 0.931,112 0.931,113 3.305,114 0.978,115 -0.85,116 -0.96,117 -1.07,118 1,119 32.6,121 2,123 2,124 3,125 1,126 1,127 2,137 2,138 1,139 1,140 1,141 2,142 3,143 4,144 3,145 2,146 1,147 1,148 2,149 4,150 3,152 2,153 1,154 1,155 3,156 2,157 2,161 3,162 7,163 2,164 6,166 2,169 1,170 3,171 1,172 5.444}
{0 CHEMBL605255,1 0.115,2 5.6,3 1.903,4 7.7,5 -1.8,6 3.239,7 69.187,8 10.581,10 3.653,11 3.732,12 3.466,13 3.055,14 4.928,15 3.101,16 4.186,17 4.291,18 3.821,19 3.447,20 5.489,21 3.479,22 4.514,23 4.654,24 3.961,25 3.564,26 5.979,27 3.6,28 4.54,29 4.707,30 3.972,31 3.531,32 6.044,33 3.542,34 4.437,35 4.618,36 4.065,37 3.438,38 5.918,39 3.438,40 4.279,41 4.45,42 3.743,43 3.32,44 5.769,45 3.291,46 4.111,47 4.275,48 3.823,49 3.094,50 5.733,51 3.066,52 3.767,53 3.953,54 3.522,55 2.803,56 5.28,57 2.688,58 0.308,59 0.452,60 3.506,61 2.882,62 42.962,63 2.859,64 0.646,65 0.694,66 11.593,67 4.899,68 72.632,69 5.081,70 1.196,71 0.819,72 20.262,73 6.351,74 139.389,75 7.087,76 1.296,77 0.792,78 19.607,79 6.195,80 168.865,81 6.959,82 1.1,83 0.709,84 28.023,85 5.719,86 143.942,87 6.873,88 0.941,89 0.59,90 20.31,91 125.562,92 6.169,93 0.869,94 0.458,95 22.561,96 4.804,97 126.636,98 5.045,99 0.587,100 0.307,101 18.068,102 3.928,103 86.398,104 4.121,105 42,106 30,107 0.363,108 0.75,109 0.883,110 0.938,111 0.95,112 0.95,113 3.059,114 0.951,115 -0.57,116 -0.69,117 -0.83,118 1,119 33.3,123 1,124 3,125 1,126 1,127 2,137 1,141 1,142 2,143 2,144 3,145 1,146 1,149 2,150 4,151 1,152 1,153 1,155 3,156 2,157 2,162 4,164 2,165 2,166 2,169 1,171 1,172 5.481}
{0 CHEMBL70046,1 0.115,2 5.6,3 1.903,4 7.7,5 -1.8,6 3.239,7 69.187,8 10.581,10 3.653,11 3.732,12 3.466,13 3.055,14 4.928,15 3.101,16 4.186,17 4.291,18 3.821,19 3.447,20 5.489,21 3.479,22 4.514,23 4.654,24 3.961,25 3.564,26 5.979,27 3.6,28 4.54,29 4.707,30 3.972,31 3.531,32 6.044,33 3.542,34 4.437,35 4.618,36 4.065,37 3.438,38 5.918,39 3.438,40 4.279,41 4.45,42 3.743,43 3.32,44 5.769,45 3.291,46 4.111,47 4.275,48 3.823,49 3.094,50 5.733,51 3.066,52 3.767,53 3.953,54 3.522,55 2.803,56 5.28,57 2.688,58 0.308,59 0.452,60 3.506,61 2.882,62 42.962,63 2.859,64 0.646,65 0.694,66 11.593,67 4.899,68 72.632,69 5.081,70 1.196,71 0.819,72 20.262,73 6.351,74 139.389,75 7.087,76 1.296,77 0.792,78 19.607,79 6.195,80 168.865,81 6.959,82 1.1,83 0.709,84 28.023,85 5.719,86 143.942,87 6.873,88 0.941,89 0.59,90 20.31,91 125.562,92 6.169,93 0.869,94 0.458,95 22.561,96 4.804,97 126.636,98 5.045,99 0.587,100 0.307,101 18.068,102 3.928,103 86.398,104 4.121,105 42,106 30,107 0.363,108 0.75,109 0.883,110 0.938,111 0.95,112 0.95,113 3.059,114 0.951,115 -0.57,116 -0.69,117 -0.83,118 1,119 33.3,123 1,124 3,125 1,126 1,127 2,137 1,141 1,142 2,143 2,144 3,145 1,146 1,149 2,150 4,151 1,152 1,153 1,155 3,156 2,157 2,162 4,164 2,165 2,166 2,169 1,171 1,172 5.495}
