"molecule_id","nH","nN","RBN","Si","Mp","H.","nAT","nBT","nCsp3","nSK","RBF","Se","Sp","AMW","Mv","pXC50"
{1 11,3 4,4 38.798,5 0.726,6 31.4,7 35,8 37,9 1,10 24,11 0.108,12 36.527,13 25.426,14 9.896,15 0.723,16 4}
{0 CHEMBL1302328,1 17,2 2,3 5,4 53.705,5 0.694,6 35.4,7 48,8 51,9 2,10 31,11 0.098,12 49.422,13 33.313,14 8.759,15 0.692,16 4}
{0 CHEMBL1302460,1 26,2 2,3 6,4 65.817,5 0.677,6 44.1,7 59,8 61,9 4,10 33,11 0.098,12 59.116,13 39.966,14 7.501,15 0.648,16 4}
{0 CHEMBL1304402,1 21,2 4,3 3,4 52.883,5 0.685,6 44.7,7 47,8 50,9 6,10 26,11 0.06,12 47.011,13 32.188,14 7.849,15 0.646,16 4}
{0 CHEMBL1306501,1 12,2 2,4 29.913,5 0.745,6 44.4,7 27,8 28,9 5,10 15,12 26.774,13 20.114,14 8.755,15 0.669,16 4}
{0 CHEMBL1310036,1 11,2 2,3 2,4 38.041,5 0.709,6 32.4,7 34,8 36,10 23,11 0.056,12 35.116,13 24.119,14 9.126,15 0.712,16 4}
{0 CHEMBL1311185,1 15,2 1,3 3,4 44.292,5 0.723,6 37.5,7 40,8 42,9 2,10 25,11 0.071,12 41.076,13 28.903,14 9.437,15 0.691,16 4}
{0 CHEMBL1311811,1 14,2 1,3 5,4 40.186,5 0.695,6 38.9,7 36,8 37,9 4,10 22,11 0.135,12 36.92,13 25.011,14 8.882,15 0.678,16 4}
{0 CHEMBL1312739,1 14,2 2,3 3,4 43.535,5 0.689,6 35.9,7 39,8 41,9 1,10 25,11 0.073,12 40.142,13 26.852,14 8.675,15 0.687,16 4}
{0 CHEMBL1313262,1 10,2 6,3 3,4 35.239,5 0.692,6 32.3,7 31,8 33,10 21,11 0.091,12 32.033,13 21.466,14 9.106,15 0.697,16 4}
{0 CHEMBL1313324,1 12,2 2,3 5,4 42.67,5 0.784,6 30.8,7 39,8 42,9 2,10 27,11 0.119,12 40.16,13 30.58,14 10.68,15 0.746,16 4}
{0 CHEMBL1317919,1 16,2 5,3 6,4 49.395,5 0.73,6 36.4,7 44,8 46,9 4,10 28,11 0.13,12 45.269,13 32.114,14 9.954,15 0.696,16 4}
{0 CHEMBL1318817,1 8,2 2,3 3,4 28.804,5 0.807,6 30.8,7 26,8 27,9 2,10 18,11 0.111,12 27.193,13 20.977,14 12.432,15 0.754,16 4}
{0 CHEMBL1322995,1 16,2 5,3 6,4 49.395,5 0.73,6 36.4,7 44,8 46,9 4,10 28,11 0.13,12 45.269,13 32.114,14 9.954,15 0.696,16 4}
{0 CHEMBL1324674,1 18,2 4,3 4,4 50.238,5 0.709,6 40,7 45,8 48,9 4,10 27,11 0.083,12 45.323,13 31.909,14 8.411,15 0.675,16 4}
{0 CHEMBL1328567,1 6,4 22.083,5 0.705,6 30,7 20,8 21,10 14,12 20.96,13 14.102,14 9.508,15 0.722,16 4}
{0 CHEMBL1330109,1 14,2 2,3 4,4 42.325,5 0.695,6 36.8,7 38,8 40,9 2,10 24,11 0.1,12 38.814,13 26.398,14 8.483,15 0.686,16 4}
{0 CHEMBL1331561,1 8,2 1,3 3,4 33.466,5 0.73,6 26.7,7 30,8 32,10 22,11 0.094,12 31.862,13 21.909,14 10.71,15 0.742,16 4}
{0 CHEMBL1332481,1 8,2 1,3 1,4 25.42,5 0.753,6 34.8,7 23,8 24,9 1,10 15,11 0.042,12 23.52,13 17.313,14 11.57,15 0.721,16 4}
{0 CHEMBL1332506,1 14,2 2,3 4,4 46.535,5 0.711,6 33.3,7 42,8 45,10 28,11 0.089,12 43.142,13 29.852,14 8.914,15 0.709,16 4}
{0 CHEMBL1335615,1 13,2 3,3 4,4 43.538,5 0.711,6 33.3,7 39,8 41,10 26,11 0.098,12 40.436,13 27.744,14 9.523,15 0.704,16 4}
{0 CHEMBL1336283,1 21,2 5,3 8,4 62.91,5 0.699,6 37.5,7 56,8 58,9 2,10 35,11 0.138,12 57.694,13 39.142,14 9.207,15 0.678,16 4}
{0 CHEMBL1337235,1 17,2 4,3 4,4 48.601,5 0.69,6 39.5,7 43,8 45,9 5,10 26,11 0.089,12 44.302,13 29.676,14 9.23,15 0.666,16 4}
{0 CHEMBL1340284,1 13,2 1,3 4,4 38.618,5 0.713,6 37.1,7 35,8 37,10 22,11 0.108,12 35.385,13 24.938,14 8.323,15 0.695,16 4}
{0 CHEMBL1341870,1 16,2 5,3 6,4 49.395,5 0.73,6 36.4,7 44,8 46,9 4,10 28,11 0.13,12 45.269,13 32.114,14 9.954,15 0.696,16 4}
{0 CHEMBL1342821,1 14,2 2,3 3,4 41.827,5 0.74,6 36.8,7 38,8 41,10 24,11 0.073,12 38.236,13 28.137,14 8.801,15 0.706,16 4}
{0 CHEMBL1343048,1 10,2 2,3 3,4 32.867,5 0.75,6 33.3,7 30,8 31,10 20,11 0.097,12 30.065,13 22.512,14 8.61,15 0.729,16 4}
{0 CHEMBL1344289,1 23,2 5,3 8,4 65.066,5 0.684,6 39.7,7 58,8 62,9 4,10 35,11 0.129,12 58.771,13 39.699,14 8.096,15 0.667,16 4}
{0 CHEMBL1344491,1 18,2 5,3 7,4 52.81,5 0.721,6 38.3,7 47,8 49,9 5,10 29,11 0.143,12 48.153,13 33.875,14 9.617,15 0.684,16 4}
{0 CHEMBL1347107,1 20,2 4,3 6,4 56.362,5 0.668,6 40,7 50,8 53,9 4,10 30,11 0.113,12 51.113,13 33.387,14 8.169,15 0.657,16 4}
{0 CHEMBL1347659,1 11,2 3,3 3,4 38.203,5 0.686,6 32.4,7 34,8 36,9 1,10 23,11 0.083,12 35.476,13 23.335,14 9.214,15 0.698,16 4}
{0 CHEMBL1349629,1 7,2 3,3 2,4 30.967,5 0.806,6 25,7 28,8 30,10 21,11 0.067,12 29.335,13 22.574,14 12.15,15 0.783,16 4}
{0 CHEMBL1351902,1 10,2 2,3 1,4 25.076,5 0.635,6 45.5,7 22,8 22,9 1,10 12,11 0.045,12 22.393,13 13.966,14 7.555,15 0.617,16 4}
{0 CHEMBL1353985,1 17,2 3,3 4,4 48.74,5 0.725,6 38.6,7 44,8 47,9 1,10 27,11 0.085,12 44.222,13 31.904,14 8.534,15 0.69,16 4}
{0 CHEMBL1360525,1 8,2 4,3 5,4 37,5 0.725,6 24.2,7 33,8 35,10 25,11 0.143,12 35.215,13 23.92,14 10.919,15 0.746,16 4}
{0 CHEMBL1365198,1 23,2 3,3 7,4 63.694,5 0.683,6 40.4,7 57,8 61,9 7,10 34,11 0.115,12 57.778,13 38.904,14 8.027,15 0.665,16 4}
{0 CHEMBL1373390,1 13,2 1,3 3,4 42.827,5 0.728,6 33.3,7 39,8 42,10 26,11 0.071,12 39.713,13 28.392,14 8.804,15 0.719,16 4}
{0 CHEMBL1374123,1 22,2 2,3 7,4 63.405,5 0.69,6 38.6,7 57,8 61,9 4,10 35,11 0.115,12 58.003,13 39.352,14 8.255,15 0.677,16 4}
{0 CHEMBL1375750,1 15,2 1,3 5,4 40.242,5 0.671,6 41.7,7 36,8 37,9 4,10 21,11 0.135,12 36.596,13 24.154,14 7.926,15 0.655,16 4}
{0 CHEMBL1380356,1 22,2 2,3 7,4 57.405,5 0.654,6 43.1,7 51,8 53,9 7,10 29,11 0.132,12 52.003,13 33.352,14 7.813,15 0.639,16 4}
{0 CHEMBL1381627,1 18,2 2,3 7,4 55.913,5 0.688,6 36,7 50,8 53,9 4,10 32,11 0.132,12 51.967,13 34.386,14 9.17,15 0.683,16 4}
{0 CHEMBL1383455,1 13,2 6,3 4,4 44.223,5 0.7,6 33.3,7 39,8 41,9 4,10 26,11 0.098,12 40.451,13 27.301,14 9.559,15 0.698,16 4}
{0 CHEMBL1383611,1 14,2 1,3 5,4 39.084,5 0.7,6 40,7 35,8 36,9 3,10 21,11 0.139,12 35.825,13 24.506,14 10.063,15 0.674,16 4}
{0 CHEMBL1386851,1 19,2 2,3 3,4 49.226,5 0.698,6 43.2,7 44,8 46,9 5,10 25,11 0.065,12 44.538,13 30.733,14 8.612,15 0.658,16 4}
{0 CHEMBL1386872,1 23,2 5,3 8,4 67.115,5 0.707,6 38.3,7 60,8 63,9 2,10 37,11 0.127,12 61.251,13 42.449,14 8.961,15 0.68,16 4}
{0 CHEMBL1388649,1 23,2 5,3 10,4 66.195,5 0.692,6 39,7 59,8 62,9 3,10 36,11 0.161,12 60.174,13 40.801,14 8.569,15 0.671,16 4}
{0 CHEMBL1390702,1 11,2 5,3 2,4 37.787,5 0.767,6 32.4,7 34,8 37,9 1,10 23,11 0.054,12 34.64,13 26.063,14 10.043,15 0.729,16 4}
{0 CHEMBL1400929,1 19,2 5,3 7,4 60.574,5 0.699,6 35.2,7 54,8 57,9 1,10 35,11 0.123,12 55.734,13 37.733,14 9.14,15 0.69,16 4}
{0 CHEMBL1401639,1 21,2 3,3 4,4 56.488,5 0.652,6 42,7 50,8 52,9 8,10 29,11 0.077,12 51.222,13 32.597,14 7.989,15 0.642,16 4}
{0 CHEMBL1401841,1 12,2 2,3 2,4 33.491,5 0.691,6 40,7 30,8 32,9 2,10 18,11 0.063,12 30.276,13 20.727,14 8.009,15 0.67,16 4}
{0 CHEMBL1402954,1 18,2 3,3 6,4 47.286,5 0.686,6 42.9,7 42,8 43,9 6,10 24,11 0.14,12 42.585,13 28.824,14 9.34,15 0.654,16 4}
{0 CHEMBL1403013,1 18,2 4,3 6,4 53.156,5 0.661,6 38.3,7 47,8 49,9 5,10 29,11 0.122,12 48.556,13 31.08,14 8.477,15 0.661,16 4}
{0 CHEMBL1403191,1 17,3 5,4 48.835,5 0.703,6 38.6,7 44,8 46,9 5,10 27,11 0.109,12 45.145,13 30.932,14 9.847,15 0.683,16 4}
{0 CHEMBL1406745,1 16,2 1,3 5,4 48.709,5 0.721,6 36.4,7 44,8 47,9 3,10 28,11 0.106,12 45.036,13 31.722,14 10.052,15 0.701,16 4}
{0 CHEMBL1408395,1 17,2 2,4 43.681,5 0.689,6 43.6,7 39,8 42,9 7,10 22,12 39.251,13 26.87,14 8.123,15 0.654,16 4}
{0 CHEMBL1409585,1 18,3 4,4 49.784,5 0.692,6 40,7 45,8 47,9 3,10 27,11 0.085,12 45.589,13 31.125,14 8.053,15 0.674,16 4}
{0 CHEMBL1410383,1 24,2 1,3 9,4 64.788,5 0.684,6 41.4,7 58,8 61,9 9,10 34,11 0.148,12 59.225,13 39.676,14 9.145,15 0.662,16 4}
{0 CHEMBL1410562,1 17,2 4,3 3,4 49.053,5 0.72,6 38.6,7 44,8 47,9 3,10 27,11 0.064,12 44.243,13 31.665,14 8.565,15 0.689,16 4}
{0 CHEMBL1420416,1 19,2 1,3 7,4 54.332,5 0.712,6 38.8,7 49,8 51,9 4,10 30,11 0.137,12 50.171,13 34.881,14 9.093,15 0.682,16 4}
{0 CHEMBL1421193,1 22,2 6,3 3,4 58.73,5 0.674,6 42.3,7 52,8 54,9 9,10 30,11 0.056,12 52.334,13 35.034,14 7.74,15 0.649,16 4}
{0 CHEMBL1423709,1 14,2 3,3 3,4 42.665,5 0.713,6 36.8,7 38,8 40,9 2,10 24,11 0.075,12 38.851,13 27.08,14 9.037,15 0.69,16 4}
{0 CHEMBL1428278,1 14,2 4,3 3,4 41.408,5 0.713,6 37.8,7 37,8 40,9 3,10 23,11 0.075,12 37.556,13 26.387,14 8.822,15 0.685,16 4}
{0 CHEMBL1428710,1 16,2 4,3 4,4 50.322,5 0.698,6 35.6,7 45,8 48,9 1,10 29,11 0.083,12 46.018,13 31.409,14 8.631,15 0.691,16 4}
{0 CHEMBL1429799,1 21,2 3,3 5,4 57.279,5 0.669,6 41.2,7 51,8 54,9 5,10 30,11 0.093,12 51.894,13 34.142,14 7.989,15 0.654,16 4}
{0 CHEMBL1431490,1 14,2 4,3 6,4 45.617,5 0.728,6 34.1,7 41,8 44,9 1,10 27,11 0.136,12 41.884,13 29.841,14 9.23,15 0.709,16 4}
{0 CHEMBL1431570,1 16,2 2,3 3,4 42.661,5 0.679,6 42.1,7 38,8 40,9 6,10 22,11 0.075,12 38.774,13 25.807,14 8.432,15 0.652,16 4}
{0 CHEMBL1432739,1 11,2 1,3 3,4 32.203,5 0.696,6 37.9,7 29,8 30,9 2,10 18,11 0.1,12 29.502,13 20.176,14 8.319,15 0.683,16 4}
{0 CHEMBL1433028,1 9,2 1,3 3,4 30.206,5 0.679,6 33.3,7 27,8 28,9 1,10 18,11 0.107,12 28.273,13 18.324,14 9.156,15 0.693,16 4}
{0 CHEMBL1438182,1 13,2 1,3 6,4 32.827,5 0.634,6 44.8,7 29,8 29,9 3,10 16,11 0.207,12 29.713,13 18.392,14 7.698,15 0.622,16 4}
{0 CHEMBL1441315,1 10,2 1,3 3,4 36.881,5 0.717,6 30.3,7 33,8 35,9 1,10 23,11 0.086,12 34.745,13 23.67,14 10.162,15 0.721,16 4}
{0 CHEMBL1443706,1 23,2 4,3 9,4 66.186,5 0.704,6 39,7 59,8 62,9 6,10 36,11 0.145,12 60.684,13 41.517,14 9.341,15 0.675,16 4}
{0 CHEMBL1449785,1 24,2 1,3 9,4 67.788,5 0.7,6 39.3,7 61,8 64,9 6,10 37,11 0.141,12 62.225,13 42.676,14 9.286,15 0.678,16 4}
{0 CHEMBL1454835,1 21,2 3,3 4,4 60.279,5 0.688,6 38.9,7 54,8 57,9 3,10 33,11 0.07,12 54.894,13 37.142,14 8.213,15 0.674,16 4}
{0 CHEMBL1459167,1 14,2 4,3 2,4 42.199,5 0.735,6 36.8,7 38,8 41,9 2,10 24,11 0.049,12 38.229,13 27.932,14 8.801,15 0.701,16 4}
{0 CHEMBL1461619,1 14,2 2,3 4,4 52.163,5 0.707,6 29.8,7 47,8 51,9 1,10 33,11 0.078,12 49.124,13 33.216,14 9.498,15 0.722,16 4}
{0 CHEMBL1464107,1 12,2 3,3 3,4 41.143,5 0.731,6 32.4,7 37,8 40,9 1,10 25,11 0.075,12 38.029,13 27.046,14 9.562,15 0.721,16 4}
{0 CHEMBL1464233,1 12,2 1,3 4,4 36.669,5 0.72,6 36.4,7 33,8 34,9 3,10 21,11 0.118,12 33.942,13 23.744,14 10.612,15 0.699,16 4}
{0 CHEMBL1469463,1 16,2 4,3 3,4 49.113,5 0.704,6 36.4,7 44,8 47,9 1,10 28,11 0.064,12 44.691,13 30.955,14 8.464,15 0.691,16 4}
{0 CHEMBL1471546,1 12,2 1,3 5,4 42.03,5 0.749,6 31.6,7 38,8 40,9 3,10 26,11 0.125,12 39.844,13 28.454,14 10.892,15 0.728,16 4}
{0 CHEMBL1476442,1 16,2 1,3 5,4 44.29,5 0.72,6 40,7 40,8 42,9 2,10 24,11 0.119,12 40.382,13 28.813,14 9.656,15 0.685,16 4}
{0 CHEMBL1479899,1 22,2 2,3 4,4 48.697,5 0.643,6 51.2,7 43,8 44,9 9,10 21,11 0.091,12 43.098,13 27.637,14 7.22,15 0.596,16 4}
{0 CHEMBL1487033,1 18,2 2,3 3,4 46.946,5 0.678,6 42.9,7 42,8 44,9 3,10 24,11 0.068,12 42.254,13 28.466,14 7.676,15 0.652,16 4}
{0 CHEMBL1490987,1 18,2 5,3 7,4 52.81,5 0.721,6 38.3,7 47,8 49,9 5,10 29,11 0.143,12 48.153,13 33.875,14 9.617,15 0.684,16 4}
{0 CHEMBL1494242,1 17,2 3,3 6,4 53.368,5 0.714,6 35.4,7 48,8 51,9 2,10 31,11 0.118,12 49.204,13 34.267,14 9.073,15 0.698,16 4}
{0 CHEMBL1494334,1 13,2 4,3 4,4 45.842,5 0.699,6 32.5,7 40,8 43,9 4,10 27,11 0.093,12 41.978,13 27.96,14 9.86,15 0.7,16 4}
{0 CHEMBL1496458,1 29,2 1,3 9,4 67.358,5 0.649,6 48.3,7 60,8 62,9 10,10 31,11 0.145,12 60.109,13 38.938,14 7.059,15 0.616,16 4}
{0 CHEMBL1496732,1 17,2 1,3 4,4 38.029,5 0.663,6 50,7 34,8 35,9 3,10 17,11 0.114,12 33.498,13 22.551,14 6.686,15 0.616,16 4}
{0 CHEMBL1496782,1 8,2 2,3 1,4 33.499,5 0.701,6 26.7,7 30,8 32,10 22,11 0.031,12 31.818,13 21.023,14 10.008,15 0.73,16 4}
{0 CHEMBL1499491,1 10,2 1,3 2,4 30.147,5 0.705,6 37,7 27,8 28,9 2,10 17,11 0.071,12 27.825,13 19.034,14 9.321,15 0.69,16 4}
{0 CHEMBL1503852,1 12,2 2,3 5,4 43.169,5 0.74,6 30.8,7 39,8 41,9 1,10 27,11 0.122,12 40.738,13 28.841,14 10.371,15 0.727,16 4}
{0 CHEMBL1504429,1 15,2 5,3 9,4 50.455,5 0.72,6 33.3,7 45,8 48,9 4,10 30,11 0.188,12 46.716,13 32.403,14 9.9,15 0.704,16 4}
{0 CHEMBL1509648,1 19,2 3,3 7,4 56.073,5 0.677,6 38,7 50,8 52,9 2,10 31,11 0.135,12 51.338,13 33.835,14 8.429,15 0.671,16 4}
{0 CHEMBL1511130,1 13,2 3,3 2,4 40.409,5 0.685,6 36.1,7 36,8 38,9 1,10 23,11 0.053,12 37.033,13 24.642,14 8.648,15 0.682,16 4}
{0 CHEMBL1517158,1 18,2 4,3 5,4 49.867,5 0.665,6 40.9,7 44,8 46,9 5,10 26,11 0.109,12 45.305,13 29.273,14 8.601,15 0.649,16 4}
{0 CHEMBL1517374,1 15,2 2,3 4,4 43.475,5 0.707,6 38.5,7 39,8 41,9 2,10 24,11 0.098,12 39.694,13 27.563,14 8.79,15 0.685,16 4}
{0 CHEMBL1519313,1 21,2 3,3 3,4 58.698,5 0.655,6 40.4,7 52,8 57,9 12,10 31,11 0.053,12 53.549,13 34.051,14 8.22,15 0.65,16 4}
{0 CHEMBL1521945,1 19,2 1,3 5,4 46.863,5 0.672,6 45.2,7 42,8 44,9 5,10 23,11 0.114,12 42.036,13 28.222,14 7.366,15 0.641,16 4}
{0 CHEMBL1523512,1 7,2 2,3 2,4 24.814,5 0.705,6 31.8,7 22,8 23,9 1,10 15,11 0.087,12 23.16,13 15.517,14 10.301,15 0.709,16 4}
{0 CHEMBL1524427,1 17,2 1,3 4,4 44.658,5 0.673,6 42.5,7 40,8 42,9 4,10 23,11 0.095,12 40.48,13 26.915,14 7.784,15 0.652,16 4}
{0 CHEMBL1527113,1 11,2 1,3 2,4 36.412,5 0.716,6 33.3,7 33,8 35,10 22,11 0.057,12 33.829,13 23.631,14 8.888,15 0.713,16 4}
{0 CHEMBL1528294,1 13,2 1,3 4,4 39.957,5 0.708,6 36.1,7 36,8 38,9 2,10 23,11 0.105,12 37.116,13 25.494,14 9.205,15 0.693,16 4}
{0 CHEMBL1529115,1 17,2 1,3 3,4 47.707,5 0.713,6 39.5,7 43,8 45,9 3,10 26,11 0.067,12 43.96,13 30.665,14 9.105,15 0.679,16 4}
{0 CHEMBL1529471,1 14,2 2,3 5,4 46.584,5 0.729,6 33.3,7 42,8 44,9 2,10 28,11 0.114,12 43.622,13 30.602,14 9.964,15 0.711,16 4}
{0 CHEMBL1529705,1 15,2 5,3 3,4 54.605,5 0.754,6 30.6,7 49,8 54,9 2,10 34,11 0.056,12 50.378,13 36.949,14 10.04,15 0.737,16 4}
{0 CHEMBL1533094,1 11,2 2,3 2,4 36.542,5 0.743,6 33.3,7 33,8 35,10 22,11 0.057,12 33.833,13 24.534,14 10.885,15 0.723,16 4}
{0 CHEMBL1538460,1 8,3 3,4 24.498,5 0.676,6 36.4,7 22,8 22,10 14,11 0.136,12 22.844,13 14.864,14 8.735,15 0.68,16 4}
{0 CHEMBL1538622,1 9,2 1,3 3,4 28.289,5 0.775,6 34.6,7 26,8 27,10 17,11 0.111,12 26.04,13 20.154,14 9.204,15 0.732,16 4}
{0 CHEMBL1541889,1 11,2 2,3 3,4 32.333,5 0.727,6 37.9,7 29,8 30,10 18,11 0.1,12 29.505,13 21.08,14 10.592,15 0.694,16 4}
{0 CHEMBL1542987,1 17,2 1,3 9,4 46.908,5 0.73,6 40.5,7 42,8 43,9 6,10 25,11 0.209,12 43.706,13 30.653,14 10.644,15 0.675,16 4}
{0 CHEMBL1543544,1 18,2 3,3 3,4 52.994,5 0.678,6 38.3,7 47,8 50,9 4,10 29,11 0.06,12 48.196,13 31.864,14 8.413,15 0.671,16 4}
{0 CHEMBL1546134,1 14,2 4,3 3,4 42.199,5 0.735,6 36.8,7 38,8 41,9 1,10 24,11 0.073,12 38.229,13 27.932,14 8.801,15 0.701,16 4}
{0 CHEMBL1550490,1 15,2 1,3 4,4 43.242,5 0.696,6 38.5,7 39,8 41,9 2,10 24,11 0.098,12 39.596,13 27.154,14 8.24,15 0.681,16 4}
{0 CHEMBL1555532,1 9,2 3,3 5,4 36.917,5 0.717,6 27.3,7 33,8 34,9 1,10 24,11 0.147,12 34.996,13 23.676,14 10.525,15 0.731,16 4}
{0 CHEMBL1558183,1 19,2 3,3 4,4 46.026,5 0.672,6 46.3,7 41,8 43,9 4,10 22,11 0.093,12 40.702,13 27.563,14 7.156,15 0.634,16 4}
{0 CHEMBL1559165,1 9,2 1,3 4,4 29.418,5 0.787,6 33.3,7 27,8 28,9 1,10 18,11 0.143,12 27.444,13 21.256,14 10.199,15 0.738,16 4}
{0 CHEMBL1559180,1 16,2 2,3 4,4 45.741,5 0.687,6 39,7 41,8 43,9 2,10 25,11 0.093,12 41.698,13 28.159,14 8.204,15 0.673,16 4}
{0 CHEMBL1559687,1 12,2 3,3 4,4 44.167,5 0.679,6 30.8,7 39,8 41,9 1,10 27,11 0.098,12 41.2,13 26.489,14 9.572,15 0.702,16 4}
{0 CHEMBL1562987,1 18,2 4,3 8,4 57.707,5 0.742,6 34.6,7 52,8 55,9 2,10 34,11 0.145,12 53.458,13 38.568,14 9.897,15 0.71,16 4}
{0 CHEMBL1567502,1 17,2 2,3 5,4 47.59,5 0.739,6 39.5,7 43,8 45,10 26,11 0.111,12 43.305,13 31.796,14 8.94,15 0.686,16 4}
{0 CHEMBL1570267,1 13,3 4,4 42.503,5 0.684,6 34.2,7 38,8 40,9 2,10 25,11 0.1,12 39.662,13 25.994,14 9.061,15 0.694,16 4}
{0 CHEMBL1570535,1 11,2 1,3 2,4 30.203,5 0.673,6 40.7,7 27,8 28,9 2,10 16,11 0.071,12 27.502,13 18.176,14 8.046,15 0.659,16 4}
{0 CHEMBL1570573,1 14,3 4,4 42.163,5 0.686,6 36.8,7 38,8 41,9 5,10 24,11 0.098,12 39.149,13 26.057,14 8.587,15 0.684,16 4}
{0 CHEMBL1571258,1 10,2 2,3 3,4 35.415,5 0.735,6 31.3,7 32,8 34,10 22,11 0.088,12 33.124,13 23.523,14 9.823,15 0.725,16 4}
{0 CHEMBL1575481,1 16,2 1,3 7,4 49.651,5 0.745,6 35.6,7 45,8 47,9 3,10 29,11 0.149,12 46.284,13 33.523,14 9.999,15 0.711,16 4}
{0 CHEMBL1578277,1 14,2 2,3 4,4 40.535,5 0.663,6 38.9,7 36,8 37,9 1,10 22,11 0.108,12 37.142,13 23.852,14 8.398,15 0.66,16 4}
{0 CHEMBL1578345,1 7,2 2,3 5,4 28.944,5 0.755,6 26.9,7 26,8 27,9 1,10 19,11 0.185,12 27.564,13 19.619,14 11.489,15 0.75,16 4}
{0 CHEMBL1581086,1 14,2 2,3 5,4 39.325,5 0.669,6 40,7 35,8 36,9 2,10 21,11 0.139,12 35.814,13 23.398,14 8.18,15 0.659,16 4}
{0 CHEMBL1581158,1 11,2 1,4 28.784,5 0.703,6 42.3,7 26,8 28,9 2,10 15,12 25.847,13 18.267,14 7.587,15 0.668,16 4}
{0 CHEMBL1581683,1 23,2 4,3 9,4 67.452,5 0.692,6 38.3,7 60,8 63,9 5,10 37,11 0.143,12 61.469,13 41.494,14 8.71,15 0.675,16 4}
{0 CHEMBL1581845,1 23,2 1,3 2,4 56.113,5 0.653,6 46,7 50,8 53,9 9,10 27,11 0.038,12 50.458,13 32.654,14 7.389,15 0.628,16 4}
{0 CHEMBL1589086,1 8,2 2,3 1,4 32.289,5 0.709,6 27.6,7 29,8 31,10 21,11 0.032,12 30.491,13 20.568,14 9.801,15 0.731,16 4}
{0 CHEMBL1589453,1 13,3 5,4 42.924,5 0.745,6 33.3,7 39,8 41,9 2,10 26,11 0.122,12 40.455,13 29.057,14 11.212,15 0.723,16 4}
{0 CHEMBL1589514,1 12,2 2,3 3,4 38.83,5 0.722,6 34.3,7 35,8 37,9 1,10 23,11 0.081,12 36.007,13 25.284,14 9.382,15 0.706,16 4}
{0 CHEMBL1598439,1 16,3 4,4 41.369,5 0.658,6 43.2,7 37,8 39,9 7,10 21,11 0.103,12 37.705,13 24.364,14 7.792,15 0.643,16 4}
{0 CHEMBL1598985,1 14,2 5,3 6,4 45.98,5 0.74,6 34.1,7 41,8 43,9 3,10 27,11 0.14,12 42.385,13 30.352,14 10.34,15 0.709,16 4}
{0 CHEMBL1599312,1 11,2 3,3 3,4 40.332,5 0.707,6 30.6,7 36,8 38,10 25,11 0.079,12 37.88,13 25.437,14 10.038,15 0.712,16 4}
{0 CHEMBL1601846,1 6,4 28.921,5 0.689,6 23.1,7 26,8 28,10 20,12 28.269,13 17.92,14 10.699,15 0.742,16 4}
{0 CHEMBL1604350,1 18,2 5,3 6,4 52.81,5 0.721,6 38.3,7 47,8 49,9 5,10 29,11 0.122,12 48.153,13 33.875,14 9.617,15 0.684,16 4}
{0 CHEMBL1604527,1 13,2 1,3 3,4 39.957,5 0.708,6 36.1,7 36,8 38,9 2,10 23,11 0.079,12 37.116,13 25.494,14 9.205,15 0.693,16 4}
{0 CHEMBL1606907,1 14,2 2,3 6,4 46.584,5 0.729,6 33.3,7 42,8 44,9 2,10 28,11 0.136,12 43.622,13 30.602,14 9.964,15 0.711,16 4}
{0 CHEMBL1607313,1 11,2 1,3 1,4 35.203,5 0.724,6 34.4,7 32,8 35,9 1,10 21,11 0.029,12 32.502,13 23.176,14 8.665,15 0.712,16 4}
{0 CHEMBL1609490,1 10,2 3,3 3,4 35.786,5 0.703,6 31.3,7 32,8 34,10 22,11 0.088,12 33.207,13 22.5,14 9.259,15 0.711,16 4}
{0 CHEMBL1612887,1 17,2 1,3 6,4 42.658,5 0.656,6 44.7,7 38,8 39,9 4,10 21,11 0.154,12 38.48,13 24.915,14 7.562,15 0.634,16 4}
{0 CHEMBL1698859,1 16,3 2,4 44.74,5 0.732,6 39,7 41,8 44,10 25,11 0.045,12 40.723,13 30,14 7.912,15 0.699,16 4}
{0 CHEMBL1703892,1 14,2 2,3 4,4 47.874,5 0.707,6 32.6,7 43,8 45,9 2,10 29,11 0.089,12 44.873,13 30.409,14 9.638,15 0.707,16 4}
{0 CHEMBL1711432,1 25,2 3,3 9,4 53.481,5 0.623,6 53.2,7 47,8 48,9 8,10 22,11 0.188,12 46.68,13 29.302,14 6.456,15 0.581,16 4}
{0 CHEMBL1714283,1 18,2 2,3 4,4 44.946,5 0.662,6 45,7 40,8 41,9 4,10 22,11 0.098,12 40.254,13 26.466,14 7.459,15 0.635,16 4}
{0 CHEMBL1715126,1 24,2 2,3 4,4 51.773,5 0.649,6 52.2,7 46,8 47,9 6,10 22,11 0.085,12 45.251,13 29.841,14 6.445,15 0.599,16 4}
{0 CHEMBL1735864,1 11,2 1,3 4,4 32.412,5 0.677,6 37.9,7 29,8 30,9 2,10 18,11 0.133,12 29.829,13 19.631,14 8.457,15 0.673,16 4}
{0 CHEMBL1871771,1 19,2 3,3 6,4 54.784,5 0.694,6 38.8,7 49,8 51,9 3,10 30,11 0.118,12 50.087,13 34.029,14 8.684,15 0.674,16 4}
{0 CHEMBL187266,1 18,4 44.365,5 0.68,6 45,7 40,8 43,9 7,10 22,12 39.934,13 27.216,14 7.359,15 0.647,16 4}
{0 CHEMBL1878916,1 5,2 1,3 2,4 18.166,5 0.647,6 31.3,7 16,8 16,9 1,10 11,11 0.125,12 17.178,13 10.347,14 9.695,15 0.683,16 4}
{0 CHEMBL1902287,1 21,2 1,3 6,4 48.488,5 0.638,6 48.8,7 43,8 44,9 5,10 22,11 0.136,12 43.247,13 27.438,14 7.056,15 0.608,16 4}
{0 CHEMBL1904459,1 17,2 4,3 6,4 54.891,5 0.704,6 34.7,7 49,8 51,9 1,10 32,11 0.118,12 50.553,13 34.483,14 9.242,15 0.697,16 4}
{0 CHEMBL1969672,1 19,2 1,3 5,4 53.122,5 0.717,6 39.6,7 48,8 50,9 4,10 29,11 0.1,12 48.844,13 34.426,14 8.949,15 0.681,16 4}
{0 CHEMBL197765,1 47,2 11,3 21,4 105.002,5 0.605,6 51.6,7 91,8 91,9 15,10 44,11 0.231,12 91.661,13 55.04,14 6.79,15 0.575,16 5.276}
{0 CHEMBL197766,1 30,2 8,3 14,4 69.182,5 0.613,6 50,7 60,8 60,9 8,10 30,11 0.233,12 60.516,13 36.785,14 6.976,15 0.585,16 4.921}
{0 CHEMBL1979957,1 17,2 3,3 6,4 48.079,5 0.708,6 39.5,7 43,8 45,9 3,10 26,11 0.133,12 43.953,13 30.46,14 9.105,15 0.674,16 4}
{0 CHEMBL1984240,1 17,2 3,3 6,4 48.368,5 0.681,6 39.5,7 43,8 45,9 3,10 26,11 0.133,12 44.204,13 29.267,14 8.731,15 0.663,16 4}
{0 CHEMBL199352,1 53,2 11,3 24,4 115.248,5 0.603,6 53,7 100,8 100,9 18,10 47,11 0.24,12 100.312,13 60.325,14 6.599,15 0.569,16 4.292}
{0 CHEMBL199396,1 52,2 8,3 22,4 114.168,5 0.621,6 52,7 100,8 101,9 17,10 48,11 0.218,12 99.89,13 62.069,14 6.649,15 0.583,16 5.222}
{0 CHEMBL1994988,1 18,2 5,3 6,4 56.438,5 0.705,6 36,7 50,8 52,9 4,10 32,11 0.115,12 52.135,13 35.239,14 10,15 0.686,16 4}
{0 CHEMBL199510,1 42,2 10,3 19,4 93.464,5 0.606,6 51.9,7 81,8 81,9 13,10 39,11 0.235,12 81.465,13 49.057,14 6.75,15 0.574,16 5.824}
{0 CHEMBL199582,1 50,2 10,3 22,4 113.334,5 0.622,6 50.5,7 99,8 100,9 15,10 49,11 0.22,12 99.327,13 61.557,14 6.858,15 0.589,16 4.801}
{0 CHEMBL199726,1 55,2 11,3 24,4 118.663,5 0.603,6 53.4,7 103,8 103,9 19,10 48,11 0.233,12 103.196,13 62.086,14 6.543,15 0.567,16 4.324}
{0 CHEMBL199727,1 50,2 8,3 22,4 110.753,5 0.622,6 51.5,7 97,8 98,9 16,10 47,11 0.224,12 97.007,13 60.307,14 6.711,15 0.586,16 4.799}
{0 CHEMBL199736,1 51,2 11,3 23,4 115.832,5 0.619,6 50.5,7 101,8 102,9 15,10 50,11 0.225,12 101.428,13 62.563,14 6.871,15 0.588,16 5.167}
{0 CHEMBL1998429,1 12,2 3,3 5,4 42.46,5 0.722,6 31.6,7 38,8 40,9 1,10 26,11 0.125,12 39.589,13 27.449,14 11.006,15 0.718,16 4}
{0 CHEMBL199845,1 54,2 11,3 25,4 119.611,5 0.609,6 51.9,7 104,8 104,9 18,10 50,11 0.24,12 104.737,13 63.336,14 6.767,15 0.681,16 7.367}
{0 CHEMBL200095,1 49,2 9,3 22,4 111.836,5 0.628,6 50,7 98,8 99,9 16,10 49,11 0.222,12 98.225,13 61.552,14 6.897,15 0.595,16 4.73}
{0 CHEMBL2001761,1 16,2 2,3 2,4 37.531,5 0.627,6 48.5,7 33,8 34,9 5,10 17,11 0.059,12 33.371,13 20.705,14 7.161,15 0.602,16 4}
{0 CHEMBL200294,1 52,2 11,3 24,4 119.682,5 0.601,6 50.5,7 103,8 103,9 19,10 51,11 0.233,12 104.734,13 61.898,14 7.067,15 0.578,16 6.071}
{0 CHEMBL200972,1 48,2 8,3 21,4 107.337,5 0.623,6 51.1,7 94,8 95,9 15,10 46,11 0.221,12 94.123,13 58.546,14 6.775,15 0.588,16 4.481}
{0 CHEMBL201609,1 53,2 9,3 24,4 112.666,5 0.603,6 54.1,7 98,8 98,9 19,10 45,11 0.245,12 97.992,13 59.075,14 6.448,15 0.565,16 4.384}
{0 CHEMBL201775,1 53,2 11,3 24,4 115.248,5 0.603,6 53,7 100,8 100,9 18,10 47,11 0.24,12 100.312,13 60.325,14 6.599,15 0.569,16 5.027}
{0 CHEMBL210882,1 28,3 5,4 63.65,5 0.658,6 49.1,7 57,8 59,9 8,10 29,11 0.085,12 56.68,13 37.478,14 6.886,15 0.618,16 4.678}
{0 CHEMBL234338,1 10,3 1,4 35.542,5 0.687,6 31.3,7 32,8 34,10 22,11 0.029,12 33.709,13 21.989,14 9.445,15 0.707,16 4}
{0 CHEMBL256870,1 56,2 12,3 25,4 128.37,5 0.621,6 50,7 112,8 114,9 18,10 56,11 0.219,12 112.625,13 69.546,14 6.938,15 0.59,16 4.081}
{0 CHEMBL256877,1 53,2 11,3 24,4 115.248,5 0.603,6 53,7 100,8 100,9 18,10 47,11 0.24,12 100.312,13 60.325,14 6.599,15 0.569,16 5.237}
{0 CHEMBL271094,1 54,2 12,3 25,4 121.666,5 0.622,6 50.9,7 106,8 107,9 18,10 52,11 0.234,12 106.49,13 65.978,14 7.01,15 0.586,16 4.369}
{0 CHEMBL274959,1 53,2 11,3 24,4 119.248,5 0.619,6 51,7 104,8 105,9 16,10 51,11 0.229,12 104.312,13 64.325,14 6.808,15 0.585,16 5.553}
{0 CHEMBL285527,1 13,2 1,3 3,4 37.538,5 0.723,6 38.2,7 34,8 36,10 21,11 0.083,12 34.462,13 24.585,14 8.805,15 0.692,16 4}
{0 CHEMBL305978,1 10,2 2,3 2,4 33.076,5 0.732,6 33.3,7 30,8 33,10 20,11 0.061,12 30.393,13 21.966,14 8.743,15 0.719,16 4}
{0 CHEMBL369916,1 46,2 10,3 20,4 102.504,5 0.607,6 51.7,7 89,8 89,9 15,10 43,11 0.225,12 89.559,13 54.035,14 6.773,15 0.576,16 4.656}
{0 CHEMBL370138,1 53,2 11,3 24,4 115.248,5 0.603,6 53,7 100,8 100,9 18,10 47,11 0.24,12 100.312,13 60.325,14 6.599,15 0.569,16 4.544}
{0 CHEMBL377076,1 53,2 9,3 24,4 112.666,5 0.603,6 54.1,7 98,8 98,9 19,10 45,11 0.245,12 97.992,13 59.075,14 6.448,15 0.565,16 4.688}
{0 CHEMBL379110,1 30,3 6,4 67.066,5 0.654,6 50,7 60,8 62,9 9,10 30,11 0.097,12 59.563,13 39.239,14 6.776,15 0.613,16 4.602}
{0 CHEMBL381854,1 54,2 8,3 23,4 121.583,5 0.634,6 50.5,7 107,8 109,9 16,10 53,11 0.211,12 106.774,13 67.83,14 6.795,15 0.597,16 4.936}
{0 CHEMBL382143,1 55,2 11,3 24,4 118.663,5 0.603,6 53.4,7 103,8 103,9 19,10 48,11 0.233,12 103.196,13 62.086,14 6.543,15 0.567,16 4.36}
{0 CHEMBL382983,1 48,2 10,3 19,4 106.919,5 0.611,6 51.6,7 93,8 94,9 17,10 45,11 0.202,12 93.443,13 56.796,14 6.762,15 0.578,16 4.212}
{0 CHEMBL394197,1 17,2 4,3 5,4 52.891,5 0.691,6 36.2,7 47,8 50,9 3,10 30,11 0.1,12 48.553,13 32.483,14 9.125,15 0.685,16 4}
{0 CHEMBL433993,1 51,2 9,3 22,4 115.251,5 0.627,6 50.5,7 101,8 103,9 16,10 50,11 0.214,12 101.108,13 63.313,14 6.831,15 0.592,16 5.125}
{0 CHEMBL435122,1 50,2 8,3 22,4 110.753,5 0.622,6 51.5,7 97,8 98,9 16,10 47,11 0.224,12 97.007,13 60.307,14 6.711,15 0.586,16 4.39}
{0 CHEMBL44664,1 10,3 3,4 26.704,5 0.674,6 41.7,7 24,8 24,9 1,10 14,11 0.125,12 24.4,13 16.17,14 7.925,15 0.657,16 4}
{0 CHEMBL479979,1 21,2 3,3 6,4 45.441,5 0.633,6 52.5,7 40,8 41,9 6,10 19,11 0.146,12 39.585,13 25.324,14 6.485,15 0.588,16 4}
{0 CHEMBL581225,1 22,2 2,3 8,4 58.405,5 0.661,6 42.3,7 52,8 55,9 8,10 30,11 0.145,12 53.003,13 34.352,14 7.893,15 0.646,16 4}
{0 CHEMBL63883,1 15,2 1,3 3,4 41.033,5 0.695,6 40.5,7 37,8 39,9 1,10 22,11 0.077,12 37.269,13 25.699,14 7.928,15 0.672,16 4}
