"molecule_id","CATS2D_03_DL","Chi1_EA.dm.","Eig02_AEA.dm.","Eig12_AEA.dm.","GATS4e","X1v","X3v","AMR","Chi0_EA.ri.","Chi1_EA.ri.","Eig10_AEA.dm.","Eig12_EA.ri.","Eig15_AEA.dm.","Eig15_EA.ri.","Eta_alpha","GATS4s","S1K","SpMax5_Bh.m.","X0v","ATS4p","MATS2s","MATS4e","PHI","Chi1_EA.bo.","Chi1_EA.ed.","Eig03_AEA.dm.","Eig06_AEA.dm.","Eig11_AEA.bo.","Eig11_AEA.ri.","Eig12_AEA.ri.","Eig12_EA.bo.","GATS5v","MPC10","PDI","piPC10","P_VSA_LogP_5","P_VSA_m_2","SpAD_AEA.dm.","SpAD_AEA.ri.","SpMax2_Bh.p.","SpMax2_Bh.v.","MATS6e","ATS6p","S3K","ZM2MulPer","ZM2Per","GATS7v","GATS8m","GATS8v","Hy","IC3","MATS5e","MATS7p","MATS7v","MATS8e","MATS8p","P_VSA_e_5","S2K","SAdon","TPSA.Tot.","ATS3v","ATS7p","ATSC8p","GATS8e","GATS8s","Psi_i_1","X1Kup","XMOD","ZM1Per","ZM2V","AAC","AECC","ALOGP","ALOGP2","AMW","ARR","ATS1e","ATS1i","ATS1m","ATS1p","ATS1s","ATS1v","ATS2e","ATS2i","ATS2m","ATS2p","ATS2s","ATS2v","ATS3e","ATS3i","ATS3m","ATS3p","ATS3s","ATS4e","ATS4i","ATS4m","ATS4s","ATS4v","ATS5e","ATS5i","ATS5m","ATS5p","ATS5s","ATS5v","ATS6e","ATS6i","ATS6m","ATS6s","ATS6v","pXC50"
{1 2,2 20.048,3 2.945,4 -0.676,5 0.83,6 5.87,7 2.78,8 70.689,9 12.776,10 11,11 0.129,12 -0.751,13 -1.22,14 -1.194,15 8.929,16 0.907,17 11.564,18 2.973,19 10.496,20 3.219,21 0.191,22 0.119,23 2.974,24 7.024,25 3.456,26 2.699,27 1.192,28 0.776,29 0.224,31 -1.221,32 0.921,33 4.007,34 1.039,35 7.15,36 43.198,37 146.764,38 30.501,39 30.184,40 3.792,41 3.797,42 -0.269,43 3.06,44 2.378,45 350.482,46 513.9,47 1.305,48 1.576,49 1.185,50 0.538,51 4.324,52 -0.132,53 -0.229,54 -0.329,55 -0.16,56 0.086,58 4.629,59 34.796,60 66.49,61 3.337,62 2.933,63 2.247,64 1.401,65 1.55,66 9.716,67 5.093,68 60.806,69 494.24,70 329,71 1.791,72 7.389,73 3.235,74 10.467,75 11.205,76 0.8,77 3.402,78 3.508,79 3.303,80 3.001,81 4.655,82 3.019,83 3.842,84 3.968,85 3.732,86 3.355,87 5.183,88 3.359,89 3.978,90 4.149,91 3.657,92 3.377,93 5.2,94 3.875,95 4.058,96 3.557,97 5.092,98 3.176,99 3.754,100 3.943,101 3.424,102 3.13,103 4.975,104 3.076,105 3.583,106 3.74,107 3.281,108 4.812,109 3.006,110 4.301}
{0 CHEMBL454726,1 1,2 21.314,3 2.976,4 -0.566,5 0.681,6 5.87,7 2.743,8 70.689,9 12.776,10 11.008,11 0.192,12 -0.629,13 -1.203,14 -1.178,15 8.929,16 0.729,17 11.564,18 3.043,19 10.496,20 3.227,21 0.194,22 0.274,23 2.974,24 7.03,25 3.471,26 2.688,27 1.268,28 0.856,29 0.321,30 0.154,31 -0.951,32 1.037,33 4.06,34 1.039,35 7.181,36 43.198,37 146.764,38 30.116,39 30.061,40 3.792,41 3.797,42 -0.062,43 3.069,44 2.378,45 350.619,46 514.19,47 1.225,48 1.222,49 1.128,50 0.538,51 4.644,52 -0.413,53 -0.157,54 -0.265,55 0.369,56 0.126,58 4.629,59 34.796,60 66.49,61 3.337,62 2.978,63 2.277,64 0.98,65 1.007,66 9.716,67 5.093,68 60.806,69 494.26,70 329,71 1.791,72 6.722,73 3.235,74 10.467,75 11.205,76 0.8,77 3.402,78 3.508,79 3.303,80 3.001,81 4.655,82 3.019,83 3.842,84 3.968,85 3.732,86 3.355,87 5.184,88 3.359,89 3.978,90 4.149,91 3.657,92 3.377,93 5.19,94 3.876,95 4.058,96 3.642,97 5.125,98 3.193,99 3.767,100 3.94,101 3.424,102 3.171,103 4.995,104 3.105,105 3.585,106 3.74,107 3.391,108 4.857,109 3.026,110 5.125}
{0 CHEMBL483378,1 1,2 25.805,3 2.91,4 -0.384,5 0.621,6 5.538,7 2.584,8 67.712,9 13.605,10 11.189,11 0.203,12 -0.617,13 -1.14,14 -1.167,15 8.619,16 0.712,17 11.871,18 2.946,19 10.015,20 3.281,21 0.144,22 0.235,23 3.012,24 7.452,25 3.616,26 2.664,27 1.316,28 0.918,29 0.431,30 0.236,31 -0.877,32 0.926,33 4.174,34 1.018,35 7.24,36 70.901,37 165.01,38 31.509,39 30.963,40 3.778,41 3.79,42 -0.057,43 3.096,44 2.35,45 354.646,46 518.42,47 1.005,48 1.131,49 1.085,50 0.497,51 4.694,52 -0.161,53 -0.076,54 -0.013,55 0.247,56 -0.086,57 11,58 4.822,59 34.796,60 75.72,61 3.37,62 2.928,63 2.175,64 1.037,65 1.165,66 10.018,67 5.39,68 59.664,69 483.26,70 331,71 1.829,72 7.421,73 2.268,74 5.142,75 8.94,76 0.762,77 3.539,78 3.655,79 3.25,80 2.996,81 4.817,82 3.052,83 4,84 4.155,85 3.603,86 3.327,87 5.376,88 3.371,89 4.075,90 4.249,91 3.548,92 3.347,93 5.309,94 4.071,95 4.265,96 3.485,97 5.366,98 3.28,99 4.068,100 4.296,101 3.297,102 3.199,103 5.333,104 3.19,105 3.879,106 4.087,107 3.222,108 5.13,109 3.094,110 4.721}
{0 CHEMBL484373,1 2,2 22.275,3 2.822,4 -0.57,5 0.651,6 5.527,7 2.53,8 67.578,9 12.68,10 10.818,11 0.008,12 -0.641,13 -1.243,14 -1.311,15 8.548,16 0.731,17 11.258,18 2.81,19 9.809,20 3.206,21 0.125,22 0.269,23 2.777,24 7.03,25 3.471,26 2.659,27 1.243,28 0.856,29 0.359,30 0.157,31 -0.951,32 0.955,33 4.06,34 1.001,35 7.181,36 39.697,37 143.264,38 29.983,39 29.933,40 3.777,41 3.787,42 0.012,43 3.041,44 2.26,45 342.282,46 501.01,47 1.272,48 1.292,49 1.24,50 1.306,51 4.7,52 -0.371,53 -0.267,54 -0.344,55 0.369,56 -0.19,57 42.683,58 4.439,59 77.48,60 86.72,61 3.322,62 2.902,63 2.182,64 0.986,65 1.122,66 9.65,67 5.083,68 58.208,69 466.58,70 321,71 1.867,72 6.722,73 2.304,74 5.306,75 10.065,76 0.8,77 3.445,78 3.552,79 3.246,80 2.97,81 4.738,82 3.01,83 3.865,84 3.993,85 3.654,86 3.312,87 5.234,88 3.342,89 4.017,90 4.19,91 3.567,92 3.328,93 5.269,94 3.953,95 4.149,96 3.546,97 5.216,98 3.189,99 3.836,100 4.023,101 3.367,102 3.145,103 5.076,104 3.103,105 3.661,106 3.836,107 3.269,108 4.95,109 3.013,110 5.426}
{0 CHEMBL484374,1 4,2 20.57,3 2.788,4 -0.737,5 0.797,6 5.527,7 2.551,8 67.578,9 12.68,10 10.805,11 0.096,12 -0.857,13 -1.251,14 -1.296,15 8.548,16 0.895,17 11.258,18 2.76,19 9.809,20 3.205,21 0.123,22 0.116,23 2.777,24 7.024,25 3.456,26 2.656,27 1.191,28 0.776,29 0.241,31 -1.221,32 0.906,33 4.007,34 1.001,35 7.15,36 39.697,37 143.264,38 30.159,39 30.08,40 3.777,41 3.787,42 -0.285,43 3.019,44 2.26,45 342.146,46 500.74,47 1.302,48 1.601,49 1.249,50 1.306,51 4.393,52 -0.051,53 -0.244,54 -0.315,55 -0.15,56 -0.157,57 42.683,58 4.439,59 77.48,60 86.72,61 3.322,62 2.893,63 2.113,64 1.394,65 1.493,66 9.65,67 5.083,68 58.208,69 466.56,70 321,71 1.867,72 7.389,73 2.304,74 5.306,75 10.065,76 0.8,77 3.445,78 3.552,79 3.246,80 2.97,81 4.738,82 3.01,83 3.865,84 3.993,85 3.654,86 3.312,87 5.233,88 3.342,89 4.017,90 4.19,91 3.567,92 3.328,93 5.281,94 3.951,95 4.149,96 3.507,97 5.169,98 3.179,99 3.817,100 4.021,101 3.364,102 3.138,103 5.031,104 3.082,105 3.616,106 3.779,107 3.216,108 4.871,109 2.992,110 5.337}
{0 CHEMBL484383,1 1,2 25.763,3 2.912,4 -0.384,5 0.63,6 5.916,7 2.753,8 72.347,9 13.689,10 11.356,11 0.214,12 -0.595,13 -1.138,14 -1.117,15 9.048,16 0.699,17 12.203,18 3.002,19 10.771,20 3.356,21 0.157,22 0.252,23 3.232,24 7.452,25 3.616,26 2.682,27 1.316,28 0.918,29 0.393,30 0.192,31 -0.877,32 0.957,33 4.174,34 1.013,35 7.24,36 55.94,37 159.39,38 31.545,39 31.066,40 3.78,41 3.791,42 -0.03,43 3.191,44 2.477,45 354.646,46 518.42,47 1.044,48 1.186,49 1.107,50 0.497,51 4.694,52 -0.192,53 -0.062,54 -0.028,55 0.262,56 -0.131,57 11,58 5.032,59 34.796,60 75.72,61 3.4,62 3.055,63 2.468,64 1.02,65 1.057,66 10.126,67 5.445,68 61.974,69 483.26,70 331,71 1.829,72 7.421,73 2.555,74 6.525,75 9.508,76 0.762,77 3.533,78 3.644,79 3.301,80 3.041,81 4.763,82 3.073,83 3.992,84 4.139,85 3.686,86 3.368,87 5.261,88 3.394,89 4.068,90 4.238,91 3.624,92 3.41,93 5.242,94 4.06,95 4.244,96 3.616,97 5.237,98 3.321,99 4.052,100 4.264,101 3.453,102 3.319,103 5.156,104 3.249,105 3.868,106 4.066,107 3.33,108 5.008,109 3.139,110 5.155}
{0 CHEMBL484385,1 1,2 23.856,3 2.889,4 -0.568,5 0.761,6 5.418,7 2.55,8 66.88,9 13.086,10 10.537,11 0.064,12 -0.738,13 -1.292,14 -1.434,15 8.333,16 0.811,17 10.989,18 2.907,19 9.714,20 3.286,21 -0.039,22 0.133,23 2.824,24 7.034,25 3.498,26 2.451,27 1.312,28 0.809,29 0.335,30 0.15,31 -1.025,32 0.94,33 4.06,34 1.018,35 7.159,36 64.559,37 165.366,38 29.64,39 29.182,40 3.778,41 3.79,42 0.045,43 3.103,44 2.158,45 313.619,46 454.66,47 1.009,48 1.173,49 1.092,50 0.483,51 4.694,52 -0.2,53 -0.075,54 -0.005,55 0.108,56 -0.09,57 11,58 4.625,59 34.796,60 75.72,61 3.344,62 2.937,63 2.133,64 1.178,65 1.184,66 9.666,67 5.293,68 56.527,69 409.71,70 293,71 1.662,72 7.333,73 1.699,74 2.887,75 8.32,76 0.8,77 3.524,78 3.646,79 3.19,80 2.999,81 4.738,82 3.034,83 3.978,84 4.141,85 3.502,86 3.33,87 5.166,88 3.351,89 4.057,90 4.239,91 3.458,92 3.351,93 5.198,94 4.041,95 4.247,96 3.319,97 5.137,98 3.243,99 4.023,100 4.269,101 3.093,102 3.207,103 4.998,104 3.137,105 3.848,106 4.069,107 3.089,108 4.912,109 3.054,110 4.509}
{0 CHEMBL485562,1 4,2 18.185,3 2.963,4 -0.658,5 1.058,6 5.533,7 2.578,8 67.578,9 12.722,10 10.787,11 0.096,12 -0.734,13 -1.234,14 -1.324,15 8.548,16 1.23,17 11.258,18 2.822,19 9.809,20 3.213,21 0.083,22 -0.011,23 2.777,24 7.003,25 3.451,26 2.662,27 1.46,28 0.793,29 0.28,30 0.141,31 -1.072,32 0.896,33 3.97,34 1.001,35 7.123,36 39.697,37 143.264,38 30.193,39 30.077,40 3.777,41 3.787,42 -0.071,43 3.049,44 2.133,45 342.945,46 503.87,47 1.264,48 2.176,49 1.589,50 1.306,51 4.624,52 -0.124,53 -0.289,54 -0.353,55 -0.544,56 -0.246,57 42.683,58 4.439,59 77.48,60 86.72,61 3.33,62 2.926,63 2.321,64 1.695,65 1.637,66 9.655,67 5.089,68 58.309,69 467.14,70 322,71 1.867,72 6.667,73 2.304,74 5.306,75 10.065,76 0.8,77 3.445,78 3.552,79 3.246,80 2.97,81 4.739,82 3.01,83 3.865,84 3.993,85 3.654,86 3.312,87 5.222,88 3.342,89 4.018,90 4.19,91 3.604,92 3.328,93 5.312,94 3.97,95 4.151,96 3.549,97 5.253,98 3.208,99 3.872,100 4.068,101 3.412,102 3.164,103 5.14,104 3.122,105 3.676,106 3.838,107 3.319,108 5.009,109 3.041,110 4.301}
{0 CHEMBL505661,1 2,2 18.33,3 2.594,4 -1.141,5 0.986,6 5.022,7 2.21,8 59.493,9 10.53,10 8.351,11 -0.672,12 -1.365,13 -1.795,14 -1.816,15 7.267,16 1.036,17 10.051,18 2.687,19 8.492,20 2.866,21 0.104,22 0.045,23 3.246,24 5.778,25 3.148,26 2.497,27 1,28 0.459,30 -0.444,31 -1.823,32 0.826,33 2.833,34 0.978,35 5.211,36 12.734,37 131.929,38 23.331,39 22.678,40 3.689,41 3.629,42 -0.282,43 2.694,44 2.992,45 272.497,46 382.73,47 1.21,48 1.576,49 1.205,50 0.626,51 4.056,52 0.041,53 -0.123,54 -0.144,55 -0.184,56 -0.176,57 25.145,58 4.844,59 36.022,60 95.15,61 2.981,62 2.668,63 2.037,64 0.849,65 0.397,66 7.636,67 4.24,68 50.995,69 369.22,70 254,71 1.892,72 7.2,73 1.192,74 1.422,75 9.577,76 0.688,77 3.282,78 3.394,79 3.136,80 2.857,81 4.563,82 2.842,83 3.668,84 3.795,85 3.425,86 3.151,87 4.983,88 3.107,89 3.805,90 4.005,91 3.096,92 3.063,93 4.974,94 3.699,95 3.913,96 3.141,97 4.948,98 2.831,99 3.56,100 3.742,101 2.995,102 2.716,103 5.079,104 2.701,105 3.333,106 3.531,107 2.792,108 4.518,109 2.595,110 6}
{0 CHEMBL520191,1 1,2 21.356,3 2.959,4 -0.566,5 0.73,6 5.492,7 2.508,8 66.1,9 12.702,10 10.861,11 0.182,12 -0.638,13 -1.205,14 -1.274,15 8.5,16 0.81,17 11.233,18 2.814,19 9.74,20 3.151,21 0.069,22 0.184,23 2.761,24 7.03,25 3.471,26 2.686,27 1.266,28 0.856,29 0.353,30 0.156,31 -0.951,32 0.964,33 4.06,34 1.046,35 7.181,36 48.818,37 152.385,38 30.089,39 29.961,40 3.778,41 3.789,42 -0.005,43 2.997,44 2.25,45 350.619,46 514.19,47 1.301,48 1.281,49 1.203,50 0.538,51 4.644,52 -0.364,53 -0.279,54 -0.351,55 0.472,56 -0.155,58 4.424,59 34.796,60 66.49,61 3.296,62 2.847,63 2.124,64 1.113,65 1.393,66 9.608,67 5.038,68 58.497,69 494.26,70 329,71 1.871,72 6.722,73 2.776,74 7.708,75 10.547,76 0.8,77 3.408,78 3.519,79 3.251,80 2.954,81 4.715,82 2.997,83 3.85,84 3.983,85 3.664,86 3.288,87 5.267,88 3.328,89 3.991,90 4.176,91 3.577,92 3.286,93 5.306,94 3.888,95 4.082,96 3.557,97 5.244,98 3.155,99 3.779,100 3.966,101 3.37,102 3.101,103 5.087,104 3.074,105 3.596,106 3.761,107 3.286,108 4.989,109 2.987,110 4.606}
{0 CHEMBL525239,1 3,2 15.018,3 2.839,4 -1,5 1.07,6 4.954,7 2.187,8 63.018,9 11.332,10 8.875,11 -0.535,12 -1.257,13 -1.634,14 -1.705,15 7.333,16 1.2,17 10.893,18 2.724,19 8.935,20 3.172,21 -0.074,22 -0.043,23 3.366,24 6.129,25 3.062,26 2.268,27 1.029,28 0.5,29 -0.083,30 -0.346,31 -1.5,32 0.845,33 3.178,34 0.933,35 5.966,36 30.734,37 132.17,38 24.775,39 24.244,40 3.618,41 3.613,42 -0.066,43 2.862,44 2.51,45 245.645,46 355.82,47 0.959,48 1.218,49 1.367,50 1.372,51 4.556,52 -0.132,53 0.023,54 0.012,55 -0.026,56 -0.466,57 42.683,58 4.944,59 77.48,60 86.72,61 3.202,62 2.746,63 1.97,64 1.086,65 1.14,66 8.348,67 4.846,68 49.831,69 335.02,70 229,71 1.653,72 7.438,73 0.349,74 0.122,75 7.561,76 0.588,77 3.49,78 3.632,79 3.051,80 2.899,81 4.671,82 2.919,83 3.961,84 4.165,85 3.331,86 3.228,87 5.102,88 3.216,89 4.049,90 4.269,91 3.285,92 3.251,93 5.148,94 4.118,95 4.373,96 3.112,97 5.147,98 3.094,99 4.053,100 4.355,101 2.775,102 3.025,103 4.975,104 2.902,105 3.758,106 4.034,107 2.705,108 4.691,109 2.765,110 5.959}
