{
  "data_features": {
    "feature": [
      {
        "data_type": "nominal",
        "index": "0",
        "is_ignore": "false",
        "is_row_identifier": "true",
        "is_target": "false",
        "name": "molecule_id",
        "nominal_value": [
          "CHEMBL128332",
          "CHEMBL128389",
          "CHEMBL128397",
          "CHEMBL128536",
          "CHEMBL128644",
          "CHEMBL129194",
          "CHEMBL129872",
          "CHEMBL130275",
          "CHEMBL130455",
          "CHEMBL130540",
          "CHEMBL130858",
          "CHEMBL131050",
          "CHEMBL132115",
          "CHEMBL132269",
          "CHEMBL132509",
          "CHEMBL141447",
          "CHEMBL142380",
          "CHEMBL142860",
          "CHEMBL159096",
          "CHEMBL1668010",
          "CHEMBL1668124",
          "CHEMBL191",
          "CHEMBL21968",
          "CHEMBL22387",
          "CHEMBL22391",
          "CHEMBL22426",
          "CHEMBL22692",
          "CHEMBL22837",
          "CHEMBL22879",
          "CHEMBL22908",
          "CHEMBL22945",
          "CHEMBL23006",
          "CHEMBL25220",
          "CHEMBL274447",
          "CHEMBL280189",
          "CHEMBL281192",
          "CHEMBL281999",
          "CHEMBL283110",
          "CHEMBL283372",
          "CHEMBL283579",
          "CHEMBL283742",
          "CHEMBL283770",
          "CHEMBL284536",
          "CHEMBL285560",
          "CHEMBL314859",
          "CHEMBL314982",
          "CHEMBL334431",
          "CHEMBL336056",
          "CHEMBL336167",
          "CHEMBL337017",
          "CHEMBL337380",
          "CHEMBL337446",
          "CHEMBL337955",
          "CHEMBL338048",
          "CHEMBL338900",
          "CHEMBL339592",
          "CHEMBL339846",
          "CHEMBL341210",
          "CHEMBL341223",
          "CHEMBL418226",
          "CHEMBL423370",
          "CHEMBL428711",
          "CHEMBL432459",
          "CHEMBL434615",
          "CHEMBL434768",
          "CHEMBL84792",
          "CHEMBL86495",
          "CHEMBL86604",
          "CHEMBL86858",
          "CHEMBL87034",
          "CHEMBL87603",
          "CHEMBL89143",
          "CHEMBL89614",
          "CHEMBL89846",
          "CHEMBL995"
        ],
        "number_of_missing_values": "0"
      },
      {
        "data_type": "numeric",
        "index": "1",
        "is_ignore": "false",
        "is_row_identifier": "false",
        "is_target": "false",
        "name": "nH",
        "number_of_missing_values": "0"
      },
      {
        "data_type": "numeric",
        "index": "2",
        "is_ignore": "false",
        "is_row_identifier": "false",
        "is_target": "false",
        "name": "Mi",
        "number_of_missing_values": "0"
      },
      {
        "data_type": "numeric",
        "index": "3",
        "is_ignore": "false",
        "is_row_identifier": "false",
        "is_target": "false",
        "name": "MW",
        "number_of_missing_values": "0"
      },
      {
        "data_type": "numeric",
        "index": "4",
        "is_ignore": "false",
        "is_row_identifier": "false",
        "is_target": "false",
        "name": "AMW",
        "number_of_missing_values": "0"
      },
      {
        "data_type": "numeric",
        "index": "5",
        "is_ignore": "false",
        "is_row_identifier": "false",
        "is_target": "false",
        "name": "C.",
        "number_of_missing_values": "0"
      },
      {
        "data_type": "numeric",
        "index": "6",
        "is_ignore": "false",
        "is_row_identifier": "false",
        "is_target": "false",
        "name": "H.",
        "number_of_missing_values": "0"
      },
      {
        "data_type": "numeric",
        "index": "7",
        "is_ignore": "false",
        "is_row_identifier": "false",
        "is_target": "false",
        "name": "Me",
        "number_of_missing_values": "0"
      },
      {
        "data_type": "numeric",
        "index": "8",
        "is_ignore": "false",
        "is_row_identifier": "false",
        "is_target": "false",
        "name": "Mp",
        "number_of_missing_values": "0"
      },
      {
        "data_type": "numeric",
        "index": "9",
        "is_ignore": "false",
        "is_row_identifier": "false",
        "is_target": "false",
        "name": "Mv",
        "number_of_missing_values": "0"
      },
      {
        "data_type": "numeric",
        "index": "10",
        "is_ignore": "false",
        "is_row_identifier": "false",
        "is_target": "true",
        "name": "pXC50",
        "number_of_missing_values": "0"
      }
    ]
  }
}