{
  "data_set_description": {
    "collection_date": "November 2013",
    "creator": "Dr Jeremy Besnard, Dr Ivan Olier, Dr Noureddin Sadawi, Dr Larisa Soldatova, Dr Crina Grosan, Prof Ross King, Dr Richard Bickerton, Prof Andrew Hopkins and Dr Willem van Hoorn",
    "default_target_attribute": "pXC50",
    "description": "This dataset contains QSAR data (from ChEMBL version 17) showing activity values (unit is pseudo-pCI50) of several compounds on drug target ChEMBL_ID: CHEMBL402 (TID: 24), and it has 234 rows and 1298 features (not including molecule IDs and class feature: molecule_id and pXC50). The features represent Molecular Descriptors which were generated from SMILES strings. Missing value imputation was applied to this dataset (By choosing the Median).",
    "description_version": "1",
    "file_id": "3545951",
    "format": "ARFF",
    "id": "35029",
    "licence": "Public",
    "md5_checksum": "5032678a730288f7c29264091e6567ee",
    "minio_url": "https://data.openml.org/datasets/0003/35029/dataset_35029.pq",
    "name": "QSAR-DATASET-FOR-DRUG-TARGET-CHEMBL402",
    "original_data_url": "https://www.ebi.ac.uk/chembl/target/inspect/CHEMBL402",
    "parquet_url": "https://data.openml.org/datasets/0003/35029/dataset_35029.pq",
    "processing_date": "2018-10-04 04:12:56",
    "row_id_attribute": "molecule_id",
    "status": "deactivated",
    "tag": [
      "MetaQSAR",
      "study_13"
    ],
    "upload_date": "2016-07-15T16:56:28",
    "url": "https://api.openml.org/data/v1/download/3545951/QSAR-DATASET-FOR-DRUG-TARGET-CHEMBL402.arff",
    "version": "7",
    "visibility": "public"
  }
}