{
  "data_set_description": {
    "collection_date": "November 2013",
    "creator": "Dr Jeremy Besnard, Dr Ivan Olier, Dr Noureddin Sadawi, Dr Larisa Soldatova, Dr Crina Grosan, Prof Ross King, Dr Richard Bickerton, Prof Andrew Hopkins and Dr Willem van Hoorn",
    "default_target_attribute": "pXC50",
    "description": "This dataset contains QSAR data (from ChEMBL version 17) showing activity values (unit is pseudo-pCI50) of several compounds on drug target ChEMBL_ID: CHEMBL5135 (TID: 10011), and it has 47 rows and 1176 features (not including molecule IDs and class feature: molecule_id and pXC50). The features represent Molecular Descriptors which were generated from SMILES strings. Missing value imputation was applied to this dataset (By choosing the Median).",
    "description_version": "1",
    "file_id": "3543400",
    "format": "ARFF",
    "id": "34952",
    "licence": "Public",
    "md5_checksum": "b3c43cb56ce860f30dea95f31e2b73b2",
    "minio_url": "https://data.openml.org/datasets/0003/34952/dataset_34952.pq",
    "name": "QSAR-DATASET-FOR-DRUG-TARGET-CHEMBL5135",
    "original_data_url": "https://www.ebi.ac.uk/chembl/target/inspect/CHEMBL5135",
    "parquet_url": "https://data.openml.org/datasets/0003/34952/dataset_34952.pq",
    "processing_date": "2018-10-04 04:08:30",
    "row_id_attribute": "molecule_id",
    "status": "deactivated",
    "tag": [
      "MetaQSAR",
      "study_13"
    ],
    "upload_date": "2016-07-15T16:43:37",
    "url": "https://api.openml.org/data/v1/download/3543400/QSAR-DATASET-FOR-DRUG-TARGET-CHEMBL5135.arff",
    "version": "11",
    "visibility": "public"
  }
}