{
  "data_set_description": {
    "collection_date": "November 2013",
    "creator": "Dr Jeremy Besnard, Dr Ivan Olier, Dr Noureddin Sadawi, Dr Larisa Soldatova, Dr Crina Grosan, Prof Ross King, Dr Richard Bickerton, Prof Andrew Hopkins and Dr Willem van Hoorn",
    "default_target_attribute": "pXC50",
    "description": "This dataset contains QSAR data (from ChEMBL version 17) showing activity values (unit is pseudo-pCI50) of several compounds on drug target ChEMBL_ID: CHEMBL5426 (TID: 101182), and it has 80 rows and 1300 features (not including molecule IDs and class feature: molecule_id and pXC50). The features represent Molecular Descriptors which were generated from SMILES strings. Missing value imputation was applied to this dataset (By choosing the Median).",
    "description_version": "1",
    "file_id": "3543357",
    "format": "ARFF",
    "id": "34941",
    "licence": "Public",
    "md5_checksum": "d5326eb5f5c59c1535614da2ab11b9a1",
    "minio_url": "https://data.openml.org/datasets/0003/34941/dataset_34941.pq",
    "name": "QSAR-DATASET-FOR-DRUG-TARGET-CHEMBL5426",
    "original_data_url": "https://www.ebi.ac.uk/chembl/target/inspect/CHEMBL5426",
    "parquet_url": "https://data.openml.org/datasets/0003/34941/dataset_34941.pq",
    "processing_date": "2018-10-04 04:13:54",
    "row_id_attribute": "molecule_id",
    "status": "deactivated",
    "tag": [
      "MetaQSAR",
      "study_13"
    ],
    "upload_date": "2016-07-15T16:42:05",
    "url": "https://api.openml.org/data/v1/download/3543357/QSAR-DATASET-FOR-DRUG-TARGET-CHEMBL5426.arff",
    "version": "12",
    "visibility": "public"
  }
}