"molecule_id","FCFP4_1024b246","FCFP4_1024b134","FCFP4_1024b461","FCFP4_1024b264","FCFP4_1024b915","FCFP4_1024b54","FCFP4_1024b873","FCFP4_1024b128","FCFP4_1024b429","FCFP4_1024b846","FCFP4_1024b653","FCFP4_1024b169","FCFP4_1024b781","FCFP4_1024b284","FCFP4_1024b529","FCFP4_1024b458","FCFP4_1024b300","FCFP4_1024b107","FCFP4_1024b152","FCFP4_1024b600","FCFP4_1024b629","FCFP4_1024b611","FCFP4_1024b424","FCFP4_1024b407","FCFP4_1024b650","FCFP4_1024b737","FCFP4_1024b1","FCFP4_1024b10","FCFP4_1024b100","FCFP4_1024b1000","FCFP4_1024b1001","FCFP4_1024b1002","FCFP4_1024b1003","FCFP4_1024b1004","FCFP4_1024b1005","FCFP4_1024b1006","FCFP4_1024b1007","FCFP4_1024b1008","FCFP4_1024b1009","FCFP4_1024b101","FCFP4_1024b1010","FCFP4_1024b1011","FCFP4_1024b1012","FCFP4_1024b1013","FCFP4_1024b1014","FCFP4_1024b1015","FCFP4_1024b1016","FCFP4_1024b1017","FCFP4_1024b1018","FCFP4_1024b1019","FCFP4_1024b102","pXC50"
{8 1,9 1,27 1,52 5.509}
{0 CHEMBL100779,8 1,9 1,18 1,27 1,37 1,52 5.959}
{0 CHEMBL101172,8 1,9 1,27 1,52 5.602}
{0 CHEMBL101504,7 1,8 1,9 1,27 1,52 5.854}
{0 CHEMBL101505,7 1,8 1,9 1,27 1,52 5.62}
{0 CHEMBL111925,3 1,20 1,25 1,27 1,50 1,52 5.523}
{0 CHEMBL112366,3 1,6 1,20 1,25 1,27 1,52 6.184}
{0 CHEMBL117108,3 1,18 1,27 1,52 5.119}
{0 CHEMBL118462,3 1,18 1,27 1,42 1,52 5.125}
{0 CHEMBL118944,3 1,18 1,27 1,33 1,52 5.509}
{0 CHEMBL119841,3 1,18 1,27 1,52 5.046}
{0 CHEMBL125123,3 1,25 1,27 1,50 1,52 5.963}
{0 CHEMBL125828,3 1,25 1,27 1,52 5.523}
{0 CHEMBL126581,3 1,8 1,9 1,25 1,27 1,52 5.523}
{0 CHEMBL128461,3 1,9 1,15 1,27 1,52 5.921}
{0 CHEMBL132107,3 1,9 1,15 1,18 1,27 1,52 6.398}
{0 CHEMBL142238,8 1,9 1,27 1,52 6.796}
{0 CHEMBL142782,3 1,9 1,27 1,52 6.036}
{0 CHEMBL142969,3 1,9 1,27 1,52 5}
{0 CHEMBL144047,8 1,9 1,27 1,52 5.678}
{0 CHEMBL144341,9 1,27 1,52 7.066}
{0 CHEMBL144374,9 1,15 1,27 1,52 5.886}
{0 CHEMBL144400,8 1,9 1,27 1,52 5.77}
{0 CHEMBL144545,9 1,27 1,52 6.62}
{0 CHEMBL144570,3 1,6 1,20 1,25 1,27 1,52 6}
{0 CHEMBL144656,9 1,27 1,52 7.796}
{0 CHEMBL144940,9 1,27 1,52 6.092}
{0 CHEMBL145159,8 1,9 1,18 1,27 1,52 5.292}
{0 CHEMBL146865,6 1,9 1,15 1,16 1,17 1,18 1,24 1,27 1,52 6.207}
{0 CHEMBL148584,6 1,9 1,13 1,15 1,16 1,17 1,18 1,24 1,27 1,52 6.821}
{0 CHEMBL149081,6 1,9 1,13 1,15 1,16 1,17 1,18 1,24 1,27 1,52 6.553}
{0 CHEMBL149193,6 1,9 1,13 1,15 1,16 1,17 1,18 1,27 1,44 1,52 6.456}
{0 CHEMBL149500,6 1,9 1,13 1,15 1,16 1,17 1,18 1,27 1,28 1,50 1,52 6.237}
{0 CHEMBL149559,6 1,9 1,13 1,15 1,16 1,17 1,18 1,24 1,27 1,52 7.553}
{0 CHEMBL149612,6 1,9 1,13 1,15 1,16 1,17 1,18 1,27 1,52 6.553}
{0 CHEMBL149777,6 1,9 1,13 1,15 1,16 1,17 1,18 1,24 1,27 1,52 6.53}
{0 CHEMBL151634,3 1,6 1,9 1,13 1,15 1,16 1,17 1,18 1,24 1,27 1,52 6.569}
{0 CHEMBL154936,1 1,3 1,9 1,27 1,52 5}
{0 CHEMBL155536,1 1,3 1,27 1,32 1,52 5}
{0 CHEMBL156010,1 1,3 1,9 1,27 1,32 1,52 5}
{0 CHEMBL156054,1 1,3 1,9 1,27 1,42 1,52 5}
{0 CHEMBL156140,1 1,3 1,27 1,52 7.398}
{0 CHEMBL156232,1 1,3 1,9 1,25 1,27 1,52 5.323}
{0 CHEMBL156328,1 1,3 1,17 1,27 1,41 1,52 5}
{0 CHEMBL156742,1 1,3 1,27 1,50 1,52 5}
{0 CHEMBL156928,1 1,3 1,27 1,32 1,52 5.24}
{0 CHEMBL156985,1 1,3 1,27 1,32 1,52 5}
{0 CHEMBL157181,3 1,20 1,27 1,52 5}
{0 CHEMBL157204,1 1,3 1,9 1,27 1,52 5.288}
{0 CHEMBL157308,1 1,3 1,27 1,32 1,52 5}
{0 CHEMBL157550,1 1,3 1,27 1,32 1,42 1,52 6.022}
{0 CHEMBL157832,1 1,3 1,27 1,50 1,52 5.516}
{0 CHEMBL157897,1 1,3 1,27 1,50 1,52 4.631}
{0 CHEMBL158202,1 1,3 1,9 1,25 1,27 1,50 1,52 5.214}
{0 CHEMBL158266,1 1,3 1,27 1,32 1,52 5.636}
{0 CHEMBL161115,3 1,17 1,27 1,41 1,52 6.097}
{0 CHEMBL161465,3 1,52 4}
{0 CHEMBL161740,3 1,17 1,27 1,28 1,32 1,41 1,52 5.62}
{0 CHEMBL166529,7 1,8 1,9 1,11 1,19 1,27 1,52 6.155}
{0 CHEMBL167166,6 1,7 1,8 1,9 1,11 1,27 1,52 7.398}
{0 CHEMBL167258,7 1,8 1,9 1,11 1,27 1,52 6.921}
{0 CHEMBL167486,7 1,8 1,9 1,11 1,27 1,52 7.155}
{0 CHEMBL167638,7 1,8 1,9 1,11 1,27 1,52 8.301}
{0 CHEMBL168005,1 1,2 1,3 1,4 1,5 1,10 1,14 1,20 1,27 1,52 5.517}
{0 CHEMBL168121,1 1,2 1,3 1,4 1,5 1,10 1,14 1,20 1,27 1,52 4.268}
{0 CHEMBL168418,1 1,2 1,3 1,4 1,5 1,10 1,14 1,20 1,27 1,52 4.31}
{0 CHEMBL168989,7 1,8 1,9 1,11 1,27 1,52 5.155}
{0 CHEMBL169003,1 1,2 1,3 1,4 1,5 1,10 1,14 1,20 1,27 1,52 4.432}
{0 CHEMBL169269,1 1,2 1,3 1,4 1,5 1,10 1,14 1,20 1,27 1,28 1,52 4.658}
{0 CHEMBL169474,1 1,2 1,10 1,14 1,20 1,27 1,52 4.585}
{0 CHEMBL169537,7 1,8 1,9 1,11 1,27 1,52 6.523}
{0 CHEMBL169676,1 1,2 1,3 1,4 1,5 1,14 1,20 1,27 1,52 4}
{0 CHEMBL169746,7 1,8 1,9 1,11 1,27 1,52 7.347}
{0 CHEMBL169834,7 1,8 1,9 1,11 1,25 1,27 1,52 6.301}
{0 CHEMBL169911,1 1,2 1,4 1,5 1,10 1,14 1,20 1,27 1,52 4.292}
{0 CHEMBL170122,1 1,2 1,4 1,5 1,8 1,9 1,10 1,14 1,20 1,27 1,52 4.585}
{0 CHEMBL171141,1 1,3 1,4 1,5 1,9 1,20 1,27 1,52 4.569}
{0 CHEMBL171394,1 1,2 1,3 1,4 1,5 1,10 1,14 1,20 1,27 1,52 4.538}
{0 CHEMBL1788264,3 1,6 1,8 1,9 1,18 1,27 1,28 1,52 6.658}
{0 CHEMBL18701,8 1,9 1,18 1,24 1,27 1,52 5.222}
{0 CHEMBL192,9 1,27 1,28 1,44 1,50 1,52 5.337}
{0 CHEMBL2093042,3 1,6 1,8 1,9 1,18 1,27 1,28 1,52 7.201}
{0 CHEMBL2111609,3 1,8 1,9 1,27 1,52 5}
{0 CHEMBL2111610,8 1,9 1,27 1,52 6.252}
{0 CHEMBL2111611,8 1,9 1,27 1,52 6.337}
{0 CHEMBL2112408,8 1,9 1,27 1,52 6.658}
{0 CHEMBL2112409,8 1,9 1,27 1,52 6.31}
{0 CHEMBL2112410,3 1,8 1,9 1,27 1,52 6.538}
{0 CHEMBL243362,8 1,9 1,27 1,52 5.082}
{0 CHEMBL250546,6 1,8 1,9 1,13 1,15 1,16 1,17 1,18 1,21 1,23 1,24 1,27 1,52 6.824}
{0 CHEMBL28079,3 1,9 1,27 1,52 5}
{0 CHEMBL281244,3 1,15 1,18 1,27 1,52 5.824}
{0 CHEMBL283179,3 1,27 1,33 1,52 6.398}
{0 CHEMBL285457,3 1,13 1,27 1,52 5.699}
{0 CHEMBL28562,3 1,8 1,9 1,15 1,18 1,27 1,52 5.658}
{0 CHEMBL288195,6 1,8 1,9 1,13 1,15 1,16 1,17 1,18 1,21 1,23 1,27 1,52 7.237}
{0 CHEMBL288545,3 1,15 1,27 1,52 5.602}
{0 CHEMBL288547,3 1,15 1,18 1,27 1,52 7.097}
{0 CHEMBL288808,6 1,8 1,9 1,15 1,16 1,17 1,18 1,21 1,23 1,27 1,52 5.201}
{0 CHEMBL289585,6 1,8 1,9 1,13 1,15 1,16 1,17 1,18 1,21 1,22 1,23 1,24 1,26 1,27 1,52 7.131}
{0 CHEMBL290100,6 1,8 1,9 1,13 1,15 1,16 1,17 1,18 1,21 1,22 1,23 1,24 1,26 1,27 1,52 7.531}
{0 CHEMBL295319,6 1,8 1,9 1,15 1,16 1,17 1,18 1,21 1,22 1,23 1,24 1,26 1,27 1,52 6.796}
{0 CHEMBL29546,3 1,27 1,33 1,52 5.745}
{0 CHEMBL295493,7 1,8 1,9 1,11 1,27 1,28 1,50 1,52 5}
{0 CHEMBL295994,6 1,8 1,9 1,15 1,16 1,18 1,22 1,24 1,26 1,27 1,52 6.699}
{0 CHEMBL296358,6 1,8 1,9 1,15 1,16 1,18 1,22 1,24 1,26 1,27 1,52 6.337}
{0 CHEMBL298251,7 1,8 1,9 1,11 1,27 1,28 1,50 1,52 5}
{0 CHEMBL298529,7 1,8 1,9 1,11 1,27 1,28 1,50 1,52 6.337}
{0 CHEMBL302799,6 1,8 1,9 1,13 1,15 1,16 1,18 1,21 1,22 1,23 1,24 1,26 1,27 1,52 6.796}
{0 CHEMBL30379,3 1,15 1,18 1,27 1,52 6.638}
{0 CHEMBL304051,6 1,8 1,9 1,13 1,15 1,16 1,17 1,18 1,21 1,22 1,23 1,24 1,26 1,27 1,52 7.125}
{0 CHEMBL30407,3 1,15 1,18 1,27 1,52 6.222}
{0 CHEMBL305176,8 1,9 1,13 1,17 1,21 1,22 1,27 1,52 6.824}
{0 CHEMBL30593,3 1,27 1,33 1,52 4.658}
{0 CHEMBL30619,3 1,15 1,18 1,27 1,52 5.854}
{0 CHEMBL306320,7 1,8 1,9 1,11 1,27 1,33 1,52 8.231}
{0 CHEMBL30733,3 1,6 1,15 1,27 1,52 6.699}
{0 CHEMBL308456,6 1,8 1,9 1,13 1,15 1,16 1,17 1,18 1,21 1,22 1,23 1,24 1,26 1,27 1,52 5.783}
{0 CHEMBL30894,3 1,27 1,33 1,52 5.796}
{0 CHEMBL30966,3 1,9 1,15 1,18 1,27 1,52 5.237}
{0 CHEMBL31063,15 1,27 1,52 7.523}
{0 CHEMBL313842,8 1,9 1,12 1,19 1,27 1,52 6.678}
{0 CHEMBL314088,3 1,9 1,27 1,33 1,52 5.222}
{0 CHEMBL314089,3 1,11 1,27 1,33 1,52 4.456}
{0 CHEMBL31439,9 1,15 1,18 1,27 1,52 5.959}
{0 CHEMBL314537,3 1,9 1,27 1,33 1,52 5.824}
{0 CHEMBL31530,15 1,18 1,27 1,52 6.699}
{0 CHEMBL316449,3 1,27 1,33 1,52 5.699}
{0 CHEMBL31715,8 1,9 1,15 1,18 1,27 1,52 5.77}
{0 CHEMBL31725,3 1,27 1,28 1,33 1,52 6}
{0 CHEMBL317379,8 1,9 1,27 1,52 4.959}
{0 CHEMBL31743,3 1,15 1,27 1,52 5.638}
{0 CHEMBL31795,3 1,9 1,15 1,18 1,27 1,52 5.886}
{0 CHEMBL318836,8 1,9 1,27 1,52 6.886}
{0 CHEMBL325795,7 1,8 1,9 1,11 1,19 1,27 1,52 7.347}
{0 CHEMBL32673,3 1,15 1,18 1,27 1,52 5.409}
{0 CHEMBL327581,3 1,9 1,11 1,27 1,33 1,52 6.046}
{0 CHEMBL332853,3 1,8 1,9 1,20 1,25 1,27 1,52 5.523}
{0 CHEMBL332854,3 1,20 1,25 1,27 1,50 1,52 5.523}
{0 CHEMBL334988,3 1,15 1,18 1,27 1,42 1,52 5.77}
{0 CHEMBL33501,3 1,27 1,52 6}
{0 CHEMBL338684,3 1,8 1,9 1,20 1,25 1,27 1,50 1,52 5.523}
{0 CHEMBL339408,3 1,25 1,27 1,50 1,52 5.523}
{0 CHEMBL339749,3 1,8 1,9 1,20 1,25 1,27 1,50 1,52 5.523}
{0 CHEMBL341304,3 1,6 1,20 1,25 1,27 1,52 5.699}
{0 CHEMBL341519,3 1,9 1,15 1,27 1,52 5.553}
{0 CHEMBL341866,9 1,27 1,52 6.721}
{0 CHEMBL342285,3 1,6 1,20 1,25 1,27 1,52 5.77}
{0 CHEMBL342727,7 1,8 1,9 1,11 1,19 1,27 1,52 8.155}
{0 CHEMBL342998,9 1,27 1,52 5.201}
{0 CHEMBL343205,6 1,9 1,13 1,15 1,16 1,17 1,18 1,24 1,27 1,52 7.076}
{0 CHEMBL343243,3 1,6 1,20 1,25 1,27 1,47 1,52 6.469}
{0 CHEMBL34431,9 1,11 1,27 1,49 1,52 5}
{0 CHEMBL345472,3 1,6 1,8 1,9 1,18 1,27 1,28 1,52 6.745}
{0 CHEMBL345812,3 1,52 4.387}
{0 CHEMBL345917,1 1,3 1,9 1,27 1,52 7}
{0 CHEMBL346569,1 1,3 1,27 1,32 1,52 5}
{0 CHEMBL346928,1 1,3 1,27 1,42 1,52 5.996}
{0 CHEMBL347102,9 1,13 1,15 1,17 1,18 1,27 1,28 1,52 6.569}
{0 CHEMBL347429,1 1,3 1,27 1,42 1,52 6.122}
{0 CHEMBL347478,1 1,3 1,27 1,42 1,52 6.465}
{0 CHEMBL351567,1 1,3 1,9 1,27 1,52 7.155}
{0 CHEMBL351568,1 1,3 1,27 1,52 6.373}
{0 CHEMBL351900,3 1,9 1,27 1,37 1,52 5.131}
{0 CHEMBL351915,3 1,52 4.237}
{0 CHEMBL352034,1 1,3 1,27 1,33 1,52 5.476}
{0 CHEMBL352351,1 1,2 1,3 1,6 1,10 1,14 1,15 1,16 1,18 1,27 1,52 4.367}
{0 CHEMBL352628,7 1,8 1,9 1,11 1,27 1,28 1,52 6.921}
{0 CHEMBL352655,1 1,2 1,3 1,4 1,5 1,10 1,14 1,20 1,27 1,52 4.721}
{0 CHEMBL352857,7 1,8 1,9 1,11 1,27 1,28 1,52 6.959}
{0 CHEMBL353471,1 1,2 1,3 1,4 1,5 1,8 1,9 1,14 1,20 1,27 1,52 4}
{0 CHEMBL353878,1 1,2 1,3 1,4 1,5 1,8 1,9 1,10 1,14 1,20 1,27 1,52 4}
{0 CHEMBL354430,1 1,2 1,4 1,5 1,10 1,14 1,20 1,27 1,52 4.602}
{0 CHEMBL354447,6 1,7 1,8 1,9 1,11 1,27 1,52 6.495}
{0 CHEMBL354656,7 1,8 1,9 1,11 1,27 1,52 5.222}
{0 CHEMBL355919,8 1,9 1,27 1,46 1,52 5}
{0 CHEMBL356138,3 1,9 1,27 1,50 1,52 7.553}
{0 CHEMBL356323,9 1,27 1,52 8.222}
{0 CHEMBL357851,3 1,9 1,27 1,52 7.036}
{0 CHEMBL357921,9 1,27 1,52 7.268}
{0 CHEMBL359035,6 1,9 1,13 1,15 1,16 1,17 1,18 1,24 1,27 1,52 5.996}
{0 CHEMBL359185,8 1,9 1,27 1,46 1,49 1,52 5}
{0 CHEMBL39058,6 1,8 1,9 1,15 1,16 1,17 1,18 1,21 1,22 1,23 1,24 1,26 1,27 1,52 6.276}
{0 CHEMBL40200,6 1,8 1,9 1,13 1,15 1,16 1,17 1,18 1,21 1,22 1,23 1,24 1,26 1,27 1,52 7.114}
{0 CHEMBL40201,6 1,8 1,9 1,13 1,15 1,16 1,17 1,18 1,21 1,22 1,23 1,24 1,26 1,27 1,52 5.824}
{0 CHEMBL414613,3 1,27 1,33 1,52 8.319}
{0 CHEMBL418785,8 1,9 1,27 1,52 7.301}
{0 CHEMBL419791,3 1,20 1,25 1,27 1,50 1,52 5.523}
{0 CHEMBL42002,6 1,8 1,9 1,13 1,15 1,16 1,17 1,18 1,21 1,22 1,23 1,24 1,26 1,27 1,52 7.123}
{0 CHEMBL420454,8 1,9 1,27 1,52 6.678}
{0 CHEMBL42126,6 1,7 1,8 1,9 1,11 1,15 1,16 1,18 1,22 1,24 1,26 1,27 1,52 7.585}
{0 CHEMBL423073,1 1,2 1,3 1,4 1,5 1,8 1,9 1,10 1,14 1,20 1,27 1,52 4.638}
{0 CHEMBL423559,8 1,9 1,27 1,43 1,52 5}
{0 CHEMBL423595,1 1,3 1,27 1,32 1,52 5}
{0 CHEMBL42387,6 1,8 1,9 1,13 1,15 1,16 1,17 1,18 1,21 1,22 1,23 1,24 1,26 1,27 1,52 7.42}
{0 CHEMBL423931,3 1,6 1,18 1,20 1,25 1,27 1,51 1,52 6.51}
{0 CHEMBL42479,6 1,8 1,9 1,13 1,15 1,16 1,17 1,18 1,21 1,22 1,23 1,26 1,27 1,52 6.959}
{0 CHEMBL430893,7 1,8 1,9 1,11 1,19 1,27 1,52 8.301}
{0 CHEMBL431962,3 1,7 1,8 1,9 1,11 1,12 1,19 1,27 1,52 8.306}
{0 CHEMBL432348,7 1,8 1,9 1,11 1,12 1,14 1,27 1,50 1,52 9.222}
{0 CHEMBL434092,8 1,9 1,27 1,52 8.456}
{0 CHEMBL434590,3 1,8 1,9 1,15 1,18 1,27 1,52 6.699}
{0 CHEMBL43570,6 1,8 1,9 1,15 1,16 1,18 1,22 1,24 1,26 1,27 1,44 1,52 7.699}
{0 CHEMBL43593,6 1,8 1,9 1,13 1,15 1,16 1,17 1,18 1,21 1,22 1,23 1,24 1,26 1,27 1,52 6.102}
{0 CHEMBL43607,6 1,8 1,9 1,15 1,16 1,17 1,18 1,21 1,22 1,23 1,26 1,27 1,52 6.319}
{0 CHEMBL436402,8 1,9 1,27 1,52 6.523}
{0 CHEMBL436416,1 1,3 1,27 1,50 1,52 5.349}
{0 CHEMBL439809,9 1,27 1,52 5.733}
{0 CHEMBL440494,4 1,8 1,9 1,27 1,40 1,52 4.471}
{0 CHEMBL440917,1 1,3 1,27 1,28 1,50 1,52 5}
{0 CHEMBL444824,6 1,8 1,9 1,13 1,15 1,16 1,17 1,18 1,21 1,22 1,23 1,24 1,26 1,27 1,28 1,52 7.367}
{0 CHEMBL455667,4 1,8 1,9 1,27 1,40 1,52 5.181}
{0 CHEMBL511115,7 1,8 1,9 1,11 1,27 1,28 1,52 6.523}
{0 CHEMBL516604,9 1,27 1,52 5}
{0 CHEMBL539806,3 1,18 1,27 1,33 1,52 5.523}
{0 CHEMBL544347,3 1,18 1,27 1,52 5.523}
{0 CHEMBL544816,3 1,18 1,27 1,52 4.301}
{0 CHEMBL555463,3 1,8 1,9 1,18 1,27 1,33 1,52 5.481}
{0 CHEMBL607239,6 1,8 1,9 1,13 1,15 1,16 1,17 1,18 1,21 1,22 1,23 1,24 1,26 1,27 1,28 1,52 6.854}
{0 CHEMBL607240,6 1,8 1,9 1,13 1,15 1,16 1,17 1,18 1,21 1,23 1,27 1,52 6.432}
{0 CHEMBL607241,6 1,8 1,9 1,13 1,15 1,16 1,17 1,18 1,21 1,23 1,27 1,44 1,52 6.42}
{0 CHEMBL607242,6 1,8 1,9 1,13 1,15 1,16 1,17 1,18 1,21 1,23 1,24 1,27 1,52 7.222}
{0 CHEMBL63,7 1,8 1,9 1,11 1,19 1,27 1,52 8.289}
{0 CHEMBL65799,6 1,8 1,9 1,13 1,15 1,16 1,17 1,18 1,21 1,22 1,23 1,24 1,26 1,27 1,28 1,52 8.187}
{0 CHEMBL66233,8 1,9 1,13 1,15 1,17 1,18 1,21 1,22 1,23 1,27 1,52 7.225}
{0 CHEMBL66285,8 1,9 1,13 1,15 1,17 1,18 1,21 1,23 1,27 1,52 5.733}
{0 CHEMBL66798,6 1,8 1,9 1,13 1,15 1,16 1,17 1,18 1,21 1,23 1,24 1,27 1,28 1,52 6.642}
{0 CHEMBL67898,6 1,8 1,9 1,13 1,15 1,16 1,17 1,18 1,21 1,22 1,23 1,24 1,26 1,27 1,52 7.638}
{0 CHEMBL68323,6 1,8 1,9 1,13 1,15 1,16 1,17 1,18 1,21 1,22 1,23 1,24 1,26 1,27 1,52 7.726}
{0 CHEMBL69776,3 1,6 1,8 1,9 1,13 1,15 1,16 1,17 1,18 1,21 1,23 1,27 1,52 6.606}
{0 CHEMBL69874,6 1,8 1,9 1,13 1,15 1,16 1,17 1,18 1,21 1,22 1,23 1,24 1,26 1,27 1,52 8.092}
{0 CHEMBL70090,6 1,8 1,9 1,13 1,15 1,16 1,17 1,18 1,21 1,23 1,27 1,52 6.701}
{0 CHEMBL70145,6 1,8 1,9 1,13 1,15 1,16 1,17 1,18 1,21 1,23 1,27 1,52 6.602}
{0 CHEMBL70146,6 1,8 1,9 1,13 1,15 1,16 1,17 1,18 1,21 1,22 1,23 1,26 1,27 1,52 7.495}
{0 CHEMBL72650,3 1,18 1,27 1,52 5.086}
{0 CHEMBL74078,3 1,17 1,27 1,41 1,52 6.222}
{0 CHEMBL75684,7 1,8 1,9 1,11 1,12 1,19 1,27 1,52 8}
{0 CHEMBL76257,3 1,7 1,8 1,9 1,11 1,12 1,19 1,27 1,52 8.562}
{0 CHEMBL76382,7 1,8 1,9 1,11 1,12 1,14 1,27 1,50 1,52 8.848}
{0 CHEMBL76635,3 1,7 1,8 1,9 1,11 1,12 1,27 1,52 8.921}
{0 CHEMBL77177,7 1,8 1,9 1,11 1,14 1,27 1,33 1,50 1,52 8.151}
{0 CHEMBL77358,7 1,8 1,9 1,11 1,12 1,27 1,52 8}
{0 CHEMBL77651,4 1,8 1,9 1,27 1,52 5.593}
{0 CHEMBL77703,4 1,8 1,9 1,27 1,40 1,52 4.728}
{0 CHEMBL77745,7 1,8 1,9 1,11 1,12 1,27 1,52 8.346}
{0 CHEMBL77788,7 1,8 1,9 1,11 1,12 1,14 1,19 1,27 1,50 1,52 8.757}
{0 CHEMBL77999,3 1,7 1,8 1,9 1,11 1,27 1,33 1,52 8.807}
{0 CHEMBL78237,7 1,8 1,9 1,11 1,12 1,19 1,27 1,52 10.036}
{0 CHEMBL78238,3 1,7 1,8 1,9 1,11 1,12 1,27 1,52 8.716}
{0 CHEMBL80258,7 1,8 1,9 1,11 1,12 1,14 1,19 1,27 1,50 1,52 8.564}
{0 CHEMBL88442,3 1,27 1,33 1,52 5.252}
{0 CHEMBL88527,3 1,11 1,27 1,33 1,52 6}
{0 CHEMBL88990,1 1,3 1,27 1,52 4.854}
{0 CHEMBL90189,3 1,9 1,27 1,33 1,52 5.921}
{0 CHEMBL90335,3 1,27 1,33 1,52 5.328}
{0 CHEMBL90920,3 1,27 1,33 1,52 4.854}
{0 CHEMBL91007,3 1,9 1,27 1,33 1,52 5.301}
{0 CHEMBL91952,3 1,27 1,33 1,52 5.699}
{0 CHEMBL92004,3 1,27 1,33 1,52 4.301}
{0 CHEMBL96039,8 1,9 1,27 1,52 6.839}
{0 CHEMBL97214,8 1,9 1,27 1,52 7.367}
{0 CHEMBL97785,8 1,9 1,18 1,27 1,52 6.699}
{0 CHEMBL97817,8 1,9 1,27 1,52 7.824}
