"molecule_id","nH","nCsp","nTB","Se","Si","Mp","nAT","AMW","Sv","nBT","Mv","Sp","nCsp3","pXC50"
{1 28,4 57.152,5 64.072,6 0.667,7 57,8 7.661,9 35.125,10 60,11 0.616,12 38.023,13 13,14 5.538}
{0 CHEMBL1086845,1 26,4 48.461,5 55.398,6 0.634,7 49,8 6.418,9 28.794,10 51,11 0.588,12 31.057,13 11,14 8.886}
{0 CHEMBL1086967,1 31,4 66.985,5 75.145,6 0.664,7 67,8 7.248,9 42.299,10 71,11 0.631,12 44.495,13 11,14 8.796}
{0 CHEMBL1087096,1 41,4 74.076,5 85.012,6 0.625,7 75,8 6.236,9 43.218,10 78,11 0.576,12 46.847,13 19,14 8.979}
{0 CHEMBL1088406,1 22,4 44.022,5 49.777,6 0.636,7 44,8 6.873,9 26.455,10 46,11 0.601,12 27.989,13 9,14 6.456}
{0 CHEMBL1088412,1 25,4 47.36,5 53.9,6 0.647,7 48,8 6.489,9 28.773,10 50,11 0.599,12 31.052,13 10,14 6.638}
{0 CHEMBL1096175,1 35,4 69.752,5 78.976,6 0.643,7 70,8 6.824,9 42.352,10 73,11 0.605,12 45.017,13 13,14 8.979}
{0 CHEMBL115854,1 29,4 62.851,5 70.441,6 0.681,7 63,8 7.55,9 40.244,10 67,11 0.639,12 42.926,13 11,14 8.398}
{0 CHEMBL115968,1 27,4 56.967,5 64.026,6 0.67,7 57,8 7.467,9 35.717,10 60,11 0.627,12 38.165,13 11,14 5.963}
{0 CHEMBL116509,1 29,4 58.774,5 66.521,6 0.649,7 59,8 6.908,9 36.057,10 62,11 0.611,12 38.279,13 11,14 4.672}
{0 CHEMBL117401,1 28,4 57.992,5 65.604,6 0.647,7 58,8 7.044,9 35.552,10 61,11 0.613,12 37.523,13 11,14 8.046}
{0 CHEMBL117920,1 29,4 59.774,5 67.521,6 0.655,7 60,8 6.993,9 37.057,10 63,11 0.618,12 39.279,13 11,14 5.64}
{0 CHEMBL117981,1 29,4 59.774,5 67.521,6 0.655,7 60,8 6.993,9 37.057,10 63,11 0.618,12 39.279,13 11,14 8.161}
{0 CHEMBL118803,1 27,4 56.967,5 64.026,6 0.67,7 57,8 7.467,9 35.717,10 60,11 0.627,12 38.165,13 11,14 8.219}
{0 CHEMBL119398,1 26,4 50.789,5 57.607,6 0.637,7 51,8 6.715,9 30.509,10 53,11 0.598,12 32.512,13 11,14 8.06}
{0 CHEMBL131909,1 41,4 80.378,5 91.222,6 0.618,7 80,8 6.797,9 46.878,10 81,11 0.586,12 49.461,13 16,14 7.097}
{0 CHEMBL133803,1 41,4 80.127,5 90.932,6 0.633,7 80,8 6.998,9 47.35,10 81,11 0.592,12 50.654,13 16,14 5.046}
{0 CHEMBL138334,1 32,2 1,3 1,4 66.087,5 74.644,6 0.644,7 66,8 7.04,9 40.32,10 69,11 0.611,12 42.5,13 15,14 8.796}
{0 CHEMBL138361,1 34,2 1,3 1,4 69.97,5 79.059,6 0.647,7 70,8 7.009,9 42.847,10 74,11 0.612,12 45.262,13 17,14 8.959}
{0 CHEMBL138367,1 31,4 65.985,5 74.145,6 0.659,7 66,8 7.176,9 41.299,10 70,11 0.626,12 43.495,13 12,14 7.745}
{0 CHEMBL138550,1 35,4 68.752,5 77.976,6 0.638,7 69,8 6.749,9 41.352,10 73,11 0.599,12 44.017,13 17,14 7.854}
{0 CHEMBL138635,1 28,2 1,3 1,4 60.32,5 67.813,6 0.65,7 60,8 7.276,9 37.266,10 63,11 0.621,12 38.978,13 13,14 8.377}
{0 CHEMBL138978,1 29,4 59.101,5 66.73,6 0.64,7 59,8 6.975,9 35.772,10 62,11 0.606,12 37.733,13 13,14 7.187}
{0 CHEMBL139552,1 37,4 75.29,5 84.81,6 0.636,7 75,8 6.983,9 45.309,10 79,11 0.604,12 47.688,13 18,14 9.215}
{0 CHEMBL139617,1 26,4 54.436,5 61.398,6 0.634,7 54,8 7.157,9 32.74,10 56,11 0.606,12 34.216,13 10,14 6.194}
{0 CHEMBL139770,1 34,4 67.97,5 77.059,6 0.636,7 68,8 6.862,9 40.847,10 72,11 0.601,12 43.262,13 16,14 4.678}
{0 CHEMBL139872,1 36,4 74.509,5 83.893,6 0.634,7 74,8 7.09,9 44.803,10 78,11 0.605,12 46.932,13 17,14 9.409}
{0 CHEMBL140059,1 36,4 69.534,5 78.893,6 0.64,7 70,8 6.638,9 41.858,10 74,11 0.598,12 44.773,13 18,14 7.108}
{0 CHEMBL140310,1 32,4 64.087,5 72.644,6 0.633,7 64,8 6.884,9 38.32,10 67,11 0.599,12 40.5,13 14,14 7.409}
{0 CHEMBL140461,1 33,2 1,3 1,4 69.189,5 78.142,6 0.645,7 69,8 7.125,9 42.341,10 73,11 0.614,12 44.506,13 16,14 8.824}
{0 CHEMBL140595,1 30,4 61.211,5 68.856,6 0.638,7 61,8 6.993,9 36.992,10 64,11 0.606,12 38.943,13 14,14 6.194}
{0 CHEMBL140623,1 40,4 72.621,5 83.304,6 0.61,7 73,8 6.311,9 41.427,10 76,11 0.567,12 44.546,13 21,14 7.886}
{0 CHEMBL140687,1 35,4 70.072,5 79.557,6 0.632,7 70,8 6.881,9 41.868,10 74,11 0.598,12 44.267,13 16,14 7.481}
{0 CHEMBL140843,1 34,4 70.298,5 79.268,6 0.639,7 70,8 7.066,9 42.562,10 74,11 0.608,12 44.716,13 16,14 8.886}
{0 CHEMBL140969,1 33,2 1,3 1,4 69.189,5 78.142,6 0.645,7 69,8 7.125,9 42.341,10 73,11 0.614,12 44.506,13 16,14 8.824}
{0 CHEMBL141158,1 34,4 67.97,5 77.059,6 0.636,7 68,8 6.862,9 40.847,10 72,11 0.601,12 43.262,13 16,14 7.585}
{0 CHEMBL141416,1 38,4 73.738,5 83.889,6 0.632,7 74,8 6.685,9 43.9,10 78,11 0.593,12 46.785,13 18,14 7.638}
{0 CHEMBL141588,1 36,4 74.509,5 83.893,6 0.634,7 74,8 7.09,9 44.803,10 78,11 0.605,12 46.932,13 17,14 9.409}
{0 CHEMBL141728,1 38,4 73.89,5 83.729,6 0.65,7 74,8 7.227,9 44.275,10 76,11 0.598,12 48.08,13 16,14 6.959}
{0 CHEMBL141787,1 34,4 70.97,5 80.059,6 0.652,7 71,8 7.08,9 43.847,10 75,11 0.618,12 46.262,13 13,14 7.509}
{0 CHEMBL141871,1 34,4 67.97,5 77.059,6 0.636,7 68,8 6.862,9 40.847,10 72,11 0.601,12 43.262,13 16,14 7.092}
{0 CHEMBL142133,1 30,4 60.203,5 68.228,6 0.629,7 60,8 6.909,9 35.793,10 62,11 0.597,12 37.739,13 12,14 7.06}
{0 CHEMBL143873,1 36,4 66.854,5 76.474,6 0.612,7 67,8 6.457,9 38.374,10 70,11 0.573,12 41.023,13 19,14 7.319}
{0 CHEMBL149924,1 32,4 63.836,5 72.354,6 0.651,7 64,8 7.135,9 38.792,10 66,11 0.606,12 41.694,13 12,14 5.108}
{0 CHEMBL150617,1 29,4 58.851,5 66.441,6 0.66,7 59,8 7.248,9 36.244,10 61,11 0.614,12 38.926,13 11,14 5.114}
{0 CHEMBL150926,1 25,4 53.083,5 59.61,6 0.668,7 53,8 7.539,9 33.191,10 55,11 0.626,12 35.404,13 9,14 8.301}
{0 CHEMBL151379,1 32,4 66.156,5 74.936,6 0.651,7 66,8 7.344,9 40.308,10 68,11 0.611,12 42.944,13 11,14 4.553}
{0 CHEMBL168863,1 27,4 56.967,5 64.026,6 0.67,7 57,8 7.467,9 35.717,10 60,11 0.627,12 38.165,13 11,14 8.405}
{0 CHEMBL169572,1 26,4 50.789,5 57.607,6 0.637,7 51,8 6.715,9 30.509,10 53,11 0.598,12 32.512,13 11,14 8.06}
{0 CHEMBL185848,1 24,2 1,3 1,4 48.578,5 54.983,6 0.659,7 49,8 6.867,9 30.267,10 51,11 0.618,12 32.296,13 10,14 9.699}
{0 CHEMBL186622,1 22,4 43.694,5 49.567,6 0.649,7 44,8 6.782,9 26.74,10 46,11 0.608,12 28.534,13 8,14 6.638}
{0 CHEMBL186979,1 25,4 47.36,5 53.9,6 0.647,7 48,8 6.489,9 28.773,10 50,11 0.599,12 31.052,13 10,14 8.886}
{0 CHEMBL187502,1 34,4 70.97,5 80.059,6 0.652,7 71,8 7.08,9 43.847,10 75,11 0.618,12 46.262,13 13,14 7.509}
{0 CHEMBL187723,1 31,4 65.985,5 74.145,6 0.659,7 66,8 7.176,9 41.299,10 70,11 0.626,12 43.495,13 12,14 7.745}
{0 CHEMBL187830,1 28,2 1,3 1,4 60.32,5 67.813,6 0.65,7 60,8 7.276,9 37.266,10 63,11 0.621,12 38.978,13 13,14 8.377}
{0 CHEMBL187844,1 37,4 75.29,5 84.81,6 0.636,7 75,8 6.983,9 45.309,10 79,11 0.604,12 47.688,13 18,14 9.215}
{0 CHEMBL187934,1 34,4 67.97,5 77.059,6 0.636,7 68,8 6.862,9 40.847,10 72,11 0.601,12 43.262,13 16,14 7.092}
{0 CHEMBL188259,1 38,4 73.738,5 83.889,6 0.632,7 74,8 6.685,9 43.9,10 78,11 0.593,12 46.785,13 18,14 7.638}
{0 CHEMBL188317,1 30,4 60.203,5 68.228,6 0.629,7 60,8 6.909,9 35.793,10 62,11 0.597,12 37.739,13 12,14 7.06}
{0 CHEMBL188379,1 32,2 1,3 1,4 66.087,5 74.644,6 0.644,7 66,8 7.04,9 40.32,10 69,11 0.611,12 42.5,13 15,14 8.796}
{0 CHEMBL188390,1 27,4 49.891,5 57.106,6 0.61,7 50,8 6.429,9 28.53,10 52,11 0.571,12 30.517,13 14,14 6.959}
{0 CHEMBL188468,1 33,4 58.541,5 67.351,6 0.607,7 59,8 6.162,9 33.111,10 61,11 0.561,12 35.802,13 17,14 7.553}
{0 CHEMBL188501,1 30,2 1,3 1,4 60.876,5 69.019,6 0.644,7 61,8 6.928,9 37.078,10 64,11 0.608,12 39.284,13 14,14 8.337}
{0 CHEMBL188710,1 32,2 1,3 1,4 59.76,5 68.434,6 0.617,7 60,8 6.476,9 34.605,10 62,11 0.577,12 37.046,13 17,14 8.921}
{0 CHEMBL188862,1 31,4 65.64,5 73.564,6 0.637,7 65,8 7.224,9 39.728,10 68,11 0.611,12 41.404,13 14,14 8.921}
{0 CHEMBL189445,1 26,2 1,3 1,4 55.109,5 62.189,6 0.65,7 55,8 7.173,9 34.025,10 58,11 0.619,12 35.762,13 12,14 5.824}
{0 CHEMBL189463,1 22,4 43.694,5 49.567,6 0.649,7 44,8 6.782,9 26.74,10 46,11 0.608,12 28.534,13 8,14 8.046}
{0 CHEMBL189620,1 25,2 1,3 1,4 49.68,5 56.481,6 0.646,7 50,8 6.79,9 30.289,10 52,11 0.606,12 32.302,13 11,14 9.679}
{0 CHEMBL189765,1 38,4 69.738,5 79.889,6 0.611,7 70,8 6.381,9 39.9,10 73,11 0.57,12 42.785,13 20,14 7.167}
{0 CHEMBL189807,1 30,2 1,3 1,4 56.876,5 65.019,6 0.619,7 57,8 6.571,9 33.078,10 59,11 0.58,12 35.285,13 16,14 9.119}
{0 CHEMBL190271,1 31,4 55.658,5 63.936,6 0.608,7 56,8 6.242,9 31.584,10 58,11 0.564,12 34.04,13 16,14 7.387}
{0 CHEMBL191061,1 26,2 1,3 1,4 55.109,5 62.189,6 0.65,7 55,8 7.173,9 34.025,10 58,11 0.619,12 35.762,13 12,14 8.161}
{0 CHEMBL191187,1 36,4 69.534,5 78.893,6 0.64,7 70,8 6.638,9 41.858,10 74,11 0.598,12 44.773,13 18,14 7.108}
{0 CHEMBL191338,1 36,4 66.854,5 76.474,6 0.612,7 67,8 6.457,9 38.374,10 70,11 0.573,12 41.023,13 19,14 7.319}
{0 CHEMBL191572,1 34,2 1,3 1,4 69.97,5 79.059,6 0.647,7 70,8 7.009,9 42.847,10 74,11 0.612,12 45.262,13 17,14 8.959}
{0 CHEMBL2178955,1 25,4 51,5 58.062,6 0.638,7 51,8 6.97,9 30.805,10 53,11 0.604,12 32.552,13 11,14 6.517}
{0 CHEMBL2178956,1 31,4 64.65,5 73.308,6 0.659,7 65,8 7.04,9 40.385,10 69,11 0.621,12 42.836,13 11,14 6.266}
{0 CHEMBL2178957,1 38,4 75.058,5 85.471,6 0.627,7 75,8 6.809,9 44.416,10 78,11 0.592,12 47.035,13 16,14 6.553}
{0 CHEMBL2178958,1 24,2 1,3 1,4 52.218,5 59.145,6 0.65,7 52,8 7.317,9 32.299,10 54,11 0.621,12 33.796,13 11,14 8.523}
{0 CHEMBL2178959,1 37,2 1,3 1,4 76.276,5 86.554,6 0.635,7 76,8 7.049,9 45.911,10 79,11 0.604,12 48.279,13 16,14 8.046}
{0 CHEMBL2178960,1 38,4 75.058,5 85.471,6 0.627,7 75,8 6.809,9 44.416,10 78,11 0.592,12 47.035,13 16,14 7.495}
{0 CHEMBL2178961,1 27,4 60.211,5 67.687,6 0.663,7 60,8 7.426,9 38.046,10 64,11 0.634,12 39.767,13 9,14 6.321}
{0 CHEMBL2178962,1 31,4 64.65,5 73.308,6 0.659,7 65,8 7.04,9 40.385,10 69,11 0.621,12 42.836,13 11,14 6.77}
{0 CHEMBL2178963,1 30,4 65.163,5 73.648,6 0.658,7 65,8 7.317,9 40.768,10 69,11 0.627,12 42.773,13 11,14 7.481}
{0 CHEMBL2178964,1 29,4 65.676,5 73.987,6 0.657,7 65,8 7.594,9 41.152,10 69,11 0.633,12 42.711,13 11,14 7.62}
{0 CHEMBL2178965,1 29,4 65.676,5 73.987,6 0.657,7 65,8 7.594,9 41.152,10 69,11 0.633,12 42.711,13 11,14 7.764}
{0 CHEMBL2178966,1 30,4 64.974,5 73.252,6 0.672,7 65,8 7.57,9 41.212,10 69,11 0.634,12 43.694,13 11,14 7.638}
{0 CHEMBL2178967,1 30,4 64.88,5 73.15,6 0.68,7 65,8 8.254,9 41.41,10 69,11 0.637,12 44.188,13 11,14 7.854}
{0 CHEMBL2178968,1 26,4 59.429,5 66.77,6 0.661,7 59,8 7.569,9 37.541,10 63,11 0.636,12 39.012,13 9,14 6.447}
{0 CHEMBL2178969,1 30,4 63.869,5 72.391,6 0.657,7 64,8 7.166,9 39.88,10 68,11 0.623,12 42.08,13 11,14 7.161}
{0 CHEMBL2178970,1 35,4 71.745,5 81.348,6 0.65,7 72,8 6.968,9 44.153,10 76,11 0.613,12 46.813,13 13,14 6.883}
{0 CHEMBL2178971,1 30,4 59.869,5 68.391,6 0.635,7 60,8 6.843,9 35.88,10 63,11 0.598,12 38.08,13 12,14 6.77}
{0 CHEMBL2178972,1 34,4 65.636,5 75.221,6 0.63,7 66,8 6.646,9 38.933,10 69,11 0.59,12 41.603,13 14,14 7.62}
{0 CHEMBL2178973,1 36,4 70.847,5 80.846,6 0.631,7 71,8 6.77,9 42.175,10 75,11 0.594,12 44.819,13 16,14 6.62}
{0 CHEMBL2178974,1 45,4 86.81,5 99.215,6 0.624,7 87,8 6.665,9 51.018,10 91,11 0.586,12 54.324,13 20,14 6.959}
{0 CHEMBL2178975,1 37,4 71.621,5 82.135,6 0.63,7 72,8 6.662,9 42.481,10 76,11 0.59,12 45.37,13 16,14 7}
{0 CHEMBL2178976,1 31,4 64.97,5 73.889,6 0.647,7 65,8 7.102,9 39.901,10 69,11 0.614,12 42.086,13 12,14 7.046}
{0 CHEMBL2178977,1 21,4 46.56,5 52.441,6 0.641,7 46,8 7.466,9 28.466,10 48,11 0.619,12 29.483,13 9,14 6.439}
{0 CHEMBL2178978,1 25,4 51,5 58.062,6 0.638,7 51,8 6.97,9 30.805,10 53,11 0.604,12 32.552,13 11,14 6.848}
{0 CHEMBL2178979,1 23,4 50.443,5 56.857,6 0.645,7 50,8 7.389,9 30.993,10 53,11 0.62,12 32.245,13 9,14 5.936}
{0 CHEMBL2179405,1 31,4 61.756,5 70.241,6 0.667,7 62,8 7.124,9 37.985,10 65,11 0.613,12 41.347,13 12,14 6.02}
{0 CHEMBL2179406,1 31,4 61.65,5 70.308,6 0.643,7 62,8 6.8,9 37.385,10 66,11 0.603,12 39.836,13 14,14 7.409}
{0 CHEMBL2179407,1 37,4 70.301,5 80.554,6 0.635,7 71,8 6.531,9 41.965,10 75,11 0.591,12 45.12,13 17,14 6.833}
{0 CHEMBL2179408,1 34,4 70.618,5 79.85,6 0.628,7 70,8 7.124,9 42.078,10 73,11 0.601,12 43.966,13 14,14 6.851}
{0 CHEMBL224109,1 32,4 81.8,5 89.611,6 0.68,7 80,8 8.41,9 53.081,10 86,11 0.664,12 54.421,13 11,14 6.745}
{0 CHEMBL255409,1 27,4 54.64,5 61.816,6 0.667,7 55,8 7.229,9 34.003,10 58,11 0.618,12 36.711,13 11,14 8.301}
{0 CHEMBL256268,1 29,4 60.523,5 68.231,6 0.68,7 61,8 7.339,9 38.529,10 65,11 0.632,12 41.472,13 11,14 8.398}
{0 CHEMBL256461,1 27,4 54.64,5 61.816,6 0.667,7 55,8 7.229,9 34.003,10 58,11 0.618,12 36.711,13 11,14 5.959}
{0 CHEMBL257928,1 25,4 56.083,5 62.61,6 0.686,7 56,8 7.778,9 36.19,10 60,11 0.646,12 38.404,13 9,14 8.252}
{0 CHEMBL269822,1 23,4 50.2,5 56.195,6 0.673,7 50,8 7.711,9 31.664,10 53,11 0.633,12 33.642,13 9,14 8.071}
{0 CHEMBL269970,1 29,4 60.774,5 68.521,6 0.66,7 61,8 7.075,9 38.057,10 65,11 0.624,12 40.279,13 11,14 8.252}
{0 CHEMBL271255,1 27,4 54.64,5 61.816,6 0.667,7 55,8 7.229,9 34.003,10 58,11 0.618,12 36.711,13 11,14 7.886}
{0 CHEMBL272798,1 28,4 55.665,5 63.394,6 0.644,7 56,8 6.795,9 33.837,10 59,11 0.604,12 36.069,13 11,14 8.046}
{0 CHEMBL289651,1 26,4 48.461,5 55.398,6 0.634,7 49,8 6.418,9 28.794,10 51,11 0.588,12 31.057,13 11,14 6.886}
{0 CHEMBL302204,1 25,4 58.411,5 64.82,6 0.687,7 58,8 7.993,9 37.905,10 62,11 0.654,12 39.858,13 9,14 8.301}
{0 CHEMBL303966,1 30,4 60.211,5 67.856,6 0.632,7 60,8 6.909,9 35.992,10 62,11 0.6,12 37.943,13 13,14 7.987}
{0 CHEMBL311364,1 24,4 42.905,5 49.192,6 0.599,7 43,8 6.242,9 23.982,10 44,11 0.558,12 25.75,13 12,14 7.538}
{0 CHEMBL323812,1 29,4 58.851,5 66.441,6 0.66,7 59,8 7.248,9 36.244,10 62,11 0.614,12 38.926,13 12,14 4.793}
{0 CHEMBL324789,1 29,4 63.101,5 70.73,6 0.662,7 63,8 7.295,9 39.772,10 67,11 0.631,12 41.733,13 11,14 8.252}
{0 CHEMBL324799,1 24,4 53.309,5 59.321,6 0.676,7 53,8 7.784,9 33.884,10 56,11 0.639,12 35.853,13 9,14 5.695}
{0 CHEMBL325485,1 29,4 58.851,5 66.441,6 0.66,7 59,8 7.248,9 36.244,10 62,11 0.614,12 38.926,13 13,14 8.42}
{0 CHEMBL325699,1 28,4 62.32,5 69.813,6 0.661,7 62,8 7.429,9 39.266,10 66,11 0.633,12 40.978,13 11,14 8.26}
{0 CHEMBL326515,1 28,4 57.749,5 64.942,6 0.671,7 58,8 7.321,9 36.223,10 61,11 0.625,12 38.921,13 11,14 5.81}
{0 CHEMBL330920,1 28,4 58.992,5 66.604,6 0.653,7 59,8 7.128,9 36.552,10 62,11 0.62,12 38.523,13 11,14 7.215}
{0 CHEMBL333638,1 30,4 60.211,5 67.856,6 0.632,7 60,8 6.909,9 35.992,10 62,11 0.6,12 37.943,13 13,14 7.987}
{0 CHEMBL335354,1 29,4 60.429,5 67.94,6 0.636,7 60,8 7.126,9 36.487,10 63,11 0.608,12 38.188,13 13,14 7.268}
{0 CHEMBL335815,1 34,4 70.298,5 79.268,6 0.639,7 70,8 7.066,9 42.562,10 74,11 0.608,12 44.716,13 16,14 8.886}
{0 CHEMBL341691,1 36,2 1,3 1,4 72.854,5 82.474,6 0.644,7 73,8 6.914,9 44.374,10 77,11 0.608,12 47.023,13 18,14 9.143}
{0 CHEMBL343361,1 43,4 85.261,5 96.637,6 0.626,7 85,8 6.845,9 50.405,10 89,11 0.593,12 53.222,13 20,14 6.77}
{0 CHEMBL343570,1 40,2 1,3 1,4 74.621,5 85.304,6 0.621,7 75,8 6.463,9 43.427,10 78,11 0.579,12 46.546,13 22,14 9.244}
{0 CHEMBL343739,1 20,4 39.811,5 45.152,6 0.644,7 40,8 6.809,9 24.214,10 42,11 0.605,12 25.773,13 8,14 7.18}
{0 CHEMBL344019,1 38,4 79.738,5 89.889,6 0.66,7 80,8 7.084,9 49.9,10 84,11 0.624,12 52.785,13 12,14 7.092}
{0 CHEMBL344247,1 31,4 65.64,5 73.564,6 0.637,7 65,8 7.224,9 39.728,10 68,11 0.611,12 41.404,13 14,14 8.921}
{0 CHEMBL345092,1 34,4 63.97,5 73.059,6 0.613,7 64,8 6.541,9 36.847,10 67,11 0.576,12 39.262,13 18,14 7.114}
{0 CHEMBL357232,1 38,4 69.738,5 79.889,6 0.611,7 70,8 6.381,9 39.9,10 73,11 0.57,12 42.785,13 20,14 7.167}
{0 CHEMBL357611,1 40,4 72.621,5 83.304,6 0.61,7 73,8 6.311,9 41.427,10 76,11 0.567,12 44.546,13 21,14 7.886}
{0 CHEMBL362492,1 35,4 68.752,5 77.976,6 0.638,7 69,8 6.749,9 41.352,10 73,11 0.599,12 44.017,13 17,14 7.854}
{0 CHEMBL362534,1 43,4 85.261,5 96.637,6 0.626,7 85,8 6.845,9 50.405,10 89,11 0.593,12 53.222,13 20,14 6.77}
{0 CHEMBL362737,1 38,4 79.738,5 89.889,6 0.66,7 80,8 7.084,9 49.9,10 84,11 0.624,12 52.785,13 12,14 7.092}
{0 CHEMBL362971,1 28,4 55,5 62.232,6 0.631,7 55,8 6.773,9 32.75,10 57,11 0.595,12 34.728,13 12,14 9.658}
{0 CHEMBL363335,1 24,4 50.232,5 56.401,6 0.644,7 50,8 7.129,9 30.697,10 52,11 0.614,12 32.205,13 9,14 7.284}
{0 CHEMBL363383,1 26,2 1,3 1,4 51.109,5 58.189,6 0.623,7 51,8 6.794,9 30.025,10 53,11 0.589,12 31.762,13 14,14 8.538}
{0 CHEMBL363530,1 24,2 1,3 1,4 48.578,5 54.983,6 0.659,7 49,8 6.867,9 30.267,10 51,11 0.618,12 32.296,13 10,14 8.301}
{0 CHEMBL363655,1 19,2 1,3 1,4 41.029,5 46.235,6 0.659,7 41,8 7.253,9 25.708,10 43,11 0.627,12 27.017,13 8,14 8.509}
{0 CHEMBL364335,1 36,2 1,3 1,4 72.854,5 82.474,6 0.644,7 73,8 6.914,9 44.374,10 77,11 0.608,12 47.023,13 18,14 9.143}
{0 CHEMBL364930,1 27,4 51.218,5 58.315,6 0.607,7 51,8 6.617,9 29.245,10 53,11 0.573,12 30.972,13 14,14 5.921}
{0 CHEMBL364989,1 30,2 1,3 1,4 67.203,5 75.228,6 0.668,7 67,8 7.442,9 42.793,10 71,11 0.639,12 44.739,13 12,14 8.886}
{0 CHEMBL365843,1 24,4 50.232,5 56.401,6 0.644,7 50,8 7.129,9 30.697,10 52,11 0.614,12 32.205,13 9,14 9.674}
{0 CHEMBL365969,1 29,4 59.101,5 66.73,6 0.64,7 59,8 6.975,9 35.772,10 62,11 0.606,12 37.733,13 13,14 7.187}
{0 CHEMBL370320,1 36,2 1,3 1,4 65.527,5 75.265,6 0.615,7 66,8 6.313,9 37.659,10 68,11 0.571,12 40.569,13 19,14 9.409}
{0 CHEMBL370722,1 34,4 63.97,5 73.059,6 0.613,7 64,8 6.541,9 36.847,10 67,11 0.576,12 39.262,13 18,14 7.114}
{0 CHEMBL371853,1 38,4 73.89,5 83.729,6 0.65,7 74,8 7.227,9 44.275,10 76,11 0.598,12 48.08,13 16,14 6.959}
{0 CHEMBL375794,1 34,4 59.996,5 69.059,6 0.625,7 61,8 6.075,9 34.901,10 63,11 0.572,12 38.103,13 15,14 8.921}
{0 CHEMBL390610,1 40,4 93.334,5 103.271,6 0.668,7 92,8 7.923,9 59.188,10 98,11 0.643,12 61.466,13 15,14 9.081}
{0 CHEMBL402616,1 29,4 57.447,5 65.311,6 0.652,7 58,8 6.751,9 35.342,10 61,11 0.609,12 37.824,13 11,14 8.161}
{0 CHEMBL408666,1 30,2 1,3 1,4 67.203,5 75.228,6 0.668,7 67,8 7.442,9 42.793,10 71,11 0.639,12 44.739,13 12,14 8.886}
{0 CHEMBL411500,1 29,4 56.523,5 64.231,6 0.657,7 57,8 7.011,9 34.529,10 60,11 0.606,12 37.472,13 13,14 8.42}
{0 CHEMBL420706,1 23,4 52.527,5 58.405,6 0.675,7 52,8 7.953,9 33.379,10 55,11 0.642,12 35.097,13 9,14 8.071}
{0 CHEMBL425001,1 26,2 1,3 1,4 55.109,5 62.189,6 0.65,7 55,8 7.173,9 34.025,10 58,11 0.619,12 35.762,13 12,14 8.796}
{0 CHEMBL435223,1 43,4 79.941,5 91.055,6 0.612,7 80,8 6.472,9 45.889,10 83,11 0.574,12 48.972,13 23,14 9.495}
{0 CHEMBL435288,1 27,4 53.891,5 61.106,6 0.639,7 54,8 6.843,9 32.53,10 57,11 0.602,12 34.517,13 12,14 4.721}
{0 CHEMBL436620,1 27,4 56.967,5 64.026,6 0.67,7 57,8 7.467,9 35.717,10 60,11 0.627,12 38.165,13 11,14 5.22}
{0 CHEMBL534924,1 35,4 70.072,5 79.557,6 0.632,7 70,8 6.881,9 41.868,10 74,11 0.598,12 44.267,13 16,14 7.481}
{0 CHEMBL76578,1 25,4 51.334,5 57.9,6 0.632,7 51,8 7.048,9 30.718,10 53,11 0.602,12 32.211,13 10,14 9.699}
{0 CHEMBL79993,1 22,4 46.349,5 51.986,6 0.64,7 46,8 7.183,9 28.17,10 48,11 0.612,12 29.443,13 9,14 9.481}
