"molecule_id","AMW","C.","H.","Me","Mi","Mp","Mv","MW","N.","nAB","nAT","nB","nBM","nBO","nBR","nBT","nC","nCL","nCsp","nCsp2","nCsp3","nDB","nF","nH","nHet","nHM","nI","nN","nO","nP","nS","nSK","nTB","nX","O.","RBF","RBN","SCBO","Se","Si","Sp","Sv","X.","pXC50"
{1 8.778,2 48.8,3 37.2,4 1.009,5 1.113,6 0.73,7 0.699,8 377.47,9 7,10 23,11 43,13 24,14 30,16 46,17 21,20 20,21 1,22 1,23 1,24 16,25 6,26 1,28 3,29 1,31 1,32 27,34 1,35 2.3,36 0.087,37 4,38 42.5,39 43.407,40 47.87,41 31.387,42 30.037,43 2.3,44 5}
{0 CHEMBL101253,1 8.671,2 50,3 37.5,4 1.001,5 1.111,6 0.736,7 0.702,8 346.84,9 10,10 23,11 40,13 23,14 28,16 43,17 20,18 1,20 19,21 1,24 15,25 5,26 1,28 4,32 25,34 1,36 0.093,37 4,38 39.5,39 40.033,40 44.428,41 29.449,42 28.074,43 2.5,44 5}
{0 CHEMBL103667,1 6.944,2 40.8,3 48.7,4 0.995,5 1.128,6 0.652,7 0.614,8 527.73,9 6.6,10 22,11 76,13 23,14 43,16 80,17 31,20 20,21 11,22 1,24 37,25 8,28 5,29 3,32 39,35 3.9,36 0.1,37 8,38 55,39 75.629,40 85.763,41 49.574,42 46.68,44 5}
{0 CHEMBL105442,1 12.274,2 43.6,3 35.9,4 1.034,5 1.13,6 0.754,7 0.708,8 478.68,9 5.1,10 12,11 39,13 13,14 27,16 41,17 17,18 1,20 13,21 4,22 1,23 2,24 14,25 8,26 2,27 1,28 2,29 2,32 25,34 4,35 5.1,36 0.146,37 6,38 34,39 40.345,40 44.081,41 29.404,42 27.598,43 10.3,44 5}
{0 CHEMBL1173655,1 8.237,2 40.7,3 42.4,4 1.018,5 1.135,6 0.671,7 0.648,8 485.99,9 8.5,10 17,11 59,13 19,14 37,16 62,17 24,18 1,20 17,21 7,22 2,23 1,24 25,25 10,26 1,28 5,29 3,32 34,34 2,35 5.1,36 0.129,37 8,38 47.5,39 60.047,40 66.971,41 39.563,42 38.257,43 3.4,44 5}
{0 CHEMBL119385,1 11.791,2 51.4,3 24.3,4 1.049,5 1.115,6 0.798,7 0.784,8 436.28,9 8.1,10 12,11 37,13 17,14 31,16 40,17 19,18 2,20 19,22 5,23 2,24 9,25 9,26 3,28 3,29 1,31 1,32 28,34 4,35 2.7,36 0.075,37 3,38 42,39 38.8,40 41.268,41 29.517,42 29.022,43 10.8,44 5}
{0 CHEMBL1230020,1 10.094,2 41.5,3 34.1,4 1.046,5 1.136,6 0.71,7 0.699,8 413.86,9 7.3,10 16,11 41,13 19,14 29,16 43,17 17,18 1,20 14,21 3,22 3,23 2,24 14,25 10,26 2,28 3,29 3,31 1,32 27,34 3,35 7.3,36 0.14,37 6,38 40,39 42.898,40 46.573,41 29.091,42 28.677,43 7.3,44 5}
{0 CHEMBL1236107,1 9.217,2 46.2,3 33.3,4 1.011,5 1.119,6 0.743,7 0.716,8 359.45,9 17.9,10 26,11 39,13 26,14 30,16 43,17 18,20 17,21 1,24 13,25 8,26 1,28 7,31 1,32 26,36 0.07,37 3,38 43,39 39.44,40 43.654,41 28.972,42 27.917,44 5}
{0 CHEMBL1240703,1 7.928,2 47.3,3 40.5,4 1.007,5 1.114,6 0.692,7 0.669,8 586.69,9 5.4,10 30,11 74,13 32,14 52,16 82,17 35,20 26,21 9,22 2,24 30,25 9,28 4,29 5,32 44,35 6.8,36 0.037,37 3,38 69,39 74.531,40 82.438,41 51.193,42 49.508,44 5.824}
{0 CHEMBL1241674,1 7.907,2 41,3 41,4 1.009,5 1.135,6 0.674,7 0.653,8 308.38,9 15.4,10 20,11 39,13 20,14 26,16 42,17 16,20 13,21 3,24 16,25 7,28 6,29 1,32 23,35 2.6,36 0.048,37 2,38 36,39 39.356,40 44.275,41 26.296,42 25.477,44 6.194}
{0 CHEMBL124660,1 6.781,2 37.3,3 50.6,4 0.998,5 1.136,6 0.633,7 0.596,8 562.79,9 7.2,10 17,11 83,13 18,14 45,16 87,17 31,20 15,21 16,22 1,24 42,25 10,28 6,29 4,32 41,35 4.8,36 0.115,37 10,38 54.5,39 82.825,40 94.301,41 52.557,42 49.47,44 5}
{0 CHEMBL1287853,1 7.188,2 37,3 49.3,4 0.999,5 1.134,6 0.65,7 0.608,8 524.76,9 8.2,10 18,11 73,13 20,14 40,16 76,17 27,20 16,21 11,22 2,24 36,25 10,26 1,28 6,29 3,31 1,32 37,35 4.1,36 0.145,37 11,38 51,39 72.923,40 82.766,41 47.466,42 44.362,44 5.886}
{0 CHEMBL1289926,1 8.402,2 47.8,3 39.1,4 1,5 1.109,6 0.727,7 0.689,8 386.51,9 8.7,10 22,11 46,13 24,14 31,16 49,17 22,20 21,21 1,22 2,24 18,25 6,26 1,28 4,29 1,31 1,32 28,35 2.2,36 0.102,37 5,38 44,39 45.996,40 51.029,41 33.455,42 31.675,44 5.553}
{0 CHEMBL1336,1 9.685,2 43.8,3 33.3,4 1.048,5 1.144,6 0.691,7 0.696,8 464.86,9 8.3,10 18,11 48,13 20,14 34,16 50,17 21,18 1,20 19,21 2,22 2,23 3,24 16,25 11,26 1,28 4,29 3,32 32,34 4,35 6.3,36 0.1,37 5,38 45,39 50.32,40 54.906,41 33.148,42 33.422,43 8.3,44 5}
{0 CHEMBL1421,1 8.272,2 37.3,3 44.1,4 1.01,5 1.134,6 0.679,7 0.642,8 488.07,9 11.9,10 17,11 59,13 18,14 36,16 62,17 22,18 1,20 14,21 8,22 1,24 26,25 11,26 2,28 7,29 2,31 1,32 33,34 1,35 3.4,36 0.113,37 7,38 45.5,39 59.603,40 66.923,41 40.068,42 37.862,43 1.7,44 6.553}
{0 CHEMBL1614701,1 10.898,2 40.5,3 35.7,4 1.039,5 1.135,6 0.711,7 0.694,8 457.71,9 9.5,10 16,11 42,13 17,14 29,15 1,16 44,17 17,18 1,20 14,21 3,22 1,23 1,24 15,25 10,26 2,28 4,29 3,32 27,34 3,35 7.1,36 0.136,37 6,38 38,39 43.64,40 47.653,41 29.864,42 29.154,43 7.1,44 5}
{0 CHEMBL162,1 7.649,2 45.9,3 42.6,4 1.002,5 1.118,6 0.685,7 0.656,8 466.58,9 6.6,10 24,11 61,13 25,14 42,16 68,17 28,20 19,21 9,22 1,24 26,25 7,28 4,29 3,32 35,35 4.9,36 0.029,37 2,38 55,39 61.109,40 68.189,41 41.762,42 40.025,44 5.553}
{0 CHEMBL1721885,1 7.501,2 39,3 45.8,4 1.014,5 1.138,6 0.643,7 0.621,8 442.54,9 6.8,10 11,11 59,13 14,14 35,16 62,17 23,20 14,21 9,22 3,23 1,24 27,25 9,28 4,29 4,32 32,34 1,35 6.8,36 0.097,37 6,38 43.5,39 59.832,40 67.153,41 37.915,42 36.65,43 1.7,44 6.523}
{0 CHEMBL1789941,1 7.473,2 41.5,3 43.9,4 0.998,5 1.134,6 0.673,7 0.641,8 306.41,9 14.6,10 15,11 41,13 16,14 26,16 44,17 17,19 1,20 9,21 7,24 18,25 6,28 6,32 23,33 1,36 0.091,37 4,38 35.5,39 40.912,40 46.481,41 27.603,42 26.289,44 6.824}
{0 CHEMBL180022,1 8.074,2 43.5,3 42,4 1.008,5 1.124,6 0.687,7 0.658,8 557.1,9 8.7,10 23,11 69,13 26,14 43,16 72,17 30,18 1,19 1,20 23,21 6,22 2,24 29,25 10,26 1,28 6,29 3,32 40,33 1,34 1,35 4.3,36 0.153,37 11,38 58.5,39 69.52,40 77.544,41 47.392,42 45.422,43 1.4,44 6.886}
{0 CHEMBL1908391,1 7.556,2 42.4,3 45.5,4 0.994,5 1.123,6 0.686,7 0.642,8 498.71,9 9.1,10 23,11 66,13 24,14 40,16 70,17 28,20 21,21 7,22 1,24 30,25 8,26 1,28 6,29 1,31 1,32 36,35 1.5,36 0.1,37 7,38 52.5,39 65.618,40 74.102,41 45.273,42 42.352,44 5}
{0 CHEMBL1908392,1 7.189,2 43.3,3 46.3,4 0.995,5 1.124,6 0.669,7 0.633,8 481.65,9 7.5,10 22,11 67,13 24,14 40,16 71,17 29,20 22,21 7,22 2,24 31,25 7,28 5,29 2,32 36,35 3,36 0.085,37 6,38 53,39 66.65,40 75.308,41 44.836,42 42.385,44 7.469}
{0 CHEMBL1908393,1 7.741,2 41.5,3 43.9,4 1.017,5 1.134,6 0.653,7 0.635,8 634.74,9 4.9,10 17,11 82,13 21,14 51,16 87,17 34,20 21,21 13,22 4,23 2,24 36,25 12,28 4,29 6,32 46,34 2,35 7.3,36 0.138,37 12,38 63.5,39 83.418,40 92.987,41 53.569,42 52.097,43 2.4,44 5.319}
{0 CHEMBL1908394,1 8.237,2 40.9,3 42.4,4 1.019,5 1.14,6 0.671,7 0.647,8 543.67,9 7.6,10 21,11 66,13 22,14 42,16 70,17 27,20 18,21 9,22 1,23 3,24 28,25 11,26 1,28 5,29 2,31 1,32 38,34 3,35 3,36 0.1,37 7,38 53.5,39 67.265,40 75.247,41 44.296,42 42.722,43 4.5,44 5}
{0 CHEMBL1908395,1 6.979,2 39.4,3 48.5,4 0.996,5 1.133,6 0.649,7 0.612,8 460.64,9 9.1,10 11,11 66,13 15,14 37,16 69,17 26,19 1,20 13,21 12,22 3,24 32,25 8,28 6,29 2,32 34,33 1,35 3,36 0.087,37 6,38 47.5,39 65.752,40 74.806,41 42.841,42 40.406,44 6.658}
{0 CHEMBL1908396,1 8.286,2 41.4,3 41.4,4 1.016,5 1.123,6 0.682,7 0.657,8 480.59,9 6.9,10 22,11 58,13 23,14 37,16 61,17 24,20 19,21 5,22 1,24 24,25 10,26 1,28 4,29 5,31 1,32 34,35 8.6,36 0.131,37 8,38 49,39 58.956,40 65.112,41 39.557,42 38.115,44 5}
{0 CHEMBL1908397,1 7.388,2 44.4,3 44.4,4 0.996,5 1.123,6 0.679,7 0.645,8 332.44,9 8.9,10 16,11 45,13 18,14 28,16 48,17 20,20 16,21 4,22 2,24 20,25 5,28 4,29 1,32 25,35 2.2,36 0.063,37 3,38 38,39 44.803,40 50.524,41 30.569,42 29.015,44 6.921}
{0 CHEMBL215152,1 7.577,2 38.8,3 44.8,4 1.012,5 1.141,6 0.649,7 0.627,8 507.63,9 10.4,10 22,11 67,13 23,14 40,16 70,17 26,20 18,21 8,22 1,23 1,24 30,25 11,28 7,29 3,32 37,34 1,35 4.5,36 0.186,37 13,38 52,39 67.81,40 76.438,41 43.478,42 41.999,43 1.5,44 5}
{0 CHEMBL2205766,1 8.249,2 35.7,3 42.9,4 1.015,5 1.139,6 0.67,7 0.641,8 346.46,9 14.3,10 16,11 42,13 18,14 26,16 44,17 15,20 11,21 4,22 2,24 18,25 9,26 1,28 6,29 2,31 1,32 24,35 4.8,36 0.091,37 4,38 36,39 42.643,40 47.82,41 28.159,42 26.906,44 5}
{0 CHEMBL221959,1 7.266,2 37.2,3 46.5,4 1.003,5 1.142,6 0.647,7 0.617,8 312.42,9 14,10 10,11 43,13 12,14 25,16 45,17 16,19 1,20 7,21 8,22 1,24 20,25 7,28 6,29 1,32 23,33 1,35 2.3,36 0.067,37 3,38 33,39 43.123,40 49.106,41 27.819,42 26.531,44 5}
{0 CHEMBL223360,1 8.162,2 45.7,3 39.1,4 1.012,5 1.129,6 0.69,7 0.672,8 375.44,9 10.9,10 22,11 46,13 23,14 31,16 49,17 21,20 20,21 1,22 1,23 1,24 18,25 7,28 5,29 1,32 28,34 1,35 2.2,36 0.061,37 3,38 43,39 46.534,40 51.947,41 31.75,42 30.893,43 2.2,44 5}
{0 CHEMBL230011,1 8.659,2 45,3 35,4 1.02,5 1.127,6 0.7,7 0.692,8 346.38,9 15,10 23,11 40,13 23,14 29,16 43,17 18,20 18,24 14,25 8,28 6,29 2,32 26,35 5,36 0.047,37 2,38 40.5,39 40.8,40 45.069,41 27.989,42 27.665,44 5}
{0 CHEMBL2309006,1 8.139,2 48.1,3 38.9,4 1.011,5 1.112,6 0.698,7 0.679,8 439.5,9 5.6,10 24,11 54,13 25,14 40,16 61,17 26,20 19,21 7,22 1,24 21,25 7,28 3,29 4,32 33,35 7.4,36 0.016,37 1,38 53,39 54.567,40 60.069,41 37.688,42 36.665,44 8.222}
{0 CHEMBL2309609,1 7.818,2 47.9,3 41.1,4 1.003,5 1.113,6 0.695,7 0.668,8 570.69,9 5.5,10 30,11 73,13 32,14 51,16 81,17 35,20 26,21 9,22 2,24 30,25 8,28 4,29 4,32 43,35 5.5,36 0.037,37 3,38 68,39 73.203,40 81.228,41 50.739,42 48.793,44 6.678}
{0 CHEMBL24828,1 8.804,2 40.7,3 44.4,4 1.01,5 1.133,6 0.678,7 0.643,8 475.4,9 7.4,10 17,11 54,13 17,14 33,15 1,16 57,17 22,20 14,21 8,23 1,24 24,25 8,26 1,28 4,29 2,32 30,34 2,35 3.7,36 0.105,37 6,38 41.5,39 54.523,40 61.161,41 36.597,42 34.718,43 3.7,44 5}
{0 CHEMBL249697,1 7.093,2 38.9,3 47.2,4 0.995,5 1.138,6 0.655,7 0.619,8 255.36,9 13.9,10 15,11 36,13 15,14 21,16 38,17 14,20 10,21 4,24 17,25 5,28 5,32 19,36 0.079,37 3,38 28.5,39 35.811,40 40.983,41 23.597,42 22.268,44 5}
{0 CHEMBL255863,1 8.681,2 45.9,3 36.1,4 1.025,5 1.139,6 0.691,7 0.685,8 529.57,9 11.5,10 29,11 61,13 30,14 43,16 65,17 28,20 25,21 3,22 1,23 3,24 22,25 11,28 7,29 1,32 39,34 3,35 1.6,36 0.092,37 6,38 58.5,39 62.53,40 69.453,41 42.159,42 41.756,43 4.9,44 5}
{0 CHEMBL259084,1 9.732,2 51,3 30.6,4 1.033,5 1.121,6 0.735,7 0.731,8 476.89,9 8.2,10 24,11 49,13 26,14 38,16 53,17 25,18 1,20 24,21 1,22 2,23 2,24 15,25 9,26 1,28 4,29 2,32 34,34 3,35 4.1,36 0.075,37 4,38 52,39 50.596,40 54.942,41 35.995,42 35.797,43 6.1,44 5}
{0 CHEMBL261849,1 7.479,2 40.8,3 44.9,4 1.007,5 1.13,6 0.658,7 0.632,8 366.46,9 8.2,10 18,11 49,13 18,14 29,16 51,17 20,20 16,21 4,24 22,25 7,28 4,29 3,32 27,35 6.1,36 0.137,37 7,38 38,39 49.342,40 55.358,41 32.239,42 30.971,44 5}
{0 CHEMBL288441,1 8.162,2 40,3 44.6,4 1.01,5 1.129,6 0.677,7 0.642,8 530.5,9 7.7,10 17,11 65,13 18,14 39,16 68,17 26,18 2,19 1,20 15,21 10,24 29,25 10,26 2,28 5,29 3,32 36,33 1,34 2,35 4.6,36 0.132,37 9,38 49.5,39 65.625,40 73.405,41 44.006,42 41.755,43 3.1,44 7.268}
{0 CHEMBL296468,1 7.767,2 34.7,3 49,4 1.001,5 1.131,6 0.67,7 0.615,8 380.59,9 8.2,10 10,11 49,13 11,14 27,16 51,17 17,20 7,21 10,22 1,24 24,25 8,26 2,28 4,29 2,31 2,32 25,35 4.1,36 0.118,37 6,38 33,39 49.051,40 55.404,41 32.841,42 30.157,44 5}
{0 CHEMBL300138,1 7.583,2 47.1,3 42.6,4 0.997,5 1.116,6 0.692,7 0.66,8 515.66,9 7.4,10 26,11 68,13 29,14 45,16 74,17 32,20 25,21 7,22 3,24 29,25 7,28 5,29 2,32 39,35 2.9,36 0.068,37 5,38 61,39 67.767,40 75.893,41 47.074,42 44.858,44 5}
{0 CHEMBL31965,1 8.237,2 40.7,3 42.4,4 1.018,5 1.135,6 0.671,7 0.648,8 485.99,9 8.5,10 17,11 59,13 19,14 37,16 62,17 24,18 1,20 17,21 7,22 2,23 1,24 25,25 10,26 1,28 5,29 3,32 34,34 2,35 5.1,36 0.145,37 9,38 47.5,39 60.047,40 66.971,41 39.563,42 38.257,43 3.4,44 5.638}
{0 CHEMBL377300,1 8.053,2 41.3,3 41.3,4 1.021,5 1.137,6 0.661,7 0.648,8 370.42,9 8.7,10 20,11 46,13 20,14 30,16 49,17 19,20 14,21 5,23 1,24 19,25 8,28 4,29 3,32 27,34 1,35 6.5,36 0.102,37 5,38 40,39 46.971,40 52.283,41 30.415,42 29.828,43 2.2,44 5}
{0 CHEMBL379218,1 7.316,2 44.9,3 44.9,4 0.994,5 1.121,6 0.68,7 0.644,8 358.48,9 8.2,10 22,11 49,13 22,14 30,16 52,17 22,20 18,21 4,24 22,25 5,28 4,29 1,32 27,35 2,36 0.115,37 6,38 41,39 48.687,40 54.939,41 33.33,42 31.542,44 5}
{0 CHEMBL384304,1 8.657,2 35.3,3 41.2,4 1.037,5 1.15,6 0.651,7 0.64,8 441.51,9 9.8,10 12,11 51,13 15,14 32,16 53,17 18,20 11,21 7,22 3,23 2,24 21,25 12,26 1,28 5,29 4,31 1,32 30,34 2,35 7.8,36 0.113,37 6,38 41,39 52.872,40 58.665,41 33.222,42 32.661,43 3.9,44 5}
{0 CHEMBL386051,1 9.853,2 46.7,3 35.6,4 1.014,5 1.109,6 0.759,7 0.718,8 443.38,9 8.9,10 18,11 45,13 20,14 32,16 48,17 21,18 2,20 19,21 2,22 2,24 16,25 8,26 3,28 4,29 1,31 1,32 29,34 2,35 2.2,36 0.083,37 4,38 43,39 45.644,40 49.917,41 34.171,42 32.33,43 4.4,44 6.367}
{0 CHEMBL428690,1 8.372,2 43.8,3 41.7,4 1.019,5 1.118,6 0.682,7 0.66,8 401.87,9 2.1,10 12,11 48,13 14,14 31,16 51,17 21,18 1,20 15,21 6,22 2,24 20,25 7,26 1,28 1,29 5,32 28,34 1,35 10.4,36 0.039,37 2,38 39,39 48.898,40 53.641,41 32.75,42 31.691,43 2.1,44 5.004}
{0 CHEMBL445813,1 9.102,2 38.1,3 40.5,4 1.024,5 1.136,6 0.69,7 0.664,8 382.28,9 11.9,10 11,11 42,13 13,14 27,16 44,17 16,18 2,20 11,21 5,22 2,24 17,25 9,26 2,28 5,29 2,32 25,34 2,35 4.8,36 0.091,37 4,38 34.5,39 42.996,40 47.705,41 28.983,42 27.879,43 4.8,44 5}
{0 CHEMBL450786,1 8.333,2 41.6,3 44.2,4 1.008,5 1.121,6 0.693,7 0.652,8 641.67,9 5.2,10 17,11 77,13 22,14 48,16 82,17 32,18 2,20 20,21 12,22 5,24 34,25 11,26 3,28 4,29 4,31 1,32 43,34 2,35 5.2,36 0.085,37 7,38 61.5,39 77.578,40 86.282,41 53.387,42 50.216,43 2.6,44 5.229}
{0 CHEMBL464552,1 7.833,2 39.7,3 42.6,4 1.015,5 1.14,6 0.658,7 0.64,8 532.64,9 11.8,10 22,11 68,13 24,14 43,16 72,17 27,20 20,21 7,22 2,23 1,24 29,25 12,28 8,29 3,32 39,34 1,35 4.4,36 0.111,37 8,38 56,39 69.029,40 77.522,41 44.722,42 43.494,43 1.5,44 5}
{0 CHEMBL475251,1 8.255,2 38.6,3 40.4,4 1.03,5 1.142,6 0.651,7 0.646,8 470.51,9 10.5,10 18,11 57,13 19,14 37,16 60,17 22,20 16,21 6,22 1,23 1,24 23,25 12,28 6,29 5,32 34,34 1,35 8.8,36 0.117,37 7,38 47,39 58.712,40 65.113,41 37.097,42 36.827,43 1.8,44 6.824}
{0 CHEMBL477772,1 8.103,2 38.9,3 42.6,4 1.009,5 1.132,6 0.679,7 0.648,8 437.58,9 13,10 22,11 54,13 24,14 34,16 57,17 21,20 17,21 4,22 2,24 23,25 10,26 1,28 7,29 2,31 1,32 31,35 3.7,36 0.088,37 5,38 47,39 54.512,40 61.149,41 36.688,42 34.981,44 5}
{0 CHEMBL491473,1 7.509,2 41.7,3 45,4 1.008,5 1.132,6 0.658,7 0.632,8 450.56,9 6.7,10 21,11 60,13 21,14 37,16 64,17 25,20 16,21 9,23 1,24 27,25 8,28 4,29 3,32 33,34 1,35 5,36 0.125,37 8,38 47.5,39 60.505,40 67.944,41 39.461,42 37.935,43 1.7,44 5}
{0 CHEMBL494089,1 7.337,2 36.2,3 46.6,4 1.009,5 1.143,6 0.638,7 0.613,8 425.55,9 12.1,10 15,11 58,13 16,14 34,16 61,17 21,19 2,20 8,21 11,24 27,25 10,28 7,29 3,32 31,33 1,35 5.2,36 0.082,37 5,38 43.5,39 58.531,40 66.268,41 37.017,42 35.562,44 6.056}
{0 CHEMBL509032,1 7.491,2 36.6,3 48.8,4 1.001,5 1.135,6 0.657,7 0.613,8 614.29,9 8.5,10 18,11 82,13 20,14 46,16 86,17 30,18 1,20 16,21 14,22 2,24 40,25 12,26 2,28 7,29 3,31 1,32 42,34 1,35 3.7,36 0.105,37 9,38 57,39 82.116,40 93.039,41 53.853,42 50.264,43 1.2,44 6.495}
{0 CHEMBL513909,1 6.776,2 36.4,3 50.6,4 0.998,5 1.14,6 0.631,7 0.594,8 521.74,9 9.1,10 12,11 77,13 14,14 42,16 81,17 28,20 12,21 16,22 2,24 39,25 10,28 7,29 3,32 38,35 3.9,36 0.086,37 7,38 50,39 76.832,40 87.76,41 48.586,42 45.723,44 5}
{0 CHEMBL521851,1 8.286,2 37.1,3 43.5,4 1.011,5 1.131,6 0.682,7 0.644,8 513.71,9 11.3,10 20,11 62,13 22,14 40,16 67,17 23,20 13,21 10,22 2,24 27,25 12,26 2,28 7,29 3,31 2,32 35,35 4.8,36 0.075,37 5,38 52,39 62.683,40 70.108,41 42.313,42 39.936,44 5}
{0 CHEMBL522892,1 7.85,2 42,3 42,4 1.01,5 1.137,6 0.67,7 0.649,8 392.48,9 12,10 16,11 50,13 18,14 33,16 54,17 21,20 16,21 5,22 2,23 1,24 21,25 8,28 6,29 1,32 29,34 1,35 2,36 0.037,37 2,38 43,39 50.52,40 56.861,41 33.517,42 32.441,43 2,44 5}
{0 CHEMBL525191,1 7.777,2 44.2,3 41.9,4 1.006,5 1.124,6 0.681,7 0.656,8 334.41,9 9.3,10 17,11 43,13 18,14 28,16 46,17 19,20 15,21 4,22 1,24 18,25 6,28 4,29 2,32 25,35 4.7,36 0.087,37 4,38 37.5,39 43.247,40 48.318,41 29.262,42 28.203,44 5}
{0 CHEMBL535,1 7.117,2 39.3,3 48.2,4 1.003,5 1.138,6 0.643,7 0.611,8 398.53,9 7.1,10 11,11 56,13 14,14 31,16 58,17 22,20 14,21 8,22 3,23 1,24 27,25 7,28 4,29 2,32 29,34 1,35 3.6,36 0.121,37 7,38 39.5,39 56.178,40 63.734,41 36.006,42 34.22,43 1.8,44 6.658}
{0 CHEMBL553,1 7.567,2 42.3,3 44.2,4 1.009,5 1.125,6 0.662,7 0.638,8 393.48,9 5.8,10 17,11 52,13 18,14 31,16 54,17 22,19 2,20 14,21 6,24 23,25 7,28 3,29 4,32 29,33 1,35 7.7,36 0.185,37 10,38 41.5,39 52.451,40 58.485,41 34.449,42 33.191,44 5.638}
{0 CHEMBL554,1 8.805,2 43.9,3 39.4,4 1.019,5 1.121,6 0.703,7 0.677,8 581.11,9 6.1,10 28,11 66,13 30,14 44,16 70,17 29,18 1,20 24,21 5,22 2,23 1,24 26,25 11,26 2,28 4,29 4,31 1,32 40,34 2,35 6.1,36 0.157,37 11,38 60,39 67.232,40 74.017,41 46.421,42 44.664,43 3,44 5}
{0 CHEMBL558752,1 9.782,2 45.3,3 30.2,4 1.058,5 1.161,6 0.683,7 0.705,8 518.46,9 11.3,10 27,11 53,13 27,14 41,16 57,17 24,20 21,21 3,23 6,24 16,25 13,28 6,29 1,32 37,34 6,35 1.9,36 0.088,37 5,38 54.5,39 56.083,40 61.559,41 36.205,42 37.357,43 11.3,44 5}
{0 CHEMBL572878,1 7.617,2 37.7,3 45.9,4 1.001,5 1.136,6 0.668,7 0.629,8 464.66,9 13.1,10 17,11 61,13 18,14 37,16 65,17 23,20 14,21 9,22 1,24 28,25 10,26 1,28 8,29 1,31 1,32 33,35 1.6,36 0.108,37 7,38 46.5,39 61.054,40 69.268,41 40.762,42 38.341,44 5.721}
{0 CHEMBL572881,1 7.324,2 43.1,3 45.1,4 0.996,5 1.126,6 0.673,7 0.638,8 373.5,9 9.8,10 18,11 51,13 19,14 31,16 54,17 22,20 17,21 5,22 1,24 23,25 6,28 5,29 1,32 28,35 2,36 0.093,37 5,38 41,39 50.789,40 57.438,41 34.336,42 32.563,44 5.678}
{0 CHEMBL573339,1 8.295,2 45.2,3 38.1,4 1.016,5 1.122,6 0.689,7 0.676,8 348.39,9 9.5,10 21,11 42,13 21,14 30,16 46,17 19,20 15,21 4,24 16,25 7,28 4,29 3,32 26,35 7.1,36 0.043,37 2,38 40.5,39 42.691,40 47.113,41 28.955,42 28.391,44 5}
{0 CHEMBL574738,1 7.789,2 38.2,3 44.1,4 1.02,5 1.152,6 0.642,7 0.626,8 529.63,9 10.3,10 18,11 68,13 19,14 41,16 71,17 26,20 17,21 9,22 1,23 3,24 30,25 12,28 7,29 2,32 38,34 3,35 2.9,36 0.113,37 8,38 51,39 69.392,40 78.324,41 43.66,42 42.578,43 4.4,44 5}
{0 CHEMBL576982,1 7.788,2 40.3,3 44.4,4 1.007,5 1.127,6 0.672,7 0.639,8 560.74,9 8.3,10 25,11 72,13 26,14 45,16 77,17 29,20 19,21 10,22 1,24 32,25 11,26 1,28 6,29 4,31 1,32 40,35 5.6,36 0.104,37 8,38 58.5,39 72.483,40 81.145,41 48.398,42 46.023,44 5}
{0 CHEMBL583042,1 9.266,2 44.4,3 37,4 1.024,5 1.127,6 0.712,7 0.691,8 500.39,9 9.3,10 23,11 54,13 24,14 37,16 57,17 24,18 2,20 21,21 3,22 1,23 1,24 20,25 10,26 2,28 5,29 2,32 34,34 3,35 3.7,36 0.123,37 7,38 49.5,39 55.276,40 60.875,41 38.443,42 37.316,43 5.6,44 5.398}
{0 CHEMBL601719,1 8.661,2 40.4,3 42.3,4 1.016,5 1.136,6 0.688,7 0.656,8 450.38,9 9.6,10 17,11 52,13 17,14 33,16 55,17 21,18 2,20 14,21 7,23 1,24 22,25 9,26 2,28 5,29 1,32 30,34 3,35 1.9,36 0.091,37 5,38 41.5,39 52.832,40 59.081,41 35.75,42 34.128,43 5.8,44 6.959}
{0 CHEMBL608154,1 8.947,2 46.3,3 36.6,4 1.017,5 1.118,6 0.716,7 0.695,8 366.83,9 9.8,10 21,11 41,13 22,14 29,16 44,17 19,18 1,20 17,21 2,22 1,24 15,25 7,26 1,28 4,29 2,32 26,34 1,35 4.9,36 0.068,37 3,38 40.5,39 41.687,40 45.847,41 29.358,42 28.504,43 2.4,44 5}
{0 CHEMBL91829,1 7.438,2 44.4,3 44.4,4 1,5 1.121,6 0.675,7 0.644,8 468.6,9 6.3,10 20,11 63,13 23,14 40,16 68,17 28,20 20,21 8,22 3,24 28,25 7,28 4,29 3,32 35,35 4.8,36 0.029,37 2,38 53,39 62.992,40 70.604,41 42.523,42 40.552,44 6.77}
{0 CHEMBL939,1 8.126,2 40,3 43.6,4 1.017,5 1.136,6 0.665,7 0.641,8 446.95,9 7.3,10 17,11 55,13 17,14 34,16 58,17 22,18 1,20 14,21 8,23 1,24 24,25 9,26 1,28 4,29 3,32 31,34 2,35 5.5,36 0.138,37 8,38 42.5,39 55.945,40 62.472,41 36.557,42 35.236,43 3.6,44 5.678}
{0 CHEMBL941,1 7.26,2 42.6,3 45.6,4 0.995,5 1.128,6 0.671,7 0.635,8 493.67,9 10.3,10 24,11 68,13 25,14 41,16 72,17 29,20 22,21 7,22 1,24 31,25 8,28 7,29 1,32 37,35 1.5,36 0.097,37 7,38 54,39 67.643,40 76.68,41 45.631,42 43.186,44 5}
