"molecule_id","ATS6i","ATSC5v","ATSC6v","ATSC7p","CIC2","AAC","AECC","ALOGP","ALOGP2","AMR","AMW","ARR","ATS1e","ATS1i","ATS1m","ATS1p","ATS1s","ATS1v","ATS2e","ATS2i","ATS2m","ATS2p","ATS2s","ATS2v","ATS3e","ATS3i","ATS3m","ATS3p","ATS3s","ATS3v","ATS4e","ATS4i","ATS4m","ATS4p","ATS4s","ATS4v","ATS5e","ATS5i","ATS5m","ATS5p","ATS5s","ATS5v","ATS6e","ATS6m","ATS6p","ATS6s","ATS6v","ATS7e","ATS7i","ATS7m","ATS7p","ATS7s","ATS7v","ATS8e","ATS8i","ATS8m","ATS8p","ATS8s","ATS8v","ATSC1e","ATSC1i","ATSC1m","ATSC1p","ATSC1s","ATSC1v","ATSC2e","ATSC2i","ATSC2m","ATSC2p","ATSC2s","ATSC2v","ATSC3e","ATSC3i","ATSC3m","ATSC3p","ATSC3s","ATSC3v","ATSC4e","ATSC4i","ATSC4m","ATSC4p","ATSC4s","ATSC4v","ATSC5e","ATSC5i","ATSC5m","ATSC5p","ATSC5s","ATSC6e","ATSC6i","ATSC6m","ATSC6p","ATSC6s","ATSC7e","ATSC7i","ATSC7m","ATSC7s","ATSC7v","ATSC8e","ATSC8i","ATSC8m","ATSC8p","ATSC8s","ATSC8v","BAC","BBI","BIC0","BIC1","BIC2","BIC3","BIC4","BIC5","BID","BLI","BLTA96","BLTD48","BLTF96","C.","C.001","pXC50"
{1 4.055,2 7.001,3 5.729,4 4.287,5 1.05,6 1.337,7 6.471,8 2.765,9 7.646,10 68.135,11 7.041,12 0.5,13 3.591,14 3.699,15 3.154,16 3.198,17 4.532,18 3.164,19 4.179,20 4.34,21 3.542,22 3.647,23 5.06,24 3.591,25 4.448,26 4.671,27 3.458,28 3.732,29 5.233,30 3.614,31 4.362,32 4.61,33 3.196,34 3.521,35 5.12,36 3.376,37 4.081,38 4.328,39 3.018,40 3.271,41 4.834,42 3.158,43 3.858,44 2.881,45 3.211,46 4.66,47 3.088,48 3.85,49 4.097,50 2.635,51 3.116,52 4.554,53 2.936,54 3.7,55 4,56 1.988,57 2.794,58 4.29,59 2.53,60 0.025,61 0.434,62 7.022,63 3.162,64 4.549,65 4.182,66 0.088,67 0.782,68 13.588,69 5.517,70 9.823,71 7.432,72 0.141,73 0.974,74 18.975,75 7.646,76 16.041,77 10.453,78 0.208,79 0.853,80 18.137,81 7.111,82 16.566,83 9.688,84 0.148,85 0.644,86 13.758,87 5.207,88 12.546,89 0.093,90 0.531,91 10.28,92 4.279,93 9.803,94 0.054,95 0.547,96 10.267,97 7.378,98 6.144,99 0.055,100 0.449,101 9.28,102 3.822,103 7.197,104 5.554,106 29,107 0.25,108 0.585,109 0.737,110 0.805,111 0.817,112 0.817,113 2.911,114 0.952,115 -3.69,116 -3.66,117 -3.48,118 46.9,120 6}
{0 CHEMBL2094001,1 4.571,2 10.737,3 9.835,4 6.144,5 1.122,6 1.364,7 8.8,8 2.394,9 5.732,10 80.266,11 6.619,12 0.261,13 3.819,14 3.933,15 3.318,16 3.356,17 4.693,18 3.32,19 4.454,20 4.626,21 3.679,22 3.797,23 5.313,24 3.735,25 4.679,26 4.908,27 3.565,28 3.925,29 5.42,30 3.783,31 4.663,32 4.941,33 3.344,34 3.775,35 5.353,36 3.599,37 4.43,38 4.693,39 3.245,40 3.62,41 5.138,42 3.465,43 4.315,44 3.122,45 3.54,46 5.028,47 3.372,48 4.249,49 4.532,50 2.896,51 3.363,52 4.899,53 3.178,54 3.972,55 4.235,56 2.765,57 3.093,58 4.605,59 2.936,60 0.03,61 0.567,62 9.857,63 4.263,64 4.238,65 5.717,66 0.313,67 0.988,68 19.825,69 7.17,70 18.776,71 9.824,72 0.186,73 1.198,74 24.46,75 9.673,76 20.094,77 13.599,78 0.202,79 1.099,80 24.423,81 9.391,82 21.505,83 13.39,84 0.155,85 0.893,86 19.155,87 7.579,88 16.031,89 0.089,90 0.831,91 16.759,92 6.82,93 13.68,94 0.127,95 0.732,96 16.022,97 12.774,98 8.874,99 0.066,100 0.548,101 12.038,102 4.7,103 7.36,104 6.67,106 32,107 0.244,108 0.559,109 0.758,110 0.776,111 0.776,112 0.776,113 3.058,114 0.997,115 -4.11,116 -4.05,117 -3.84,118 41.5,120 6}
{0 CHEMBL258503,1 4.962,2 15.337,3 14.004,4 11.197,5 1.27,6 1.406,7 11.567,8 3.494,9 12.205,10 119.138,11 6.776,12 0.364,13 4.174,14 4.29,15 3.665,16 3.704,17 5.173,18 3.668,19 4.761,20 4.94,21 4.002,22 4.109,23 5.707,24 4.049,25 5.028,26 5.247,27 4.032,28 4.26,29 5.953,30 4.153,31 5.039,32 5.297,33 3.858,34 4.168,35 5.923,36 4.028,37 4.844,38 5.09,39 3.847,40 4.057,41 5.78,42 3.953,43 4.766,44 3.968,45 4.087,46 5.796,47 4.014,48 4.87,49 5.068,50 3.97,51 4.165,52 5.829,53 4.073,54 4.96,55 5.191,56 3.908,57 4.169,58 5.857,59 4.048,60 0.048,61 0.818,62 13.79,63 5.983,64 11.066,65 7.961,66 0.298,67 1.367,68 26.411,69 9.812,70 29.446,71 13.441,72 0.368,73 1.708,74 35.042,75 12.906,76 44.281,77 18.064,78 0.462,79 1.636,80 36.181,81 13.062,82 50.651,83 18.569,84 0.268,85 1.388,86 29.321,87 10.869,88 44.516,89 0.301,90 1.354,91 26.557,92 10.111,93 42.664,94 0.265,95 1.508,96 29.463,97 37.183,98 15.473,99 0.364,100 1.591,101 32.72,102 12.074,103 44.038,104 17.154,105 10,106 45,107 0.229,108 0.557,109 0.754,110 0.837,111 0.845,112 0.845,113 3.44,114 0.981,115 -4.44,116 -4.37,117 -4.12,118 41.7,120 7.481}
{0 CHEMBL258717,1 5.09,2 17.893,3 16.069,4 12.212,5 1.339,6 1.449,7 10.844,8 2.946,9 8.681,10 125.902,11 6.883,12 0.333,13 4.24,14 4.358,15 3.745,16 3.766,17 5.242,18 3.736,19 4.839,20 5.017,21 4.137,22 4.207,23 5.781,24 4.158,25 5.151,26 5.362,27 4.193,28 4.376,29 6.136,30 4.278,31 5.171,32 5.431,33 4.002,34 4.303,35 6.062,36 4.168,37 5.018,38 5.273,39 3.982,40 4.201,41 5.98,42 4.09,43 4.884,44 4.068,45 4.207,46 5.888,47 4.126,48 4.984,49 5.191,50 4.073,51 4.279,52 5.941,53 4.184,54 5.057,55 5.287,56 4.032,57 4.291,58 5.967,59 4.172,60 0.059,61 0.901,62 14.494,63 6.108,64 15.215,65 8.209,66 0.268,67 1.547,68 28.062,69 10.208,70 30.143,71 14.178,72 0.625,73 1.952,74 39.659,75 13.994,76 63.641,77 19.766,78 0.408,79 1.904,80 41.157,81 14.465,82 60.383,83 20.91,84 0.459,85 1.655,86 35.296,87 12.415,88 65.095,89 0.234,90 1.551,91 29.473,92 11.445,93 42.224,94 0.295,95 1.723,96 32.767,97 42.17,98 17.212,99 0.321,100 1.784,101 35.667,102 13.345,103 49.021,104 19.04,105 11,106 52,107 0.233,108 0.559,109 0.745,110 0.839,111 0.856,112 0.856,113 3.503,114 0.96,115 -3.87,116 -3.83,117 -3.64,118 41.3,120 7.886}
{0 CHEMBL259665,1 4.505,2 9.458,3 9.245,4 5.565,5 1.125,6 1.387,7 8.579,8 2.374,9 5.638,10 75.692,11 6.773,12 0.286,13 3.722,14 3.838,15 3.223,16 3.276,17 4.701,18 3.236,19 4.312,20 4.493,21 3.569,22 3.693,23 5.278,24 3.624,25 4.568,26 4.797,27 3.567,28 3.826,29 5.443,30 3.711,31 4.51,32 4.741,33 3.385,34 3.687,35 5.482,36 3.557,37 4.369,38 4.61,39 3.214,40 3.556,41 5.279,42 3.421,43 4.247,44 2.971,45 3.452,46 5.005,47 3.267,48 4.142,49 4.441,50 2.775,51 3.173,52 4.887,53 2.985,54 3.785,55 4.024,56 2.777,57 2.776,58 4.816,59 2.714,60 0.02,61 0.517,62 8.622,63 3.847,64 4.342,65 5.141,66 0.233,67 0.878,68 16.66,69 6.409,70 22.054,71 8.858,72 0.169,73 1.072,74 21.849,75 8.532,76 22.914,77 11.906,78 0.192,79 0.964,80 20.926,81 7.964,82 35.59,83 10.965,84 0.203,85 0.842,86 18.256,87 6.801,88 30.473,89 0.08,90 0.769,91 15.656,92 6.447,93 14.203,94 0.089,95 0.634,96 14.588,97 17.579,98 8.046,99 0.231,100 0.413,101 10.635,102 3.361,103 17.453,104 4.54,105 8,106 29,107 0.253,108 0.577,109 0.751,110 0.77,111 0.789,112 0.789,113 3.01,114 1.001,115 -4.18,116 -4.13,117 -3.9,118 42.1,119 1,120 6.745}
{0 CHEMBL279261,1 4.72,2 14.125,3 11.453,4 5.858,5 1.733,6 1.274,7 8.667,8 3.136,9 9.836,10 85.869,11 6.653,12 0.5,13 3.826,14 3.945,15 3.319,16 3.438,17 4.777,18 3.383,19 4.411,20 4.581,21 3.717,22 3.894,23 5.291,24 3.817,25 4.769,26 4.984,27 3.785,28 4.076,29 5.651,30 3.953,31 4.822,32 5.076,33 3.58,34 3.994,35 5.683,36 3.831,37 4.696,38 4.976,39 3.358,40 3.836,41 5.495,42 3.654,43 4.432,44 3.065,45 3.6,46 5.11,47 3.397,48 4.122,49 4.402,50 2.909,51 3.31,52 4.861,53 3.139,54 3.912,55 4.132,56 2.956,57 3.207,58 4.828,59 3.094,60 0.05,61 0.561,62 9.704,63 4.282,64 7.995,65 5.84,66 0.114,67 1.003,68 18.007,69 7.368,70 11.65,71 10.281,72 0.243,73 1.345,74 26.57,75 10.754,76 27.793,77 14.898,78 0.23,79 1.359,80 28.51,81 11.402,82 36.407,83 15.788,84 0.21,85 1.193,86 25.24,87 10.047,88 33.755,89 0.104,90 0.934,91 18.965,92 7.974,93 16.528,94 0.075,95 0.673,96 13.881,97 14.531,98 8.299,99 0.083,100 0.556,101 11.189,102 4.525,103 15.407,104 6.224,105 2,106 35,107 0.225,108 0.515,109 0.645,110 0.754,111 0.791,112 0.791,113 3.104,114 0.983,115 -4.57,116 -4.49,117 -4.23,118 45.2,120 7.886}
{0 CHEMBL344327,1 4.031,2 8.254,3 6.354,4 4.325,5 1.05,6 1.337,7 6.471,8 3.323,9 11.045,10 74.578,11 7.543,12 0.5,13 3.577,14 3.685,15 3.262,16 3.291,17 4.47,18 3.203,19 4.163,20 4.325,21 3.686,22 3.764,23 4.979,24 3.641,25 4.431,26 4.653,27 3.62,28 3.86,29 5.147,30 3.67,31 4.336,32 4.584,33 3.416,34 3.688,35 5.004,36 3.451,37 4.053,38 4.297,39 3.165,40 3.434,41 4.721,42 3.223,43 3.838,44 2.906,45 3.282,46 4.595,47 3.111,48 3.85,49 4.097,50 2.635,51 3.116,52 4.554,53 2.936,54 3.7,55 4,56 1.988,57 2.794,58 4.29,59 2.53,60 0.032,61 0.42,62 7.23,63 3.22,64 4.557,65 4.314,66 0.087,67 0.792,68 14.591,69 5.959,70 8.049,71 7.826,72 0.11,73 1.028,74 21.992,75 8.875,76 11.755,77 11.366,78 0.11,79 0.95,80 23.315,81 8.919,82 11.458,83 10.99,84 0.081,85 0.72,86 18.504,87 6.968,88 8.385,89 0.052,90 0.557,91 12.839,92 5.112,93 6.957,94 0.057,95 0.552,96 10.125,97 7.387,98 6.118,99 0.051,100 0.47,101 9.546,102 4.03,103 6.808,104 5.63,106 29,107 0.25,108 0.585,109 0.737,110 0.805,111 0.817,112 0.817,113 2.911,114 1.075,115 -4.57,116 -4.49,117 -4.23,118 46.9,120 6}
{0 CHEMBL391926,1 4.27,2 9.494,3 7.171,4 5.086,5 0.983,6 1.298,7 8.5,8 2.509,9 6.294,10 74.039,11 6.523,12 0.3,13 3.689,14 3.813,15 3.155,16 3.272,17 4.645,18 3.216,19 4.283,20 4.469,21 3.482,22 3.708,23 5.126,24 3.615,25 4.614,26 4.864,27 3.475,28 3.861,29 5.39,30 3.707,31 4.57,32 4.851,33 3.175,34 3.684,35 5.335,36 3.486,37 4.331,38 4.623,39 2.99,40 3.407,41 5.142,42 3.234,43 4.033,44 2.959,45 3.296,46 4.929,47 3.159,48 4.023,49 4.265,50 2.916,51 3.303,52 4.836,53 3.148,54 4.012,55 4.287,56 2.662,57 3.184,58 4.716,59 2.986,60 0.046,61 0.5,62 8.691,63 3.746,64 6.472,65 5.152,66 0.12,67 0.885,68 16.221,69 6.366,70 14.109,71 9.049,72 0.214,73 1.158,74 22.871,75 8.934,76 21.246,77 12.915,78 0.153,79 1.03,80 21.974,81 8.814,82 22.731,83 12.536,84 0.161,85 0.775,86 17.516,87 6.768,88 26.539,89 0.098,90 0.621,91 12.713,92 5.128,93 20.867,94 0.069,95 0.64,96 12.408,97 14.247,98 7.313,99 0.072,100 0.607,101 12.34,102 5.028,103 10.535,104 7.265,105 3,106 27,107 0.238,108 0.581,109 0.774,110 0.851,111 0.865,112 0.865,113 2.96,114 1.017,115 -4.03,116 -3.98,117 -3.77,118 43.2,120 6}
{0 CHEMBL442578,1 4.003,2 7.505,3 5.502,4 4.827,5 1.129,6 1.412,7 8,8 1.941,9 3.767,10 70.99,11 6.952,12 0.3,13 3.657,14 3.769,15 3.163,16 3.212,17 4.707,18 3.179,19 4.227,20 4.397,21 3.557,22 3.653,23 5.24,24 3.597,25 4.573,26 4.787,27 3.542,28 3.797,29 5.59,30 3.682,31 4.517,32 4.793,33 3.133,34 3.566,35 5.42,36 3.391,37 4.116,38 4.391,39 2.964,40 3.234,41 5.095,42 3.106,43 3.829,44 3.021,45 3.19,46 4.925,47 3.108,48 4.009,49 4.23,50 2.94,51 3.265,52 4.883,53 3.132,54 4.03,55 4.299,56 2.731,57 3.117,58 4.985,59 2.936,60 0.046,61 0.475,62 7.908,63 3.468,64 11.264,65 4.51,66 0.085,67 0.831,68 14.647,69 5.842,70 18.175,71 7.976,72 0.241,73 1.067,74 21.963,75 8.333,76 41.968,77 11.421,78 0.224,79 0.936,80 21.719,81 7.946,82 42.896,83 11.186,84 0.15,85 0.623,86 14.475,87 5.373,88 35.048,89 0.06,90 0.521,91 9.914,92 4.121,93 20.642,94 0.088,95 0.617,96 12.231,97 17.053,98 6.738,99 0.185,100 0.591,101 13.054,102 4.887,103 32.921,104 7.057,105 5,106 29,107 0.262,108 0.618,109 0.742,110 0.792,111 0.792,112 0.792,113 2.96,114 0.964,115 -3.21,116 -3.2,117 -3.07,118 42.9,120 6}
{0 CHEMBL443678,1 4.4,2 9.341,3 8.422,4 6.826,5 1.076,6 1.425,7 10.227,8 2.413,9 5.82,10 85.572,11 6.963,12 0.25,13 3.847,14 3.957,15 3.354,16 3.384,17 4.885,18 3.353,19 4.436,20 4.609,21 3.732,22 3.8,23 5.483,24 3.748,25 4.729,26 4.943,27 3.758,28 3.946,29 5.756,30 3.85,31 4.689,32 4.93,33 3.5,34 3.773,35 5.745,36 3.65,37 4.409,38 4.643,39 3.302,40 3.55,41 5.473,42 3.444,43 4.207,44 3.295,45 3.535,46 5.258,47 3.427,48 4.34,49 4.589,50 3.181,51 3.541,52 5.23,53 3.391,54 4.233,55 4.511,56 2.96,57 3.375,58 4.974,59 3.199,60 0.024,61 0.576,62 9.546,63 4.314,64 9.844,65 5.585,66 0.237,67 0.983,68 18.601,69 7.132,70 30.767,71 9.648,72 0.275,73 1.228,74 25.871,75 9.681,76 45.433,77 13.212,78 0.299,79 1.097,80 25.743,81 9.144,82 60.21,83 12.466,84 0.279,85 0.825,86 19.468,87 6.969,88 52.398,89 0.069,90 0.757,91 14.617,92 6.207,93 27.367,94 0.119,95 0.838,96 17.403,97 27.281,98 9.692,99 0.094,100 0.734,101 15.821,102 6.165,103 19.04,104 8.938,105 13,106 34,107 0.251,108 0.601,109 0.767,110 0.806,111 0.806,112 0.806,113 3.146,114 0.982,115 -3.86,116 -3.82,117 -3.62,118 41.9,119 1,120 5.372}
{0 CHEMBL445817,1 3.975,2 6.864,3 5.119,4 3.958,5 0.955,6 1.429,7 7.294,8 1.058,9 1.119,10 67.139,11 6.919,12 0.316,13 3.597,14 3.719,15 3.115,16 3.155,17 4.606,18 3.12,19 4.183,20 4.367,21 3.486,22 3.591,23 5.139,24 3.532,25 4.502,26 4.728,27 3.461,28 3.729,29 5.459,30 3.607,31 4.435,32 4.719,33 3.059,34 3.49,35 5.3,36 3.312,37 4.035,38 4.307,39 2.896,40 3.167,41 4.981,42 3.04,43 3.79,44 2.978,45 3.115,46 4.873,47 3.032,48 3.946,49 4.19,50 2.884,51 3.146,52 4.84,53 3.023,54 3.88,55 4.168,56 2.416,57 2.95,58 4.623,59 2.748,60 0.034,61 0.478,62 7.409,63 3.111,64 8.608,65 4.248,66 0.107,67 0.823,68 14.167,69 5.211,70 16.067,71 7.403,72 0.217,73 1.018,74 20.418,75 7.608,76 32.049,77 10.734,78 0.188,79 0.863,80 19.904,81 7.258,82 32.348,83 10.375,84 0.135,85 0.577,86 13.264,87 4.901,88 28.077,89 0.119,90 0.516,91 9.686,92 3.681,93 21.152,94 0.133,95 0.607,96 11.706,97 15.743,98 5.832,99 0.103,100 0.531,101 11.204,102 3.824,103 14.721,104 5.792,105 2,106 27,107 0.269,108 0.624,109 0.768,110 0.823,111 0.823,112 0.823,113 2.909,114 0.97,115 -2.68,116 -2.7,117 -2.63,118 42.4,120 6}
{0 CHEMBL453439,1 4.614,2 11.689,3 10.41,4 6.744,5 1.425,6 1.271,7 10.273,8 3.737,9 13.967,10 90.492,11 6.777,12 0.48,13 3.848,14 3.964,15 3.365,16 3.459,17 4.802,18 3.409,19 4.416,20 4.585,21 3.696,22 3.875,23 5.299,24 3.798,25 4.693,26 4.916,27 3.667,28 3.994,29 5.488,30 3.862,31 4.656,32 4.913,33 3.419,34 3.842,35 5.399,36 3.675,37 4.492,38 4.758,39 3.358,40 3.717,41 5.24,42 3.567,43 4.368,44 3.244,45 3.638,46 5.15,47 3.483,48 4.268,49 4.525,50 3.069,51 3.458,52 5.041,53 3.294,54 4.036,55 4.289,56 2.857,57 3.206,58 4.784,59 3.062,60 0.041,61 0.562,62 9.647,63 4.3,64 6.585,65 5.826,66 0.133,67 0.982,68 17.975,69 7.289,70 14.652,71 9.964,72 0.164,73 1.248,74 24.37,75 10.063,76 21.19,77 13.926,78 0.176,79 1.164,80 24.024,81 9.841,82 22.05,83 13.636,84 0.14,85 1.002,86 20.314,87 8.315,88 18.187,89 0.107,90 0.89,91 17.625,92 7.437,93 16.171,94 0.163,95 0.776,96 16.272,97 16.064,98 9.344,99 0.118,100 0.606,101 13.016,102 5.164,103 12.511,104 7.005,106 34,107 0.222,108 0.526,109 0.699,110 0.782,111 0.793,112 0.793,113 3.146,114 0.974,115 -4.99,116 -4.89,117 -4.58,118 46.5,120 7}
{0 CHEMBL477079,1 4.669,2 12.938,3 10.408,4 7.509,5 0.873,6 1.384,7 12.208,8 2.748,9 7.55,10 94.863,11 6.683,12 0.231,13 3.964,14 4.08,15 3.433,16 3.497,17 4.967,18 3.455,19 4.561,20 4.745,21 3.765,22 3.914,23 5.513,24 3.837,25 4.858,26 5.09,27 3.775,28 4.077,29 5.737,30 3.952,31 4.834,32 5.086,33 3.611,34 3.971,35 5.759,36 3.816,37 4.715,38 4.981,39 3.462,40 3.765,41 5.684,42 3.631,43 4.44,44 3.377,45 3.671,46 5.406,47 3.549,48 4.397,49 4.63,50 3.311,51 3.674,52 5.31,53 3.525,54 4.397,55 4.669,56 3.135,57 3.571,58 5.184,59 3.393,60 0.038,61 0.655,62 11.321,63 5.007,64 8.656,65 6.652,66 0.278,67 1.116,68 21.694,69 8.299,70 32.339,71 11.517,72 0.351,73 1.411,74 29.752,75 11.025,76 40.316,77 15.553,78 0.212,79 1.312,80 28.945,81 11.147,82 46.453,83 15.689,84 0.339,85 1.083,86 26.53,87 9.318,88 61.201,89 0.193,90 0.905,91 19.461,92 7.533,93 37.159,94 0.082,95 0.918,96 18.072,97 27.505,98 10.684,99 0.103,100 0.871,101 18.381,102 7.365,103 23.589,104 10.637,105 17,106 35,107 0.237,108 0.583,109 0.813,110 0.869,111 0.869,112 0.869,113 3.227,114 1.016,115 -4.05,116 -4,117 -3.79,118 40.8,119 1,120 6}
{0 CHEMBL477305,1 4.27,2 9.494,3 7.171,4 5.086,5 0.983,6 1.298,7 8.5,8 2.509,9 6.294,10 74.039,11 6.523,12 0.3,13 3.689,14 3.813,15 3.155,16 3.272,17 4.645,18 3.216,19 4.283,20 4.469,21 3.482,22 3.708,23 5.126,24 3.615,25 4.614,26 4.864,27 3.475,28 3.861,29 5.39,30 3.707,31 4.57,32 4.851,33 3.175,34 3.684,35 5.335,36 3.486,37 4.331,38 4.623,39 2.99,40 3.407,41 5.142,42 3.234,43 4.033,44 2.959,45 3.296,46 4.929,47 3.159,48 4.023,49 4.265,50 2.916,51 3.303,52 4.836,53 3.148,54 4.012,55 4.287,56 2.662,57 3.184,58 4.716,59 2.986,60 0.046,61 0.5,62 8.691,63 3.746,64 6.472,65 5.152,66 0.12,67 0.885,68 16.221,69 6.366,70 14.109,71 9.049,72 0.214,73 1.158,74 22.871,75 8.934,76 21.246,77 12.915,78 0.153,79 1.03,80 21.974,81 8.814,82 22.731,83 12.536,84 0.161,85 0.775,86 17.516,87 6.768,88 26.539,89 0.098,90 0.621,91 12.713,92 5.128,93 20.867,94 0.069,95 0.64,96 12.408,97 14.247,98 7.313,99 0.072,100 0.607,101 12.34,102 5.028,103 10.535,104 7.265,105 3,106 27,107 0.238,108 0.581,109 0.774,110 0.851,111 0.865,112 0.865,113 2.96,114 1.017,115 -4.03,116 -3.98,117 -3.77,118 43.2,120 6}
{0 CHEMBL477322,1 4.436,2 11.47,3 8.224,4 5.124,5 0.753,6 1.365,7 10.091,8 2.695,9 7.264,10 87.96,11 6.962,12 0.44,13 3.835,14 3.953,15 3.363,16 3.434,17 4.835,18 3.391,19 4.418,20 4.594,21 3.719,22 3.877,23 5.32,24 3.804,25 4.74,26 4.974,27 3.747,28 4.037,29 5.592,30 3.911,31 4.718,32 4.985,33 3.465,34 3.885,35 5.541,36 3.716,37 4.496,38 4.778,39 3.245,40 3.627,41 5.341,42 3.468,43 4.195,44 3.174,45 3.456,46 5.13,47 3.332,48 4.109,49 4.34,50 3.179,51 3.422,52 5.003,53 3.309,54 4.104,55 4.33,56 3.135,57 3.422,58 4.918,59 3.298,60 0.044,61 0.585,62 9.237,63 4.049,64 7.856,65 5.462,66 0.131,67 1.037,68 17.614,69 6.947,70 16.988,71 9.666,72 0.23,73 1.364,74 25.482,75 9.909,76 26.902,77 14.16,78 0.186,79 1.251,80 25.685,81 10.123,82 30.317,83 14.358,84 0.189,85 0.957,86 21.087,87 8.209,88 33.05,89 0.119,90 0.752,91 14.948,92 5.886,93 26.189,94 0.118,95 0.74,96 13.408,97 17.898,98 7.341,99 0.082,100 0.725,101 13.222,102 5.217,103 12.353,104 7.461,105 3,106 35,107 0.239,108 0.614,109 0.812,110 0.894,111 0.902,112 0.902,113 3.146,114 0.965,115 -3.73,116 -3.7,117 -3.52,118 45.2,120 6}
{0 CHEMBL477326,1 4.697,2 13.994,3 11.316,4 8.327,5 1.162,6 1.317,7 13.077,8 4.076,9 16.613,10 105.114,11 6.814,12 0.414,13 4.013,14 4.126,15 3.515,16 3.599,17 5.011,18 3.553,19 4.587,20 4.756,21 3.841,22 4.015,23 5.497,24 3.939,25 4.894,26 5.121,27 3.854,28 4.16,29 5.739,30 4.031,31 4.89,32 5.15,33 3.604,34 4.022,35 5.7,36 3.854,37 4.703,38 4.978,39 3.492,40 3.838,41 5.543,42 3.69,43 4.472,44 3.492,45 3.794,46 5.4,47 3.671,48 4.474,49 4.7,50 3.445,51 3.808,52 5.344,53 3.664,54 4.46,55 4.716,56 3.271,57 3.678,58 5.246,59 3.515,60 0.052,61 0.665,62 11.464,63 5.145,64 8.666,65 6.812,66 0.169,67 1.162,68 21.482,69 8.665,70 21.467,71 11.728,72 0.276,73 1.523,74 30.157,75 11.957,76 31.541,77 16.634,78 0.252,79 1.432,80 30.782,81 12.203,82 35.327,83 16.863,84 0.239,85 1.166,86 25.829,87 10.141,88 38.313,89 0.14,90 0.98,91 19.555,92 8.239,93 30.029,94 0.091,95 1.013,96 19.229,97 22.403,98 11.7,99 0.12,100 0.961,101 19.533,102 8.087,103 19.329,104 11.369,105 3,106 39,107 0.221,108 0.559,109 0.757,110 0.851,111 0.86,112 0.86,113 3.303,114 0.977,115 -4.81,116 -4.72,117 -4.43,118 45.1,120 6}
{0 CHEMBL477327,1 4.669,2 12.938,3 10.408,4 7.509,5 0.873,6 1.384,7 12.208,8 2.748,9 7.55,10 94.863,11 6.683,12 0.231,13 3.964,14 4.08,15 3.433,16 3.497,17 4.967,18 3.455,19 4.561,20 4.745,21 3.765,22 3.914,23 5.513,24 3.837,25 4.858,26 5.09,27 3.775,28 4.077,29 5.737,30 3.952,31 4.834,32 5.086,33 3.611,34 3.971,35 5.759,36 3.816,37 4.715,38 4.981,39 3.462,40 3.765,41 5.684,42 3.631,43 4.44,44 3.377,45 3.671,46 5.406,47 3.549,48 4.397,49 4.63,50 3.311,51 3.674,52 5.31,53 3.525,54 4.397,55 4.669,56 3.135,57 3.571,58 5.184,59 3.393,60 0.038,61 0.655,62 11.321,63 5.007,64 8.656,65 6.652,66 0.278,67 1.116,68 21.694,69 8.299,70 32.339,71 11.517,72 0.351,73 1.411,74 29.752,75 11.025,76 40.316,77 15.553,78 0.212,79 1.312,80 28.945,81 11.147,82 46.453,83 15.689,84 0.339,85 1.083,86 26.53,87 9.318,88 61.201,89 0.193,90 0.905,91 19.461,92 7.533,93 37.159,94 0.082,95 0.918,96 18.072,97 27.505,98 10.684,99 0.103,100 0.871,101 18.381,102 7.365,103 23.589,104 10.637,105 17,106 35,107 0.237,108 0.583,109 0.813,110 0.869,111 0.869,112 0.869,113 3.227,114 1.016,115 -4.05,116 -4,117 -3.79,118 40.8,119 1,120 6}
{0 CHEMBL477492,1 4.6,2 11.689,3 10.1,4 7.129,5 0.886,6 1.404,7 11.478,8 2.713,9 7.36,10 90.314,11 6.814,12 0.24,13 3.907,14 4.021,15 3.394,16 3.442,17 4.929,18 3.405,19 4.5,20 4.679,21 3.733,22 3.859,23 5.48,24 3.79,25 4.793,26 5.025,27 3.772,28 4.019,29 5.704,30 3.905,31 4.776,32 5.017,33 3.576,34 3.894,35 5.761,36 3.757,37 4.604,38 4.861,39 3.367,40 3.697,41 5.566,42 3.562,43 4.368,44 3.298,45 3.623,46 5.334,47 3.487,48 4.367,49 4.625,50 3.217,51 3.583,52 5.238,53 3.427,54 4.25,55 4.514,56 3.062,57 3.444,58 5.013,59 3.283,60 0.031,61 0.616,62 10.44,63 4.661,64 8.821,65 6.121,66 0.269,67 1.051,68 20.18,69 7.713,70 32.287,71 10.596,72 0.283,73 1.334,74 27.648,75 10.354,76 37.229,77 14.594,78 0.267,79 1.219,80 27.663,81 10.242,82 54.569,83 14.158,84 0.319,85 0.991,86 23.757,87 8.496,88 56.121,89 0.118,90 0.864,91 17.739,92 7.237,93 34.987,94 0.094,95 0.868,96 17.769,97 27.52,98 10.259,99 0.089,100 0.758,101 15.856,102 6.331,103 17.32,104 9.099,105 16,106 34,107 0.244,108 0.593,109 0.806,110 0.866,111 0.866,112 0.866,113 3.187,114 1.001,115 -4.09,116 -4.04,117 -3.82,118 41.3,119 1,120 6}
{0 CHEMBL477506,1 3.946,2 6.541,3 4.227,4 2.885,5 1.071,6 1.517,7 7.294,8 0.336,9 0.113,10 64.61,11 7.166,12 0.316,13 3.58,14 3.704,15 3.126,16 3.106,17 4.623,18 3.086,19 4.164,20 4.352,21 3.497,22 3.533,23 5.162,24 3.493,25 4.468,26 4.695,27 3.465,28 3.675,29 5.459,30 3.568,31 4.39,32 4.669,33 3.057,34 3.45,35 5.269,36 3.281,37 4.028,38 4.303,39 2.922,40 3.111,41 5.032,42 2.995,43 3.744,44 2.994,45 2.998,46 4.875,47 2.95,48 3.831,49 4.064,50 2.889,51 3.012,52 4.824,53 2.935,54 3.775,55 4.056,56 2.404,57 2.845,58 4.593,59 2.678,60 0.023,61 0.492,62 6.966,63 2.821,64 9.267,65 3.884,66 0.105,67 0.823,68 13.615,69 4.629,70 18.917,71 6.714,72 0.248,73 0.981,74 19.647,75 6.945,76 36.315,77 9.876,78 0.181,79 0.8,80 19.202,81 6.851,82 33.917,83 9.873,84 0.198,85 0.561,86 13.476,87 4.505,88 34.432,89 0.151,90 0.512,91 9.232,92 2.869,93 21.597,94 0.144,95 0.553,96 10.318,97 17.259,98 4.451,99 0.129,100 0.475,101 10.169,102 2.959,103 16.838,104 4.666,105 2,106 27,107 0.287,108 0.613,109 0.743,110 0.804,111 0.816,112 0.816,113 2.909,114 0.948,115 -1.61,116 -1.68,117 -1.72,118 40.6,120 6}
{0 CHEMBL478112,1 4.436,2 11.47,3 8.224,4 5.124,5 0.753,6 1.365,7 10.091,8 2.695,9 7.264,10 87.96,11 6.962,12 0.44,13 3.835,14 3.953,15 3.363,16 3.434,17 4.835,18 3.391,19 4.418,20 4.594,21 3.719,22 3.877,23 5.32,24 3.804,25 4.74,26 4.974,27 3.747,28 4.037,29 5.592,30 3.911,31 4.718,32 4.985,33 3.465,34 3.885,35 5.541,36 3.716,37 4.496,38 4.778,39 3.245,40 3.627,41 5.341,42 3.468,43 4.195,44 3.174,45 3.456,46 5.13,47 3.332,48 4.109,49 4.34,50 3.179,51 3.422,52 5.003,53 3.309,54 4.104,55 4.33,56 3.135,57 3.422,58 4.918,59 3.298,60 0.044,61 0.585,62 9.237,63 4.049,64 7.856,65 5.462,66 0.131,67 1.037,68 17.614,69 6.947,70 16.988,71 9.666,72 0.23,73 1.364,74 25.482,75 9.909,76 26.902,77 14.16,78 0.186,79 1.251,80 25.685,81 10.123,82 30.317,83 14.358,84 0.189,85 0.957,86 21.087,87 8.209,88 33.05,89 0.119,90 0.752,91 14.948,92 5.886,93 26.189,94 0.118,95 0.74,96 13.408,97 17.898,98 7.341,99 0.082,100 0.725,101 13.222,102 5.217,103 12.353,104 7.461,105 3,106 35,107 0.239,108 0.614,109 0.812,110 0.894,111 0.902,112 0.902,113 3.146,114 0.965,115 -3.73,116 -3.7,117 -3.52,118 45.2,120 6}
{0 CHEMBL478340,1 4.277,2 8.674,3 6.997,4 4.349,5 0.989,6 1.264,7 7.111,8 2.357,9 5.553,10 73.338,11 6.951,12 0.524,13 3.634,14 3.756,15 3.185,16 3.266,17 4.581,18 3.219,19 4.212,20 4.389,21 3.552,22 3.714,23 5.078,24 3.641,25 4.502,26 4.732,27 3.535,28 3.847,29 5.292,30 3.718,31 4.435,32 4.701,33 3.254,34 3.666,35 5.182,36 3.5,37 4.226,38 4.501,39 3.125,40 3.454,41 4.974,42 3.309,43 4.029,44 2.966,45 3.308,46 4.799,47 3.166,48 3.916,49 4.177,50 2.762,51 3.169,52 4.648,53 3.012,54 3.736,55 3.998,56 2.361,57 2.953,58 4.407,59 2.745,60 0.033,61 0.482,62 7.41,63 3.203,64 5.42,65 4.468,66 0.096,67 0.857,68 14.093,69 5.55,70 9.721,71 7.876,72 0.118,73 1.091,74 19.681,75 7.993,76 15.618,77 11.429,78 0.114,79 0.992,80 18.953,81 7.636,82 16.593,83 11.006,84 0.133,85 0.818,86 15.546,87 5.99,88 13.452,89 0.082,90 0.673,91 12.423,92 4.851,93 10.755,94 0.08,95 0.594,96 11.207,97 9.867,98 6.283,99 0.051,100 0.478,101 9.269,102 3.887,103 6.859,104 5.568,106 30,107 0.232,108 0.59,109 0.753,110 0.816,111 0.827,112 0.827,113 2.963,114 0.959,115 -3.86,116 -3.82,117 -3.62,118 47.1,120 6}
{0 CHEMBL478347,1 4.191,2 9.297,3 6.669,4 6.014,5 1.001,6 1.377,7 7.421,8 1.948,9 3.794,10 79.038,11 6.574,12 0.286,13 3.747,14 3.881,15 3.208,16 3.299,17 4.75,18 3.251,19 4.326,20 4.517,21 3.609,22 3.744,23 5.26,24 3.674,25 4.644,26 4.86,27 3.629,28 3.915,29 5.616,30 3.792,31 4.664,32 4.945,33 3.284,34 3.749,35 5.545,36 3.562,37 4.321,38 4.605,39 3.095,40 3.433,41 5.242,42 3.28,43 4.007,44 3.186,45 3.367,46 5.041,47 3.281,48 4.269,49 4.487,50 3.237,51 3.506,52 5.254,53 3.382,54 4.403,55 4.69,56 2.917,57 3.46,58 5.186,59 3.256,60 0.058,61 0.558,62 9.256,63 3.738,64 10.483,65 5.254,66 0.111,67 0.94,68 16.913,69 6.497,70 16.323,71 9.337,72 0.236,73 1.193,74 23.69,75 8.953,76 33.409,77 12.786,78 0.204,79 1.097,80 24.451,81 9.147,82 37.957,83 13.219,84 0.154,85 0.769,86 17.35,87 6.482,88 33.848,89 0.086,90 0.652,91 12.314,92 4.733,93 20.09,94 0.188,95 0.805,96 16.347,97 32.015,98 8.609,99 0.211,100 0.885,101 18.928,102 6.429,103 26.192,104 9.701,105 10,106 31,107 0.249,108 0.625,109 0.776,110 0.823,111 0.823,112 0.823,113 3.011,114 0.987,115 -3.46,116 -3.44,117 -3.28,118 41,119 1,120 6}
{0 CHEMBL478348,1 4.484,2 10.653,3 8.765,4 7.189,5 1.049,6 1.404,7 10.957,8 2.447,9 5.989,10 90.121,11 6.814,12 0.24,13 3.907,14 4.021,15 3.394,16 3.442,17 4.924,18 3.405,19 4.501,20 4.679,21 3.763,22 3.858,23 5.516,24 3.797,25 4.799,26 5.013,27 3.761,28 4.008,29 5.787,30 3.899,31 4.753,32 5.004,33 3.537,34 3.86,35 5.743,36 3.716,37 4.541,38 4.791,39 3.403,40 3.628,41 5.602,42 3.522,43 4.292,44 3.373,45 3.587,46 5.336,47 3.493,48 4.37,49 4.594,50 3.278,51 3.636,52 5.303,53 3.492,54 4.383,55 4.666,56 3.04,57 3.51,58 5.15,59 3.319,60 0.031,61 0.616,62 10.44,63 4.661,64 9.725,65 6.121,66 0.247,67 1.048,68 20.158,69 7.722,70 31.533,71 10.583,72 0.349,73 1.305,74 28.061,75 10.352,76 49.017,77 14.184,78 0.24,79 1.189,80 27.019,81 10.039,82 51.964,83 14.016,84 0.3,85 0.92,86 22.374,87 7.822,88 58.464,89 0.151,90 0.8,91 16.477,92 6.524,93 30.717,94 0.104,95 0.886,96 17.639,97 26.924,98 10.095,99 0.108,100 0.847,101 18.325,102 7.194,103 24.7,104 10.467,105 14,106 35,107 0.244,108 0.59,109 0.777,110 0.813,111 0.813,112 0.813,113 3.187,114 0.998,115 -3.82,116 -3.78,117 -3.59,118 41.3,119 1,120 6.013}
{0 CHEMBL478349,1 4.11,2 8.728,3 6.102,4 4.975,5 0.934,6 1.391,7 8.15,8 2.502,9 6.259,10 80.383,11 7.01,12 0.435,13 3.75,14 3.871,15 3.285,16 3.335,17 4.741,18 3.3,19 4.335,20 4.506,21 3.693,22 3.796,23 5.287,24 3.739,25 4.652,26 4.872,27 3.652,28 3.926,29 5.592,30 3.806,31 4.603,32 4.874,33 3.307,34 3.722,35 5.474,36 3.552,37 4.245,38 4.523,39 3.076,40 3.388,41 5.171,42 3.249,43 3.923,44 3.111,45 3.301,46 4.932,47 3.212,48 4.066,49 4.279,50 3.151,51 3.37,52 4.967,53 3.261,54 4.16,55 4.406,56 3.079,57 3.357,58 5.01,59 3.227,60 0.047,61 0.546,62 8.465,63 3.579,64 8.564,65 4.83,66 0.107,67 0.961,68 16.042,69 6.283,70 15.402,71 8.717,72 0.235,73 1.212,74 23.375,75 9.071,76 31.426,77 12.605,78 0.195,79 1.081,80 23.264,81 8.924,82 32.987,83 12.56,84 0.155,85 0.74,86 16.421,87 6.249,88 31.061,89 0.072,90 0.583,91 10.842,92 4.515,93 17.358,94 0.135,95 0.685,96 12.783,97 15.962,98 7.003,99 0.142,100 0.748,101 14.488,102 5.286,103 17.32,104 7.536,105 2,106 34,107 0.249,108 0.636,109 0.772,110 0.836,111 0.836,112 0.836,113 3.058,114 0.95,115 -3.35,116 -3.33,117 -3.19,118 44.7,120 6}
{0 CHEMBL478350,1 4.021,2 7.516,3 5.352,4 4.026,5 0.9,6 1.485,7 8,8 0.85,9 0.723,10 72.153,11 6.953,12 0.3,13 3.661,14 3.794,15 3.17,16 3.186,17 4.71,18 3.159,19 4.231,20 4.417,21 3.561,22 3.626,23 5.238,24 3.574,25 4.553,26 4.778,27 3.54,28 3.772,29 5.556,30 3.661,31 4.505,32 4.788,33 3.132,34 3.556,35 5.396,36 3.38,37 4.13,38 4.413,39 2.965,40 3.232,41 5.073,42 3.1,43 3.837,44 3.04,45 3.159,46 4.962,47 3.08,48 3.986,49 4.227,50 2.951,51 3.188,52 4.884,53 3.072,54 3.933,55 4.209,56 2.707,57 3.019,58 4.851,59 2.861,60 0.046,61 0.531,62 7.978,63 3.092,64 11.241,65 4.35,66 0.123,67 0.88,68 14.864,69 5.419,70 19.956,71 7.787,72 0.237,73 1.075,74 21.511,75 7.533,76 38.186,77 10.917,78 0.212,79 0.902,80 21.393,81 7.431,82 39.016,83 10.881,84 0.152,85 0.614,86 14.72,87 5.219,88 32.527,89 0.114,90 0.548,91 10.11,92 3.784,93 23.977,94 0.132,95 0.622,96 12.147,97 16.523,98 6.046,99 0.143,100 0.556,101 11.781,102 3.718,103 23.809,104 5.862,105 5,106 29,107 0.275,108 0.667,109 0.784,110 0.824,111 0.824,112 0.824,113 2.96,114 0.953,115 -2.96,116 -2.96,117 -2.86,118 40,120 6}
{0 CHEMBL478358,1 4.18,2 7.846,3 6.714,4 4.566,5 1.261,6 1.163,7 6.467,8 2.703,9 7.305,10 64.887,11 6.229,12 0.353,13 3.541,14 3.674,15 2.992,16 3.15,17 4.393,18 3.08,19 4.14,20 4.338,21 3.316,22 3.585,23 4.901,24 3.48,25 4.432,26 4.683,27 3.214,28 3.709,29 5.086,30 3.528,31 4.388,32 4.7,33 2.83,34 3.491,35 4.942,36 3.252,37 4.064,38 4.364,39 2.805,40 3.253,41 4.676,42 3.068,43 3.926,44 2.765,45 3.203,46 4.622,47 3.034,48 3.914,49 4.202,50 2.389,51 3.053,52 4.542,53 2.819,54 3.635,55 3.989,56 1.557,57 2.553,58 4.111,59 2.226,60 0.038,61 0.44,62 7.735,63 3.274,64 4.817,65 4.705,66 0.093,67 0.781,68 14.269,69 5.555,70 8.879,71 8.165,72 0.102,73 0.974,74 18.75,75 7.833,76 11.209,77 11.333,78 0.09,79 0.87,80 17.644,81 7.51,82 10.567,83 10.843,84 0.062,85 0.637,86 12.724,87 5.441,88 8.297,89 0.062,90 0.584,91 11.228,92 4.62,93 7.599,94 0.06,95 0.551,96 10.975,97 7.969,98 6.627,99 0.042,100 0.381,101 8.098,102 3.425,103 5.78,104 4.963,106 23,107 0.222,108 0.541,109 0.712,110 0.758,111 0.774,112 0.774,113 2.796,114 1.04,115 -4.4,116 -4.33,117 -4.09,118 43.8,120 6}
{0 CHEMBL478359,1 4.209,2 8.47,3 6.903,4 4.933,5 1.118,6 1.32,7 7.882,8 2.462,9 6.062,10 71.478,11 6.686,12 0.316,13 3.606,14 3.728,15 3.103,16 3.211,17 4.574,18 3.156,19 4.196,20 4.382,21 3.431,22 3.646,23 5.055,24 3.558,25 4.487,26 4.719,27 3.391,28 3.788,29 5.291,30 3.635,31 4.494,32 4.787,33 3.049,34 3.59,35 5.252,36 3.382,37 4.171,38 4.461,39 2.949,40 3.331,41 4.926,42 3.167,43 3.972,44 2.906,45 3.269,46 4.782,47 3.122,48 4,49 4.273,50 2.658,51 3.16,52 4.748,53 2.969,54 3.756,55 4.05,56 2.371,57 2.824,58 4.492,59 2.627,60 0.027,61 0.462,62 7.664,63 3.427,64 5.33,65 4.713,66 0.105,67 0.816,68 14.556,69 5.791,70 10.66,71 8.19,72 0.108,73 1.03,74 19.717,75 8.239,76 17.245,77 11.696,78 0.146,79 0.957,80 20.558,81 8.22,82 25.445,83 11.748,84 0.107,85 0.696,86 14.811,87 5.934,88 17.975,89 0.065,90 0.612,91 11.722,92 4.828,93 11.064,94 0.086,95 0.597,96 12.346,97 12.891,98 7.064,99 0.057,100 0.447,101 9.717,102 3.883,103 9.046,104 5.554,105 3,106 26,107 0.246,108 0.579,109 0.741,110 0.763,111 0.785,112 0.785,113 2.908,114 1,115 -3.96,116 -3.91,117 -3.71,118 44.1,120 6}
{0 CHEMBL478530,1 3.974,2 7.014,3 4.969,4 4.135,5 0.894,6 1.593,7 8,8 1.931,9 3.73,10 73.005,11 7.962,12 0.3,13 3.606,14 3.718,15 3.235,16 3.191,17 4.637,18 3.156,19 4.194,20 4.366,21 3.66,22 3.628,23 5.218,24 3.574,25 4.513,26 4.726,27 3.633,28 3.777,29 5.518,30 3.656,31 4.446,32 4.717,33 3.205,34 3.535,35 5.352,36 3.357,37 4.041,38 4.306,39 3.043,40 3.203,41 5.027,42 3.078,43 3.798,44 3.115,45 3.153,46 4.928,47 3.071,48 3.952,49 4.189,50 3.033,51 3.182,52 4.847,53 3.063,54 3.902,55 4.166,56 3.033,57 3.055,58 4.839,59 2.883,60 0.022,61 0.467,62 6.441,63 3.033,64 8.691,65 3.95,66 0.13,67 0.805,68 13.81,69 5.193,70 20.202,71 7.03,72 0.224,73 1.004,74 21.547,75 7.946,76 37.857,77 10.628,78 0.233,79 0.855,80 23.538,81 7.877,82 40.295,83 10.674,84 0.154,85 0.574,86 14.601,87 5.217,88 32.416,89 0.108,90 0.509,91 9.247,92 3.751,93 23.033,94 0.132,95 0.604,96 11.777,97 16.051,98 5.757,99 0.178,100 0.518,101 13.808,102 4.25,103 24.58,104 5.915,105 5,106 29,107 0.299,108 0.654,109 0.78,110 0.823,111 0.823,112 0.823,113 2.96,114 0.994,115 -3.21,116 -3.2,117 -3.07,118 42.4,120 6}
{0 CHEMBL478531,1 4.421,2 9.702,3 7.941,4 6.112,5 0.929,6 1.519,7 8.773,8 1.317,9 1.735,10 85.524,11 7.152,12 0.25,13 3.837,14 3.953,15 3.358,16 3.348,17 4.938,18 3.331,19 4.406,20 4.577,21 3.748,22 3.779,23 5.486,24 3.74,25 4.689,26 4.886,27 3.812,28 3.952,29 5.796,30 3.87,31 4.737,32 4.982,33 3.539,34 3.809,35 5.802,36 3.687,37 4.424,38 4.667,39 3.394,40 3.564,41 5.503,42 3.468,43 4.232,44 3.48,45 3.514,46 5.505,47 3.452,48 4.38,49 4.579,50 3.427,51 3.586,52 5.456,53 3.504,54 4.461,55 4.704,56 3.333,57 3.54,58 5.576,59 3.417,60 0.049,61 0.592,62 9.211,63 3.949,64 14.349,65 5.144,66 0.27,67 0.975,68 17.729,69 6.673,70 33.123,71 9.03,72 0.229,73 1.231,74 23.935,75 9.106,76 46.074,77 12.544,78 0.382,79 1.142,80 27.177,81 9.192,82 72.61,83 12.8,84 0.228,85 0.848,86 19.569,87 6.996,88 49.219,89 0.223,90 0.78,91 15.073,92 5.736,93 49.667,94 0.253,95 0.897,96 17.968,97 43.493,98 8.449,99 0.401,100 0.922,101 20.223,102 6.424,103 66.178,104 9.52,105 19,106 35,107 0.269,108 0.654,109 0.791,110 0.834,111 0.834,112 0.834,113 3.147,114 0.934,115 -3.1,116 -3.1,117 -2.98,118 40.5,120 6}
{0 CHEMBL478532,1 4.662,2 13.931,3 10.934,4 6.944,5 1.346,6 1.254,7 11.583,8 4.027,9 16.218,10 99.175,11 6.754,12 0.444,13 3.927,14 4.045,15 3.427,16 3.552,17 4.914,18 3.496,19 4.5,20 4.672,21 3.766,22 3.986,23 5.383,24 3.897,25 4.828,26 5.062,27 3.791,28 4.149,29 5.644,30 4.008,31 4.816,32 5.076,33 3.563,34 4.029,35 5.625,36 3.851,37 4.658,38 4.934,39 3.41,40 3.832,41 5.49,42 3.664,43 4.416,44 3.312,45 3.692,46 5.296,47 3.542,48 4.301,49 4.547,50 3.223,51 3.604,52 5.143,53 3.452,54 4.203,55 4.454,56 3.076,57 3.491,58 4.981,59 3.33,60 0.053,61 0.605,62 10.507,63 4.689,64 8.222,65 6.37,66 0.131,67 1.082,68 19.428,69 8.045,70 16.695,71 11.172,72 0.23,73 1.462,74 27.878,75 11.486,76 25.334,77 16.26,78 0.17,79 1.382,80 27.919,81 11.828,82 28.556,83 16.557,84 0.183,85 1.149,86 24.265,87 10.049,88 33.584,89 0.123,90 0.927,91 18.576,92 7.863,93 27.473,94 0.087,95 0.85,96 16.332,97 19.722,98 9.854,99 0.079,100 0.763,101 14.828,102 6.344,103 13.945,104 8.989,105 3,106 37,107 0.214,108 0.544,109 0.718,110 0.822,111 0.854,112 0.854,113 3.228,114 0.984,115 -5.16,116 -5.05,117 -4.73,118 46.8,120 6}
{0 CHEMBL478533,1 4.457,2 12.292,3 8.767,4 5.835,5 1.079,6 1.271,7 10.091,8 3.417,9 11.677,10 90.489,11 6.777,12 0.44,13 3.848,14 3.965,15 3.354,16 3.469,17 4.822,18 3.416,19 4.433,20 4.606,21 3.71,22 3.918,23 5.307,24 3.833,25 4.766,26 4.998,27 3.737,28 4.087,29 5.58,30 3.948,31 4.752,32 5.016,33 3.464,34 3.942,35 5.549,36 3.759,37 4.542,38 4.828,39 3.245,40 3.672,41 5.365,42 3.5,43 4.216,44 3.163,45 3.5,46 5.121,47 3.363,48 4.139,49 4.364,50 3.163,51 3.495,52 4.975,53 3.361,54 4.179,55 4.411,56 3.13,57 3.508,58 4.926,59 3.358,60 0.049,61 0.562,62 9.661,63 4.303,64 7.222,65 5.828,66 0.126,67 1.017,68 18.157,69 7.468,70 15.306,71 10.36,72 0.222,73 1.375,74 26.178,75 10.721,76 23.501,77 15.178,78 0.165,79 1.289,80 26.29,81 11.033,82 26.445,83 15.465,84 0.177,85 1.011,86 21.836,87 8.857,88 31.362,89 0.109,90 0.756,91 15.2,92 6.334,93 24.834,94 0.072,95 0.73,96 13.707,97 15.778,98 8.24,99 0.069,100 0.752,101 14.295,102 6.185,103 10.612,104 8.73,105 3,106 35,107 0.221,108 0.567,109 0.757,110 0.861,111 0.88,112 0.896,113 3.146,114 0.982,115 -4.8,116 -4.71,117 -4.42,118 46.5,120 6}
{0 CHEMBL478723,1 4.6,2 11.689,3 10.1,4 7.129,5 0.886,6 1.404,7 11.478,8 2.713,9 7.36,10 90.314,11 6.814,12 0.24,13 3.907,14 4.021,15 3.394,16 3.442,17 4.929,18 3.405,19 4.5,20 4.679,21 3.733,22 3.859,23 5.48,24 3.79,25 4.793,26 5.025,27 3.772,28 4.019,29 5.704,30 3.905,31 4.776,32 5.017,33 3.576,34 3.894,35 5.761,36 3.757,37 4.604,38 4.861,39 3.367,40 3.697,41 5.566,42 3.562,43 4.368,44 3.298,45 3.623,46 5.334,47 3.487,48 4.367,49 4.625,50 3.217,51 3.583,52 5.238,53 3.427,54 4.25,55 4.514,56 3.062,57 3.444,58 5.013,59 3.283,60 0.031,61 0.616,62 10.44,63 4.661,64 8.821,65 6.121,66 0.269,67 1.051,68 20.18,69 7.713,70 32.287,71 10.596,72 0.283,73 1.334,74 27.648,75 10.354,76 37.229,77 14.594,78 0.267,79 1.219,80 27.663,81 10.242,82 54.569,83 14.158,84 0.319,85 0.991,86 23.757,87 8.496,88 56.121,89 0.118,90 0.864,91 17.739,92 7.237,93 34.987,94 0.094,95 0.868,96 17.769,97 27.52,98 10.259,99 0.089,100 0.758,101 15.856,102 6.331,103 17.32,104 9.099,105 16,106 34,107 0.244,108 0.593,109 0.806,110 0.866,111 0.866,112 0.866,113 3.187,114 1.001,115 -4.09,116 -4.04,117 -3.82,118 41.3,119 1,120 6}
{0 CHEMBL478724,1 4.697,2 13.994,3 11.316,4 8.327,5 1.162,6 1.317,7 13.077,8 4.076,9 16.613,10 105.114,11 6.814,12 0.414,13 4.013,14 4.126,15 3.515,16 3.599,17 5.011,18 3.553,19 4.587,20 4.756,21 3.841,22 4.015,23 5.497,24 3.939,25 4.894,26 5.121,27 3.854,28 4.16,29 5.739,30 4.031,31 4.89,32 5.15,33 3.604,34 4.022,35 5.7,36 3.854,37 4.703,38 4.978,39 3.492,40 3.838,41 5.543,42 3.69,43 4.472,44 3.492,45 3.794,46 5.4,47 3.671,48 4.474,49 4.7,50 3.445,51 3.808,52 5.344,53 3.664,54 4.46,55 4.716,56 3.271,57 3.678,58 5.246,59 3.515,60 0.052,61 0.665,62 11.464,63 5.145,64 8.666,65 6.812,66 0.169,67 1.162,68 21.482,69 8.665,70 21.467,71 11.728,72 0.276,73 1.523,74 30.157,75 11.957,76 31.541,77 16.634,78 0.252,79 1.432,80 30.782,81 12.203,82 35.327,83 16.863,84 0.239,85 1.166,86 25.829,87 10.141,88 38.313,89 0.14,90 0.98,91 19.555,92 8.239,93 30.029,94 0.091,95 1.013,96 19.229,97 22.403,98 11.7,99 0.12,100 0.961,101 19.533,102 8.087,103 19.329,104 11.369,105 3,106 39,107 0.221,108 0.559,109 0.757,110 0.851,111 0.86,112 0.86,113 3.303,114 0.977,115 -4.81,116 -4.72,117 -4.43,118 45.1,120 6}
{0 CHEMBL478912,1 4.571,2 10.737,3 9.835,4 6.144,5 1.122,6 1.364,7 8.8,8 2.394,9 5.732,10 80.266,11 6.619,12 0.261,13 3.819,14 3.933,15 3.318,16 3.356,17 4.693,18 3.32,19 4.454,20 4.626,21 3.679,22 3.797,23 5.313,24 3.735,25 4.679,26 4.908,27 3.565,28 3.925,29 5.42,30 3.783,31 4.663,32 4.941,33 3.344,34 3.775,35 5.353,36 3.599,37 4.43,38 4.693,39 3.245,40 3.62,41 5.138,42 3.465,43 4.315,44 3.122,45 3.54,46 5.028,47 3.372,48 4.249,49 4.532,50 2.896,51 3.363,52 4.899,53 3.178,54 3.972,55 4.235,56 2.765,57 3.093,58 4.605,59 2.936,60 0.03,61 0.567,62 9.857,63 4.263,64 4.238,65 5.717,66 0.313,67 0.988,68 19.825,69 7.17,70 18.776,71 9.824,72 0.186,73 1.198,74 24.46,75 9.673,76 20.094,77 13.599,78 0.202,79 1.099,80 24.423,81 9.391,82 21.505,83 13.39,84 0.155,85 0.893,86 19.155,87 7.579,88 16.031,89 0.089,90 0.831,91 16.759,92 6.82,93 13.68,94 0.127,95 0.732,96 16.022,97 12.774,98 8.874,99 0.066,100 0.548,101 12.038,102 4.7,103 7.36,104 6.67,106 32,107 0.244,108 0.559,109 0.758,110 0.776,111 0.776,112 0.776,113 3.058,114 0.997,115 -4.11,116 -4.05,117 -3.84,118 41.5,120 6}
{0 CHEMBL478913,1 4.341,2 9.574,3 7.559,4 4.527,5 1.467,6 1.146,7 6.467,8 2.885,9 8.325,10 64.114,11 5.922,12 0.353,13 3.594,14 3.733,15 3.001,16 3.183,17 4.383,18 3.104,19 4.225,20 4.431,21 3.332,22 3.641,23 4.911,24 3.522,25 4.567,26 4.832,27 3.242,28 3.794,29 5.133,30 3.596,31 4.576,32 4.9,33 2.878,34 3.622,35 5.051,36 3.36,37 4.298,38 4.626,39 2.835,40 3.385,41 4.824,42 3.163,43 4.058,44 2.773,45 3.258,46 4.704,47 3.07,48 3.931,49 4.224,50 2.389,51 3.059,52 4.552,53 2.824,54 3.635,55 3.989,56 1.557,57 2.553,58 4.111,59 2.226,60 0.043,61 0.476,62 8.561,63 3.584,64 4.815,65 5.206,66 0.1,67 0.848,68 15.869,69 6.194,70 8.008,71 9.198,72 0.118,73 1.088,74 21.343,75 8.798,76 9.659,77 12.852,78 0.108,79 1.005,80 20.636,81 8.667,82 9.571,83 12.601,84 0.077,85 0.76,86 15.543,87 6.606,88 8.565,89 0.07,90 0.638,91 12.619,92 5.156,93 8.302,94 0.06,95 0.545,96 10.955,97 7.677,98 6.614,99 0.04,100 0.362,101 7.699,102 3.251,103 5.136,104 4.722,106 23,107 0.217,108 0.488,109 0.685,110 0.769,111 0.784,112 0.784,113 2.796,114 1.09,115 -4.49,116 -4.42,117 -4.16,118 41.2,120 6}
{0 CHEMBL478981,1 4.535,2 11.653,3 9.6,4 6.281,5 1.135,6 1.291,7 8.45,8 3.062,9 9.377,10 82.33,11 6.805,12 0.478,13 3.762,14 3.876,15 3.287,16 3.368,17 4.714,18 3.322,19 4.343,20 4.516,21 3.648,22 3.81,23 5.208,24 3.741,25 4.599,26 4.81,27 3.659,28 3.973,29 5.403,30 3.85,31 4.593,32 4.837,33 3.433,34 3.862,35 5.355,36 3.696,37 4.478,38 4.748,39 3.321,40 3.697,41 5.207,42 3.541,43 4.294,44 3.152,45 3.564,46 5.043,47 3.405,48 4.199,49 4.467,50 2.94,51 3.41,52 4.888,53 3.225,54 4.014,55 4.3,56 2.669,57 3.131,58 4.667,59 2.942,60 0.037,61 0.519,62 8.798,63 3.914,64 6.637,65 5.283,66 0.138,67 0.916,68 16.744,69 6.705,70 13.319,71 9.152,72 0.14,73 1.155,74 21.846,75 9.223,76 17.137,77 12.801,78 0.118,79 1.118,80 21.99,81 9.447,82 18.953,83 13.26,84 0.126,85 0.989,86 19.978,87 8.229,88 17.612,89 0.104,90 0.828,91 16.345,92 6.862,93 13.962,94 0.078,95 0.753,96 14.926,97 11.752,98 8.973,99 0.081,100 0.612,101 12.654,102 5.067,103 9.781,104 7.229,105 3,106 33,107 0.231,108 0.558,109 0.741,110 0.821,111 0.83,112 0.83,113 3.059,114 0.962,115 -4.61,116 -4.53,117 -4.26,118 46.2,120 6.31}
{0 CHEMBL479189,1 4.573,2 10.036,3 10.121,4 6.57,5 1.305,6 1.364,7 8.7,8 2.752,9 7.573,10 80.11,11 6.619,12 0.273,13 3.79,14 3.909,15 3.268,16 3.34,17 4.755,18 3.294,19 4.385,20 4.571,21 3.637,22 3.759,23 5.341,24 3.688,25 4.662,26 4.887,27 3.615,28 3.898,29 5.537,30 3.779,31 4.623,32 4.874,33 3.465,34 3.767,35 5.569,36 3.631,37 4.45,38 4.682,39 3.307,40 3.635,41 5.417,42 3.51,43 4.327,44 3.091,45 3.571,46 5.116,47 3.39,48 4.305,49 4.607,50 2.871,51 3.336,52 5.036,53 3.132,54 3.956,55 4.221,56 2.85,57 2.928,58 4.91,59 2.835,60 0.027,61 0.556,62 9.506,63 4.195,64 5.742,65 5.672,66 0.23,67 0.943,68 18.166,69 6.996,70 23.393,71 9.77,72 0.222,73 1.159,74 24.291,75 9.264,76 28.226,77 12.895,78 0.201,79 1.064,80 23.532,81 8.895,82 37.788,83 12.449,84 0.249,85 0.902,86 19.955,87 7.267,88 38.906,89 0.081,90 0.845,91 16.868,92 7.092,93 15.546,94 0.102,95 0.745,96 16.97,97 20.241,98 9.52,99 0.247,100 0.488,101 12.539,102 4.062,103 18.888,104 5.638,105 13,106 31,107 0.244,108 0.559,109 0.726,110 0.743,111 0.761,112 0.761,113 3.058,114 1.01,115 -4.43,116 -4.36,117 -4.11,118 41.5,119 2,120 6}
{0 CHEMBL479223,1 4.092,2 8.011,3 5.837,4 5.019,5 1.068,6 1.473,7 8.85,8 1.813,9 3.286,10 76.055,11 7.334,12 0.273,13 3.716,14 3.818,15 3.257,16 3.269,17 4.83,18 3.248,19 4.281,20 4.438,21 3.659,22 3.708,23 5.459,24 3.664,25 4.617,26 4.821,27 3.668,28 3.864,29 5.699,30 3.766,31 4.597,32 4.849,33 3.343,34 3.652,35 5.656,36 3.515,37 4.243,38 4.499,39 3.102,40 3.329,41 5.31,42 3.221,43 3.914,44 3.13,45 3.26,46 5.079,47 3.187,48 4.05,49 4.262,50 3.056,51 3.319,52 5.07,53 3.204,54 4.058,55 4.323,56 2.828,57 3.212,58 4.832,59 3.047,60 0.05,61 0.498,62 7.753,63 3.626,64 15.473,65 4.495,66 0.198,67 0.867,68 14.74,69 6.091,70 42.621,71 8.035,72 0.247,73 1.122,74 22.246,75 8.753,76 49.735,77 11.747,78 0.306,79 1.008,80 23.723,81 8.478,82 67.393,83 11.587,84 0.266,85 0.693,86 16.953,87 5.921,88 54.662,89 0.076,90 0.56,91 10.515,92 4.456,93 25.8,94 0.104,95 0.643,96 12.452,97 25.559,98 6.849,99 0.094,100 0.625,101 13.239,102 5.175,103 21.631,104 7.421,105 11,106 32,107 0.268,108 0.639,109 0.754,110 0.801,111 0.801,112 0.801,113 3.057,114 0.938,115 -3.38,116 -3.36,117 -3.21,118 43.2,120 4}
{0 CHEMBL504277,1 4.571,2 10.737,3 9.835,4 6.144,5 1.122,6 1.364,7 8.8,8 2.394,9 5.732,10 80.266,11 6.619,12 0.261,13 3.819,14 3.933,15 3.318,16 3.356,17 4.693,18 3.32,19 4.454,20 4.626,21 3.679,22 3.797,23 5.313,24 3.735,25 4.679,26 4.908,27 3.565,28 3.925,29 5.42,30 3.783,31 4.663,32 4.941,33 3.344,34 3.775,35 5.353,36 3.599,37 4.43,38 4.693,39 3.245,40 3.62,41 5.138,42 3.465,43 4.315,44 3.122,45 3.54,46 5.028,47 3.372,48 4.249,49 4.532,50 2.896,51 3.363,52 4.899,53 3.178,54 3.972,55 4.235,56 2.765,57 3.093,58 4.605,59 2.936,60 0.03,61 0.567,62 9.857,63 4.263,64 4.238,65 5.717,66 0.313,67 0.988,68 19.825,69 7.17,70 18.776,71 9.824,72 0.186,73 1.198,74 24.46,75 9.673,76 20.094,77 13.599,78 0.202,79 1.099,80 24.423,81 9.391,82 21.505,83 13.39,84 0.155,85 0.893,86 19.155,87 7.579,88 16.031,89 0.089,90 0.831,91 16.759,92 6.82,93 13.68,94 0.127,95 0.732,96 16.022,97 12.774,98 8.874,99 0.066,100 0.548,101 12.038,102 4.7,103 7.36,104 6.67,106 32,107 0.244,108 0.559,109 0.758,110 0.776,111 0.776,112 0.776,113 3.058,114 0.997,115 -4.11,116 -4.05,117 -3.84,118 41.5,120 6}
{0 CHEMBL505301,1 4.41,2 9.638,3 8.164,4 5.451,5 1.344,6 1.279,7 7.474,8 3.181,9 10.117,10 79.379,11 6.385,12 0.286,13 3.759,14 3.886,15 3.204,16 3.336,17 4.701,18 3.275,19 4.357,20 4.555,21 3.602,22 3.777,23 5.243,24 3.696,25 4.656,26 4.869,27 3.602,28 3.943,29 5.584,30 3.805,31 4.692,32 4.983,33 3.297,34 3.781,35 5.497,36 3.589,37 4.323,38 4.579,39 3.07,40 3.503,41 5.263,42 3.335,43 4.155,44 3.074,45 3.386,46 5.009,47 3.249,48 4.091,49 4.296,50 3.186,51 3.436,52 4.98,53 3.324,54 4.299,55 4.525,56 2.955,57 3.489,58 5.137,59 3.306,60 0.05,61 0.54,62 9.547,63 4.099,64 7.955,65 5.685,66 0.119,67 0.946,68 17.698,69 6.949,70 15.137,71 9.93,72 0.227,73 1.2,74 24.036,75 9.538,76 29.985,77 13.433,78 0.195,79 1.136,80 24.796,81 9.761,82 29.877,83 13.883,84 0.134,85 0.799,86 17.093,87 6.9,88 31.347,89 0.101,90 0.693,91 14.378,92 5.785,93 19.263,94 0.08,95 0.693,96 13.459,97 13.824,98 7.69,99 0.156,100 0.803,101 16.838,102 6.545,103 24.149,104 9.16,105 10,106 31,107 0.23,108 0.554,109 0.716,110 0.753,111 0.753,112 0.753,113 3.011,114 1.016,115 -4.27,116 -4.21,117 -3.97,118 42.5,119 2,120 6}
{0 CHEMBL506578,1 4.6,2 12.265,3 10.499,4 6.725,5 1.733,6 1.138,7 9.429,8 4.221,9 17.819,10 90.023,11 6.558,12 0.5,13 3.812,14 3.936,15 3.306,16 3.462,17 4.727,18 3.395,19 4.386,20 4.566,21 3.644,22 3.894,23 5.214,24 3.797,25 4.684,26 4.916,27 3.608,28 4.037,29 5.417,30 3.879,31 4.676,32 4.957,33 3.343,34 3.896,35 5.348,36 3.694,37 4.473,38 4.75,39 3.292,40 3.734,41 5.182,42 3.559,43 4.345,44 3.182,45 3.636,46 5.078,47 3.465,48 4.248,49 4.525,50 2.924,51 3.468,52 4.916,53 3.269,54 4.014,55 4.302,56 2.74,57 3.236,58 4.635,59 3.044,60 0.045,61 0.542,62 9.577,63 4.197,64 6.723,65 5.934,66 0.106,67 0.976,68 17.574,69 7.197,70 11.971,71 10.308,72 0.121,73 1.265,74 23.903,75 10.322,76 16.386,77 14.711,78 0.113,79 1.223,80 23.967,81 10.533,82 17.805,83 15.015,84 0.088,85 0.996,86 19.474,87 8.611,88 15.952,89 0.086,90 0.892,91 17.079,92 7.351,93 13.694,94 0.078,95 0.799,96 15.561,97 11.93,98 9.61,99 0.055,100 0.621,101 12.268,102 5.434,103 8.38,104 7.743,106 33,107 0.2,108 0.493,109 0.642,110 0.728,111 0.787,112 0.787,113 3.103,114 0.996,115 -5.6,116 -5.47,117 -5.1,118 47.6,120 6}
{0 CHEMBL506873,1 4.562,2 12.599,3 9.88,4 6.397,5 1.498,6 1.139,7 7.947,8 3.794,9 14.392,10 80.564,11 6.285,12 0.5,13 3.767,14 3.897,15 3.229,16 3.397,17 4.607,18 3.325,19 4.384,20 4.573,21 3.593,22 3.864,23 5.131,24 3.759,25 4.725,26 4.97,27 3.563,28 4.034,29 5.375,30 3.862,31 4.756,32 5.058,33 3.25,34 3.894,35 5.322,36 3.664,37 4.517,38 4.826,39 3.134,40 3.667,41 5.094,42 3.458,43 4.291,44 3.078,45 3.54,46 4.936,47 3.362,48 4.21,49 4.473,50 2.979,51 3.467,52 4.86,53 3.282,54 4.117,55 4.4,56 2.789,57 3.311,58 4.745,59 3.112,60 0.046,61 0.541,62 9.634,63 4.167,64 5.772,65 5.945,66 0.108,67 0.988,68 18.091,69 7.35,70 9.959,71 10.649,72 0.132,73 1.316,74 25.175,75 10.699,76 13.753,77 15.379,78 0.127,79 1.291,80 25.716,81 11.104,82 14.899,83 15.941,84 0.094,85 1.007,86 20.147,87 8.791,88 12.394,89 0.084,90 0.833,91 16.175,92 6.861,93 9.989,94 0.073,95 0.767,96 14.876,97 9.197,98 9.182,99 0.069,100 0.69,101 13.533,102 5.747,103 8.743,104 8.281,106 31,107 0.203,108 0.489,109 0.683,110 0.795,111 0.816,112 0.834,113 3.011,114 1.034,115 -5.3,116 -5.19,117 -4.85,118 45,120 6}
{0 CHEMBL516436,1 4.203,2 9.032,3 6.715,4 5.125,5 1.165,6 1.387,7 8.737,8 2.192,9 4.804,10 75.759,11 6.773,12 0.286,13 3.73,14 3.844,15 3.224,16 3.268,17 4.733,18 3.233,19 4.318,20 4.497,21 3.593,22 3.693,23 5.267,24 3.638,25 4.603,26 4.813,27 3.601,28 3.849,29 5.568,30 3.737,31 4.579,32 4.844,33 3.236,34 3.673,35 5.458,36 3.501,37 4.283,38 4.564,39 3.044,40 3.389,41 5.185,42 3.237,43 3.993,44 3.079,45 3.293,46 4.977,47 3.191,48 4.06,49 4.279,50 3,51 3.33,52 4.934,53 3.196,54 4.08,55 4.345,56 2.805,57 3.192,58 4.89,59 3.014,60 0.036,61 0.514,62 8.781,63 3.806,64 9.105,65 5.042,66 0.15,67 0.882,68 16.77,69 6.285,70 19.382,71 8.611,72 0.246,73 1.105,74 22.733,75 8.649,76 33.259,77 11.931,78 0.218,79 1.006,80 22.706,81 8.522,82 34.502,83 11.983,84 0.159,85 0.736,86 16.911,87 6.396,88 32.814,89 0.08,90 0.601,91 12.083,92 4.882,93 20.133,94 0.092,95 0.652,96 12.931,97 16.153,98 7.195,99 0.189,100 0.622,101 13.603,102 5.151,103 20.834,104 7.432,105 6,106 30,107 0.253,108 0.591,109 0.743,110 0.789,111 0.789,112 0.789,113 3.01,114 0.974,115 -3.46,116 -3.44,117 -3.28,118 42.1,120 6}
{0 CHEMBL516895,1 4.362,2 9.966,3 8.276,4 5.231,5 1.383,6 1.159,7 7.111,8 3.079,9 9.478,10 75.867,11 6.724,12 0.524,13 3.65,14 3.77,15 3.175,16 3.309,17 4.564,18 3.249,19 4.23,20 4.403,21 3.542,22 3.763,23 5.062,24 3.675,25 4.534,26 4.763,27 3.523,28 3.908,29 5.28,30 3.763,31 4.478,32 4.74,33 3.247,34 3.746,35 5.184,36 3.56,37 4.29,38 4.565,39 3.112,40 3.545,41 4.976,42 3.374,43 4.109,44 2.96,45 3.404,46 4.807,47 3.234,48 4.008,49 4.277,50 2.771,51 3.247,52 4.676,53 3.063,54 3.817,55 4.099,56 2.364,57 2.983,58 4.454,59 2.762,60 0.037,61 0.457,62 7.847,63 3.436,64 5.5,65 4.834,66 0.089,67 0.832,68 14.661,69 6.032,70 9.296,71 8.576,72 0.107,73 1.092,74 20.398,75 8.759,76 14.149,77 12.453,78 0.091,79 1.012,80 19.55,81 8.588,82 14.943,83 12.218,84 0.085,85 0.844,86 16.327,87 6.974,88 12.218,89 0.066,90 0.703,91 13.42,92 5.811,93 9.614,94 0.062,95 0.634,96 12.228,97 8.707,98 7.473,99 0.056,100 0.523,101 10.167,102 4.271,103 7.413,104 6.12,106 30,107 0.212,108 0.529,109 0.684,110 0.776,111 0.801,112 0.822,113 2.963,114 0.979,115 -4.98,116 -4.88,117 -4.58,118 48.6,120 6}
{0 CHEMBL517050,1 4.457,2 12.292,3 8.767,4 5.835,5 1.079,6 1.271,7 10.091,8 3.417,9 11.677,10 90.489,11 6.777,12 0.44,13 3.848,14 3.965,15 3.354,16 3.469,17 4.822,18 3.416,19 4.433,20 4.606,21 3.71,22 3.918,23 5.307,24 3.833,25 4.766,26 4.998,27 3.737,28 4.087,29 5.58,30 3.948,31 4.752,32 5.016,33 3.464,34 3.942,35 5.549,36 3.759,37 4.542,38 4.828,39 3.245,40 3.672,41 5.365,42 3.5,43 4.216,44 3.163,45 3.5,46 5.121,47 3.363,48 4.139,49 4.364,50 3.163,51 3.495,52 4.975,53 3.361,54 4.179,55 4.411,56 3.13,57 3.508,58 4.926,59 3.358,60 0.049,61 0.562,62 9.661,63 4.303,64 7.222,65 5.828,66 0.126,67 1.017,68 18.157,69 7.468,70 15.306,71 10.36,72 0.222,73 1.375,74 26.178,75 10.721,76 23.501,77 15.178,78 0.165,79 1.289,80 26.29,81 11.033,82 26.445,83 15.465,84 0.177,85 1.011,86 21.836,87 8.857,88 31.362,89 0.109,90 0.756,91 15.2,92 6.334,93 24.834,94 0.072,95 0.73,96 13.707,97 15.778,98 8.24,99 0.069,100 0.752,101 14.295,102 6.185,103 10.612,104 8.73,105 3,106 35,107 0.221,108 0.567,109 0.757,110 0.861,111 0.88,112 0.896,113 3.146,114 0.982,115 -4.8,116 -4.71,117 -4.42,118 46.5,120 6}
{0 CHEMBL517057,1 4.409,2 10.624,3 8.605,4 5.894,5 1.326,6 1.149,7 7.947,8 3.611,9 13.041,10 81.337,11 6.563,12 0.5,13 3.723,14 3.846,15 3.223,16 3.371,17 4.615,18 3.306,19 4.311,20 4.493,21 3.581,22 3.82,23 5.123,24 3.726,25 4.611,26 4.842,27 3.542,28 3.967,29 5.337,30 3.811,31 4.602,32 4.889,33 3.217,34 3.796,35 5.242,36 3.586,37 4.333,38 4.62,39 3.109,40 3.563,41 4.996,42 3.381,43 4.158,44 3.06,45 3.468,46 4.862,47 3.31,48 4.125,49 4.377,50 2.965,51 3.416,52 4.803,53 3.244,54 4.057,55 4.33,56 2.782,57 3.281,58 4.704,59 3.091,60 0.041,61 0.5,62 8.737,63 3.813,64 5.686,65 5.393,66 0.101,67 0.911,68 16.313,69 6.622,70 10.571,71 9.498,72 0.114,73 1.18,74 22.221,75 9.558,76 14.728,77 13.631,78 0.107,79 1.131,80 22.302,81 9.745,82 15.483,83 13.916,84 0.078,85 0.862,86 16.969,87 7.442,88 12.742,89 0.074,90 0.742,91 14.138,92 6.013,93 9.843,94 0.067,95 0.712,96 13.646,97 8.969,98 8.417,99 0.065,100 0.662,101 12.827,102 5.48,103 8.531,104 7.851,106 31,107 0.206,108 0.528,109 0.704,110 0.787,111 0.81,112 0.829,113 3.011,114 0.995,115 -5.22,116 -5.11,117 -4.78,118 47.4,120 6}
{0 CHEMBL517203,1 4.177,2 8.274,3 6.045,4 5.194,5 0.902,6 1.525,7 8.238,8 1.545,9 2.388,10 77.749,11 7.562,12 0.261,13 3.755,14 3.85,15 3.308,16 3.279,17 4.927,18 3.273,19 4.304,20 4.453,21 3.724,22 3.721,23 5.533,24 3.693,25 4.65,26 4.84,27 3.766,28 3.885,29 5.796,30 3.812,31 4.654,32 4.889,33 3.532,34 3.7,35 5.917,36 3.593,37 4.328,38 4.567,39 3.275,40 3.396,41 5.562,42 3.32,43 4.005,44 3.199,45 3.304,46 5.235,47 3.242,48 4.09,49 4.292,50 3.208,51 3.372,52 5.041,53 3.284,54 4.196,55 4.394,56 3.315,57 3.323,58 5.583,59 3.25,60 0.103,61 0.513,62 7.811,63 3.697,64 23.346,65 4.385,66 0.247,67 0.882,68 14.566,69 6.174,70 47.807,71 7.918,72 0.353,73 1.141,74 22.574,75 8.834,76 61.342,77 11.569,78 0.606,79 1.037,80 25.224,81 8.664,82 115.218,83 11.773,84 0.371,85 0.734,86 18.501,87 6.219,88 73.243,89 0.166,90 0.598,91 11.513,92 4.737,93 37.909,94 0.139,95 0.668,96 12.65,97 28.238,98 7.001,99 0.425,100 0.682,101 14.867,102 5.452,103 84.381,104 7.394,105 18,106 34,107 0.276,108 0.659,109 0.787,110 0.845,111 0.845,112 0.845,113 3.103,114 0.916,115 -3.37,116 -3.35,117 -3.21,118 42.1,120 6}
{0 CHEMBL517819,1 4.662,2 13.931,3 10.934,4 6.944,5 1.346,6 1.254,7 11.583,8 4.027,9 16.218,10 99.175,11 6.754,12 0.444,13 3.927,14 4.045,15 3.427,16 3.552,17 4.914,18 3.496,19 4.5,20 4.672,21 3.766,22 3.986,23 5.383,24 3.897,25 4.828,26 5.062,27 3.791,28 4.149,29 5.644,30 4.008,31 4.816,32 5.076,33 3.563,34 4.029,35 5.625,36 3.851,37 4.658,38 4.934,39 3.41,40 3.832,41 5.49,42 3.664,43 4.416,44 3.312,45 3.692,46 5.296,47 3.542,48 4.301,49 4.547,50 3.223,51 3.604,52 5.143,53 3.452,54 4.203,55 4.454,56 3.076,57 3.491,58 4.981,59 3.33,60 0.053,61 0.605,62 10.507,63 4.689,64 8.222,65 6.37,66 0.131,67 1.082,68 19.428,69 8.045,70 16.695,71 11.172,72 0.23,73 1.462,74 27.878,75 11.486,76 25.334,77 16.26,78 0.17,79 1.382,80 27.919,81 11.828,82 28.556,83 16.557,84 0.183,85 1.149,86 24.265,87 10.049,88 33.584,89 0.123,90 0.927,91 18.576,92 7.863,93 27.473,94 0.087,95 0.85,96 16.332,97 19.722,98 9.854,99 0.079,100 0.763,101 14.828,102 6.344,103 13.945,104 8.989,105 3,106 37,107 0.214,108 0.544,109 0.718,110 0.822,111 0.854,112 0.854,113 3.228,114 0.984,115 -5.16,116 -5.05,117 -4.73,118 46.8,120 6}
{0 CHEMBL518134,1 4.946,2 19.825,3 14.989,4 10.967,5 1.623,6 1.327,7 8.909,8 4.809,9 23.122,10 91.077,11 6.188,12 0.25,13 3.961,14 4.097,15 3.538,16 3.712,17 4.803,18 3.545,19 4.575,20 4.783,21 3.914,22 4.188,23 5.335,24 3.977,25 4.905,26 5.108,27 3.903,28 4.348,29 5.714,30 4.119,31 5.104,32 5.394,33 3.638,34 4.262,35 5.777,36 4,37 4.963,38 5.293,39 3.538,40 4.101,41 5.564,42 3.849,43 4.683,44 3.341,45 3.921,46 5.415,47 3.69,48 4.619,49 4.941,50 3.105,51 3.709,52 5.216,53 3.415,54 4.136,55 4.422,56 3.122,57 3.495,58 4.75,59 3.226,60 0.148,61 0.796,62 15.306,63 7.502,64 10.833,65 8.621,66 0.215,67 1.442,68 28.889,69 15.222,70 19.437,71 16.067,72 0.323,73 1.814,74 38.321,75 19.223,76 34.089,77 20.79,78 0.299,79 1.825,80 39.748,81 17.987,82 35.576,83 22.235,84 0.175,85 1.581,86 33.257,87 15.59,88 25.318,89 0.133,90 1.227,91 24.751,92 11.105,93 22.132,94 0.206,95 1.082,96 23.841,97 19.329,98 13.637,99 0.169,100 0.805,101 17.648,102 8.427,103 11.554,104 9.209,105 29,106 37,107 0.228,108 0.501,109 0.694,110 0.708,111 0.708,112 0.708,113 3.147,114 1.428,115 -5.01,116 -4.91,117 -4.6,118 37.3,119 3,120 6}
{0 CHEMBL518600,1 4.039,2 8.325,3 6.195,4 5.518,5 0.952,6 1.556,7 8.105,8 2.193,9 4.809,10 78.411,11 7.65,12 0.238,13 3.679,14 3.782,15 3.331,16 3.308,17 4.7,18 3.238,19 4.271,20 4.44,21 3.775,22 3.758,23 5.268,24 3.662,25 4.562,26 4.761,27 3.72,28 3.84,29 5.609,30 3.705,31 4.504,32 4.755,33 3.34,34 3.65,35 5.468,36 3.474,37 4.2,38 4.458,39 3.273,40 3.386,41 5.206,42 3.219,43 3.871,44 3.303,45 3.327,46 4.932,47 3.171,48 3.886,49 4.059,50 3.153,51 3.322,52 4.777,53 3.148,54 3.908,55 4.108,56 2.94,57 3.172,58 5.051,59 3.019,60 0.024,61 0.493,62 7.999,63 3.803,64 8.812,65 4.664,66 0.089,67 0.889,68 16.515,69 6.766,70 17.927,71 8.391,72 0.286,73 1.1,74 25.022,75 9.166,76 45.135,77 11.193,78 0.211,79 0.992,80 24.722,81 9.001,82 41.072,83 11.316,84 0.195,85 0.722,86 18.473,87 6.668,88 39.206,89 0.077,90 0.597,91 15.454,92 5.509,93 18.517,94 0.064,95 0.603,96 14.564,97 12.079,98 6.32,99 0.167,100 0.569,101 14.338,102 5.218,103 34.773,104 6.295,105 11,106 31,107 0.286,108 0.623,109 0.775,110 0.813,111 0.813,112 0.813,113 3.01,114 1.067,115 -3.21,116 -3.2,117 -3.07,118 41.7,119 1,120 6}
{0 CHEMBL99679,1 4.706,2 14.278,3 11.497,4 6.937,5 1.745,6 1.13,7 9.429,8 4.404,9 19.393,10 89.25,11 6.305,12 0.5,13 3.853,14 3.982,15 3.312,16 3.485,17 4.72,18 3.412,19 4.453,20 4.641,21 3.655,22 3.935,23 5.221,24 3.828,25 4.79,26 5.036,27 3.628,28 4.099,29 5.451,30 3.927,31 4.82,32 5.115,33 3.372,34 3.985,35 5.423,36 3.764,37 4.634,38 4.936,39 3.311,40 3.817,41 5.272,42 3.619,43 4.434,44 3.191,45 3.678,46 5.12,47 3.494,48 4.287,49 4.563,50 2.937,51 3.503,52 4.925,53 3.299,54 4.11,55 4.402,56 2.763,57 3.304,58 4.691,59 3.099,60 0.049,61 0.584,62 10.469,63 4.554,64 6.857,65 6.485,66 0.113,67 1.054,68 19.342,69 7.928,70 11.473,71 11.453,72 0.139,73 1.403,74 26.844,75 11.466,76 15.398,77 16.453,78 0.133,79 1.388,80 27.46,81 11.934,82 17.659,83 17.095,84 0.104,85 1.144,86 22.711,87 9.989,88 16.591,89 0.094,90 0.961,91 18.682,92 8.008,93 13.826,94 0.079,95 0.822,96 16.069,97 10.8,98 9.945,99 0.06,100 0.674,101 13.346,102 5.902,103 7.923,104 8.425,106 33,107 0.197,108 0.473,109 0.648,110 0.76,111 0.794,112 0.794,113 3.103,114 1.031,115 -5.68,116 -5.55,117 -5.17,118 45.5,120 6}
