"molecule_id","FCFP4_1024b782","FCFP4_1024b134","FCFP4_1024b539","FCFP4_1024b610","FCFP4_1024b563","FCFP4_1024b727","FCFP4_1024b714","FCFP4_1024b265","FCFP4_1024b426","FCFP4_1024b868","FCFP4_1024b20","FCFP4_1024b685","FCFP4_1024b199","FCFP4_1024b808","FCFP4_1024b641","FCFP4_1024b787","FCFP4_1024b138","FCFP4_1024b937","FCFP4_1024b139","FCFP4_1024b451","FCFP4_1024b57","FCFP4_1024b858","FCFP4_1024b555","FCFP4_1024b409","FCFP4_1024b603","FCFP4_1024b153","FCFP4_1024b748","FCFP4_1024b943","FCFP4_1024b453","FCFP4_1024b137","FCFP4_1024b228","FCFP4_1024b64","FCFP4_1024b657","FCFP4_1024b1","FCFP4_1024b10","FCFP4_1024b100","FCFP4_1024b1000","FCFP4_1024b1001","FCFP4_1024b1002","FCFP4_1024b1003","FCFP4_1024b1004","FCFP4_1024b1005","FCFP4_1024b1006","FCFP4_1024b1007","FCFP4_1024b1008","FCFP4_1024b1009","FCFP4_1024b101","FCFP4_1024b1010","FCFP4_1024b1011","FCFP4_1024b1012","FCFP4_1024b1013","pXC50"
{11 1,13 1,16 1,19 1,21 1,34 1,49 1,52 5.3}
{0 CHEMBL101253,19 1,21 1,22 1,29 1,34 1,52 5.25}
{0 CHEMBL101311,7 1,15 1,19 1,21 1,22 1,29 1,34 1,35 1,52 5.9}
{0 CHEMBL103667,20 1,29 1,34 1,35 1,52 5.35}
{0 CHEMBL105442,15 1,19 1,21 1,29 1,34 1,52 5}
{0 CHEMBL1077369,7 1,25 1,28 1,33 1,34 1,52 7.47}
{0 CHEMBL1077370,7 1,16 1,25 1,28 1,33 1,34 1,39 1,49 1,52 4.699}
{0 CHEMBL1077371,7 1,16 1,23 1,25 1,28 1,33 1,34 1,39 1,52 4.699}
{0 CHEMBL1077372,6 1,7 1,8 1,11 1,13 1,25 1,28 1,33 1,34 1,52 4.699}
{0 CHEMBL1077375,7 1,25 1,28 1,34 1,52 4.699}
{0 CHEMBL1077376,7 1,25 1,28 1,34 1,52 4.699}
{0 CHEMBL1077597,7 1,25 1,28 1,33 1,34 1,52 4.699}
{0 CHEMBL1077598,7 1,25 1,28 1,33 1,34 1,52 4.699}
{0 CHEMBL1077599,7 1,25 1,28 1,33 1,34 1,52 4.669}
{0 CHEMBL1077600,7 1,25 1,28 1,29 1,33 1,34 1,52 4.699}
{0 CHEMBL1077670,27 1,34 1,52 5.481}
{0 CHEMBL1078245,27 1,34 1,52 5.398}
{0 CHEMBL1078426,27 1,52 5.886}
{0 CHEMBL1078427,18 1,27 1,30 1,34 1,35 1,52 5.301}
{0 CHEMBL1078537,18 1,27 1,30 1,34 1,35 1,52 5.301}
{0 CHEMBL1078538,18 1,27 1,30 1,34 1,35 1,52 5.301}
{0 CHEMBL1078539,27 1,34 1,52 5.301}
{0 CHEMBL1078717,27 1,34 1,52 5.398}
{0 CHEMBL1078820,27 1,34 1,52 5.854}
{0 CHEMBL1078929,27 1,34 1,52 6.222}
{0 CHEMBL1078930,27 1,34 1,52 6.42}
{0 CHEMBL1079032,27 1,34 1,52 5.553}
{0 CHEMBL1079040,27 1,34 1,52 5.959}
{0 CHEMBL1079135,27 1,34 1,52 5.585}
{0 CHEMBL1079208,27 1,34 1,52 5.481}
{0 CHEMBL1079243,16 1,27 1,34 1,52 5.921}
{0 CHEMBL1079293,27 1,34 1,52 5.481}
{0 CHEMBL1079294,27 1,34 1,52 6.268}
{0 CHEMBL1079295,27 1,34 1,52 6.143}
{0 CHEMBL1080071,27 1,29 1,34 1,52 7.469}
{0 CHEMBL1080072,27 1,34 1,52 5.602}
{0 CHEMBL1080073,27 1,34 1,52 5.481}
{0 CHEMBL1080245,27 1,29 1,34 1,52 5.481}
{0 CHEMBL1080970,12 1,27 1,34 1,52 5.824}
{0 CHEMBL1081312,3 1,4 1,5 1,6 1,8 1,11 1,13 1,24 1,34 1,52 6.1}
{0 CHEMBL1082061,18 1,27 1,34 1,35 1,52 5.481}
{0 CHEMBL1082440,11 1,18 1,25 1,34 1,35 1,52 6.7}
{0 CHEMBL1084546,12 1,22 1,26 1,29 1,34 1,52 6.8}
{0 CHEMBL1090356,16 1,22 1,29 1,32 1,34 1,52 5.1}
{0 CHEMBL1090360,16 1,22 1,29 1,32 1,34 1,52 5.1}
{0 CHEMBL1094408,4 1,34 1,35 1,52 5}
{0 CHEMBL116070,8 1,19 1,21 1,34 1,52 5.4}
{0 CHEMBL1164180,8 1,16 1,19 1,21 1,26 1,34 1,35 1,52 5.8}
{0 CHEMBL1164265,8 1,16 1,19 1,21 1,26 1,34 1,35 1,52 5.9}
{0 CHEMBL1173055,11 1,12 1,13 1,16 1,21 1,25 1,34 1,52 5.1}
{0 CHEMBL1173655,19 1,21 1,22 1,29 1,34 1,35 1,52 5}
{0 CHEMBL117697,22 1,29 1,34 1,52 4.7}
{0 CHEMBL1190711,12 1,16 1,23 1,24 1,34 1,52 5.1}
{0 CHEMBL119385,19 1,21 1,34 1,40 1,51 1,52 5.25}
{0 CHEMBL1230020,3 1,4 1,5 1,6 1,8 1,11 1,13 1,19 1,21 1,29 1,34 1,52 5}
{0 CHEMBL1230122,7 1,10 1,19 1,21 1,26 1,34 1,52 5.1}
{0 CHEMBL1230607,11 1,34 1,35 1,37 1,52 5}
{0 CHEMBL1233887,4 1,6 1,11 1,13 1,34 1,52 5.9}
{0 CHEMBL1236107,12 1,24 1,34 1,52 5}
{0 CHEMBL1236126,34 1,52 5.1}
{0 CHEMBL1241473,22 1,29 1,34 1,52 6.5}
{0 CHEMBL1241674,10 1,11 1,13 1,24 1,34 1,52 5.432}
{0 CHEMBL1242373,16 1,20 1,24 1,29 1,34 1,52 5.1}
{0 CHEMBL124660,26 1,29 1,34 1,35 1,52 5.25}
{0 CHEMBL1258913,11 1,25 1,29 1,34 1,35 1,37 1,52 6.479}
{0 CHEMBL1270230,11 1,13 1,16 1,34 1,52 5}
{0 CHEMBL127898,18 1,24 1,25 1,30 1,34 1,35 1,52 5.1}
{0 CHEMBL1287853,22 1,25 1,29 1,34 1,35 1,52 5}
{0 CHEMBL1289926,11 1,12 1,25 1,30 1,34 1,37 1,52 5}
{0 CHEMBL1336,19 1,20 1,21 1,25 1,29 1,30 1,34 1,52 5.3}
{0 CHEMBL1375418,12 1,16 1,24 1,30 1,34 1,52 5.1}
{0 CHEMBL1375640,19 1,21 1,34 1,52 6.7}
{0 CHEMBL1381197,12 1,16 1,19 1,21 1,24 1,30 1,34 1,52 5.1}
{0 CHEMBL1419458,16 1,34 1,52 5.1}
{0 CHEMBL1421,15 1,19 1,21 1,26 1,34 1,35 1,49 1,52 5.2}
{0 CHEMBL143703,12 1,20 1,29 1,34 1,52 4.3}
{0 CHEMBL1461728,11 1,19 1,21 1,29 1,34 1,37 1,52 5.1}
{0 CHEMBL14762,7 1,12 1,24 1,34 1,52 5}
{0 CHEMBL1516890,12 1,20 1,26 1,29 1,30 1,34 1,52 5.1}
{0 CHEMBL1614701,15 1,19 1,21 1,29 1,34 1,52 5}
{0 CHEMBL1614705,11 1,16 1,19 1,21 1,23 1,34 1,37 1,52 5.9}
{0 CHEMBL162,7 1,25 1,34 1,52 7.721}
{0 CHEMBL1624529,7 1,19 1,21 1,26 1,34 1,44 1,52 5.1}
{0 CHEMBL1651521,7 1,34 1,52 5}
{0 CHEMBL1682341,11 1,34 1,37 1,52 5.8}
{0 CHEMBL1682345,11 1,16 1,27 1,34 1,37 1,52 6.9}
{0 CHEMBL1682346,11 1,16 1,27 1,34 1,37 1,52 6.5}
{0 CHEMBL1682357,11 1,16 1,34 1,37 1,52 6.5}
{0 CHEMBL1682358,11 1,16 1,34 1,37 1,52 6.5}
{0 CHEMBL1682359,11 1,16 1,34 1,37 1,52 5.1}
{0 CHEMBL1682360,11 1,16 1,19 1,34 1,35 1,37 1,52 5.6}
{0 CHEMBL1682540,11 1,16 1,37 1,52 5.3}
{0 CHEMBL1682545,11 1,16 1,22 1,29 1,37 1,52 5.1}
{0 CHEMBL1682546,11 1,12 1,16 1,34 1,37 1,52 6}
{0 CHEMBL1682552,7 1,10 1,11 1,16 1,34 1,37 1,52 6.6}
{0 CHEMBL1682553,7 1,11 1,16 1,34 1,37 1,52 6.4}
{0 CHEMBL1682554,11 1,16 1,34 1,37 1,52 6}
{0 CHEMBL1682558,11 1,16 1,19 1,21 1,32 1,34 1,35 1,37 1,52 5.1}
{0 CHEMBL1721885,7 1,8 1,11 1,13 1,19 1,21 1,25 1,29 1,34 1,35 1,52 5}
{0 CHEMBL1727312,29 1,34 1,52 4.3}
{0 CHEMBL17370,11 1,13 1,16 1,19 1,21 1,34 1,49 1,52 5.1}
{0 CHEMBL1738758,4 1,25 1,34 1,35 1,52 5}
{0 CHEMBL178737,12 1,24 1,25 1,34 1,52 5.1}
{0 CHEMBL1789941,3 1,5 1,6 1,8 1,11 1,13 1,24 1,34 1,35 1,52 5}
{0 CHEMBL180022,12 1,14 1,18 1,21 1,22 1,29 1,30 1,34 1,35 1,52 5}
{0 CHEMBL1825138,19 1,21 1,25 1,34 1,52 5.8}
{0 CHEMBL1834385,16 1,23 1,52 5.4}
{0 CHEMBL183844,16 1,20 1,25 1,29 1,34 1,39 1,52 5.1}
{0 CHEMBL184847,16 1,20 1,25 1,29 1,34 1,52 5.1}
{0 CHEMBL185569,16 1,20 1,25 1,29 1,34 1,52 5.1}
{0 CHEMBL1870106,7 1,8 1,27 1,34 1,52 8.5}
{0 CHEMBL1879463,16 1,24 1,34 1,35 1,52 5.9}
{0 CHEMBL189963,25 1,26 1,34 1,52 5.9}
{0 CHEMBL1908391,12 1,16 1,18 1,19 1,29 1,34 1,35 1,52 5}
{0 CHEMBL1908392,1 1,11 1,13 1,18 1,34 1,35 1,41 1,52 5}
{0 CHEMBL1908393,21 1,25 1,29 1,34 1,35 1,52 5}
{0 CHEMBL1908394,18 1,19 1,34 1,35 1,52 5}
{0 CHEMBL1908395,8 1,11 1,13 1,18 1,21 1,29 1,34 1,35 1,52 5}
{0 CHEMBL1908396,25 1,29 1,34 1,52 5}
{0 CHEMBL1908397,11 1,25 1,34 1,37 1,52 5}
{0 CHEMBL191003,19 1,21 1,22 1,29 1,34 1,52 5.25}
{0 CHEMBL1933576,25 1,34 1,35 1,52 5}
{0 CHEMBL1933582,25 1,34 1,35 1,37 1,52 5}
{0 CHEMBL1949855,19 1,21 1,25 1,34 1,52 5}
{0 CHEMBL1958401,2 1,7 1,19 1,25 1,34 1,52 5.4}
{0 CHEMBL196363,16 1,20 1,24 1,29 1,34 1,52 5.1}
{0 CHEMBL1964288,11 1,16 1,27 1,34 1,37 1,52 5.1}
{0 CHEMBL1964290,11 1,13 1,16 1,34 1,52 5.4}
{0 CHEMBL1964307,11 1,16 1,29 1,34 1,37 1,52 6.4}
{0 CHEMBL1964340,1 1,2 1,3 1,4 1,5 1,6 1,8 1,11 1,12 1,13 1,15 1,17 1,22 1,34 1,52 6.8}
{0 CHEMBL1964382,21 1,34 1,52 5.9}
{0 CHEMBL1964399,22 1,26 1,29 1,34 1,52 5.1}
{0 CHEMBL1964413,11 1,16 1,27 1,34 1,37 1,52 5.3}
{0 CHEMBL1964441,16 1,20 1,25 1,29 1,34 1,52 5.9}
{0 CHEMBL1964444,20 1,34 1,52 5.1}
{0 CHEMBL1964644,12 1,25 1,34 1,52 5.1}
{0 CHEMBL1964687,16 1,20 1,24 1,29 1,34 1,52 5.1}
{0 CHEMBL1964692,8 1,16 1,20 1,29 1,34 1,52 5.1}
{0 CHEMBL1964718,18 1,34 1,52 4.3}
{0 CHEMBL1964777,8 1,19 1,21 1,34 1,52 5.5}
{0 CHEMBL1964804,16 1,25 1,34 1,52 5.9}
{0 CHEMBL1964902,21 1,34 1,52 5.9}
{0 CHEMBL1964937,3 1,4 1,5 1,6 1,8 1,11 1,12 1,13 1,25 1,34 1,52 6.9}
{0 CHEMBL1964948,13 1,20 1,29 1,34 1,35 1,52 5.9}
{0 CHEMBL1965033,15 1,19 1,20 1,21 1,29 1,34 1,52 5.9}
{0 CHEMBL1965131,19 1,21 1,34 1,52 5.5}
{0 CHEMBL1965169,4 1,6 1,11 1,13 1,16 1,22 1,34 1,52 5.9}
{0 CHEMBL1965170,7 1,16 1,20 1,29 1,34 1,52 6.1}
{0 CHEMBL1965387,11 1,12 1,16 1,19 1,20 1,21 1,29 1,34 1,37 1,52 5.9}
{0 CHEMBL1965423,16 1,19 1,21 1,32 1,34 1,52 5.1}
{0 CHEMBL1965495,11 1,16 1,18 1,24 1,30 1,34 1,35 1,37 1,52 6.1}
{0 CHEMBL1965507,20 1,24 1,29 1,34 1,52 5.1}
{0 CHEMBL1965570,15 1,16 1,19 1,20 1,21 1,29 1,34 1,49 1,52 5.1}
{0 CHEMBL1965589,16 1,19 1,21 1,24 1,30 1,32 1,34 1,52 5.1}
{0 CHEMBL1965631,11 1,16 1,27 1,34 1,35 1,37 1,52 5.7}
{0 CHEMBL1965660,11 1,13 1,16 1,19 1,21 1,34 1,52 6.4}
{0 CHEMBL1965683,11 1,34 1,37 1,52 4.4}
{0 CHEMBL1965702,1 1,2 1,3 1,4 1,5 1,6 1,7 1,8 1,9 1,10 1,11 1,12 1,13 1,14 1,15 1,22 1,23 1,34 1,35 1,52 7.7}
{0 CHEMBL1965845,3 1,4 1,5 1,6 1,8 1,11 1,12 1,13 1,25 1,34 1,52 7.9}
{0 CHEMBL1965910,11 1,16 1,24 1,34 1,35 1,52 5.1}
{0 CHEMBL1965988,16 1,20 1,29 1,34 1,52 5.1}
{0 CHEMBL1966035,34 1,45 1,52 5.1}
{0 CHEMBL1966040,1 1,2 1,3 1,4 1,5 1,6 1,8 1,11 1,12 1,13 1,23 1,34 1,52 6}
{0 CHEMBL1966069,11 1,34 1,37 1,52 6.3}
{0 CHEMBL1966087,25 1,34 1,52 6.4}
{0 CHEMBL1966175,3 1,4 1,6 1,8 1,11 1,13 1,24 1,34 1,35 1,43 1,52 6.3}
{0 CHEMBL1966204,11 1,16 1,19 1,21 1,27 1,34 1,37 1,52 5.7}
{0 CHEMBL1966279,1 1,25 1,29 1,34 1,52 5.1}
{0 CHEMBL1966343,11 1,16 1,34 1,37 1,52 5.7}
{0 CHEMBL1966425,16 1,22 1,25 1,29 1,34 1,35 1,52 5.1}
{0 CHEMBL1966514,16 1,19 1,20 1,21 1,29 1,34 1,49 1,52 5.1}
{0 CHEMBL1966524,7 1,8 1,11 1,13 1,23 1,34 1,52 8}
{0 CHEMBL1966628,1 1,2 1,3 1,4 1,5 1,6 1,7 1,8 1,10 1,11 1,12 1,13 1,23 1,34 1,52 7.3}
{0 CHEMBL1966703,11 1,19 1,21 1,26 1,34 1,37 1,52 5.1}
{0 CHEMBL1966722,19 1,21 1,29 1,34 1,52 5.1}
{0 CHEMBL1966808,34 1,49 1,52 5.1}
{0 CHEMBL1966816,19 1,20 1,21 1,34 1,42 1,52 5.1}
{0 CHEMBL1966842,16 1,29 1,32 1,34 1,35 1,52 5.9}
{0 CHEMBL1967094,11 1,12 1,16 1,19 1,21 1,24 1,25 1,34 1,37 1,52 5.1}
{0 CHEMBL1967116,16 1,20 1,29 1,34 1,52 5.1}
{0 CHEMBL1967211,15 1,16 1,22 1,24 1,52 4.3}
{0 CHEMBL1967252,11 1,12 1,16 1,34 1,37 1,52 5.6}
{0 CHEMBL1967302,7 1,8 1,11 1,13 1,16 1,29 1,34 1,39 1,52 6.4}
{0 CHEMBL1967336,20 1,21 1,34 1,42 1,52 5.9}
{0 CHEMBL1967513,19 1,20 1,21 1,34 1,52 5.9}
{0 CHEMBL1967531,16 1,20 1,24 1,29 1,34 1,52 5.1}
{0 CHEMBL1967538,24 1,25 1,34 1,52 4.3}
{0 CHEMBL1967544,16 1,34 1,52 7.3}
{0 CHEMBL1967560,7 1,25 1,26 1,29 1,34 1,35 1,40 1,52 5.1}
{0 CHEMBL1967564,11 1,24 1,34 1,37 1,52 5.1}
{0 CHEMBL1967662,1 1,2 1,3 1,4 1,5 1,6 1,8 1,11 1,12 1,13 1,15 1,17 1,22 1,31 1,34 1,52 7.5}
{0 CHEMBL1967704,11 1,16 1,25 1,34 1,37 1,52 5.2}
{0 CHEMBL1967720,16 1,19 1,20 1,21 1,29 1,34 1,52 5.1}
{0 CHEMBL1967878,7 1,21 1,22 1,29 1,34 1,35 1,52 6.5}
{0 CHEMBL1967887,11 1,16 1,34 1,37 1,52 6.6}
{0 CHEMBL1967992,12 1,16 1,18 1,30 1,34 1,35 1,49 1,52 6.4}
{0 CHEMBL1967998,11 1,21 1,22 1,29 1,34 1,35 1,37 1,52 7}
{0 CHEMBL1968070,22 1,29 1,34 1,52 5.1}
{0 CHEMBL1968127,16 1,19 1,21 1,32 1,34 1,35 1,52 5.1}
{0 CHEMBL1968130,22 1,24 1,41 1,50 1,52 4.3}
{0 CHEMBL1968151,34 1,49 1,52 5.1}
{0 CHEMBL1968245,7 1,8 1,11 1,13 1,22 1,34 1,52 7.3}
{0 CHEMBL1968380,7 1,25 1,26 1,29 1,34 1,35 1,50 1,52 5.1}
{0 CHEMBL1968394,16 1,25 1,34 1,39 1,52 4.3}
{0 CHEMBL1968406,16 1,20 1,24 1,29 1,34 1,52 5.1}
{0 CHEMBL1968459,1 1,2 1,3 1,4 1,5 1,6 1,8 1,11 1,12 1,13 1,23 1,34 1,52 6}
{0 CHEMBL1968515,34 1,52 4.4}
{0 CHEMBL1968590,16 1,25 1,34 1,52 5.1}
{0 CHEMBL1968705,4 1,11 1,16 1,22 1,29 1,34 1,35 1,37 1,52 5.5}
{0 CHEMBL1968791,16 1,22 1,24 1,34 1,35 1,52 5.1}
{0 CHEMBL1968850,22 1,29 1,34 1,52 5.1}
{0 CHEMBL1968868,18 1,20 1,34 1,35 1,52 5.9}
{0 CHEMBL1968926,11 1,34 1,37 1,49 1,52 5.1}
{0 CHEMBL1968930,1 1,2 1,3 1,4 1,5 1,6 1,8 1,9 1,11 1,12 1,13 1,14 1,15 1,22 1,23 1,34 1,52 8.4}
{0 CHEMBL1969042,11 1,16 1,22 1,29 1,37 1,52 5.1}
{0 CHEMBL1969049,16 1,25 1,34 1,49 1,52 7.1}
{0 CHEMBL1969102,8 1,11 1,16 1,20 1,29 1,34 1,37 1,52 5.3}
{0 CHEMBL1969126,16 1,19 1,21 1,32 1,34 1,52 5.1}
{0 CHEMBL1969151,1 1,2 1,3 1,4 1,5 1,6 1,7 1,8 1,9 1,10 1,11 1,12 1,13 1,14 1,15 1,22 1,23 1,34 1,35 1,52 7.6}
{0 CHEMBL1969156,8 1,16 1,52 4.6}
{0 CHEMBL1969190,16 1,20 1,21 1,29 1,34 1,52 5.1}
{0 CHEMBL1969221,11 1,16 1,27 1,31 1,34 1,37 1,52 6.2}
{0 CHEMBL1969264,6 1,11 1,13 1,25 1,34 1,52 5.1}
{0 CHEMBL1969301,18 1,30 1,34 1,35 1,52 5.1}
{0 CHEMBL1969372,8 1,16 1,19 1,21 1,24 1,32 1,34 1,50 1,52 5.1}
{0 CHEMBL1969473,11 1,16 1,27 1,31 1,34 1,37 1,52 7.5}
{0 CHEMBL1969483,16 1,22 1,29 1,32 1,34 1,52 5.9}
{0 CHEMBL1969502,8 1,11 1,13 1,34 1,52 6.4}
{0 CHEMBL1969506,12 1,25 1,29 1,34 1,52 5.1}
{0 CHEMBL1969523,22 1,26 1,29 1,34 1,52 5.1}
{0 CHEMBL1969537,24 1,34 1,52 5.1}
{0 CHEMBL1969561,11 1,16 1,27 1,34 1,37 1,41 1,52 6.6}
{0 CHEMBL1969588,1 1,2 1,3 1,4 1,5 1,6 1,8 1,11 1,12 1,13 1,15 1,17 1,22 1,34 1,52 7.7}
{0 CHEMBL1969664,11 1,13 1,18 1,19 1,23 1,30 1,34 1,35 1,52 5.5}
{0 CHEMBL1969735,16 1,19 1,21 1,22 1,24 1,32 1,34 1,52 5.1}
{0 CHEMBL1969755,7 1,16 1,21 1,25 1,34 1,49 1,52 6.3}
{0 CHEMBL1969843,11 1,16 1,27 1,34 1,37 1,43 1,52 5.1}
{0 CHEMBL1969879,3 1,5 1,6 1,8 1,11 1,13 1,26 1,34 1,43 1,52 5.1}
{0 CHEMBL1969920,1 1,2 1,3 1,4 1,5 1,6 1,8 1,11 1,12 1,13 1,15 1,22 1,26 1,34 1,52 7.4}
{0 CHEMBL1969942,8 1,11 1,16 1,19 1,20 1,21 1,29 1,34 1,37 1,52 5.9}
{0 CHEMBL1970074,11 1,16 1,20 1,29 1,34 1,37 1,52 5.1}
{0 CHEMBL1970083,15 1,16 1,19 1,20 1,21 1,29 1,34 1,49 1,52 5.1}
{0 CHEMBL1970104,11 1,13 1,34 1,36 1,37 1,52 5.2}
{0 CHEMBL1970142,16 1,20 1,25 1,29 1,34 1,52 5.1}
{0 CHEMBL1970189,11 1,19 1,21 1,24 1,26 1,34 1,35 1,37 1,49 1,52 5.1}
{0 CHEMBL1970203,20 1,24 1,29 1,34 1,52 5.1}
{0 CHEMBL1970217,16 1,25 1,34 1,49 1,52 7.6}
{0 CHEMBL1970290,20 1,25 1,29 1,34 1,35 1,52 6.5}
{0 CHEMBL1970314,12 1,16 1,29 1,34 1,39 1,52 5.1}
{0 CHEMBL1970317,16 1,19 1,20 1,21 1,29 1,34 1,52 5.1}
{0 CHEMBL1970340,16 1,52 5.6}
{0 CHEMBL1970352,19 1,21 1,34 1,52 5.9}
{0 CHEMBL1970369,11 1,16 1,34 1,37 1,41 1,52 5.1}
{0 CHEMBL1970522,25 1,34 1,52 5.1}
{0 CHEMBL1970709,11 1,12 1,19 1,21 1,25 1,29 1,34 1,37 1,52 6.5}
{0 CHEMBL1970735,18 1,26 1,30 1,34 1,35 1,52 5.1}
{0 CHEMBL1970806,12 1,16 1,34 1,52 5.1}
{0 CHEMBL1970821,1 1,2 1,3 1,4 1,5 1,6 1,8 1,11 1,12 1,13 1,15 1,17 1,22 1,34 1,52 6.6}
{0 CHEMBL1970873,29 1,34 1,52 4.5}
{0 CHEMBL1970879,11 1,16 1,24 1,29 1,34 1,35 1,39 1,52 5.1}
{0 CHEMBL1970903,7 1,8 1,11 1,13 1,16 1,34 1,37 1,52 8.3}
{0 CHEMBL1970913,24 1,34 1,52 5.1}
{0 CHEMBL1970950,12 1,29 1,34 1,48 1,52 5.1}
{0 CHEMBL1971017,8 1,16 1,19 1,21 1,34 1,52 5.3}
{0 CHEMBL1971021,16 1,20 1,25 1,29 1,34 1,52 5.1}
{0 CHEMBL1971029,21 1,25 1,29 1,30 1,34 1,52 5.9}
{0 CHEMBL1971141,16 1,20 1,29 1,34 1,39 1,52 5.1}
{0 CHEMBL1971149,8 1,16 1,19 1,21 1,24 1,30 1,32 1,34 1,52 5.1}
{0 CHEMBL1971172,1 1,2 1,3 1,4 1,5 1,6 1,8 1,11 1,12 1,13 1,15 1,17 1,22 1,25 1,34 1,52 6.7}
{0 CHEMBL1971186,7 1,10 1,16 1,19 1,21 1,25 1,32 1,34 1,52 5.1}
{0 CHEMBL1971227,16 1,34 1,52 5.9}
{0 CHEMBL1971245,12 1,22 1,24 1,29 1,34 1,35 1,52 5.1}
{0 CHEMBL1971289,7 1,25 1,34 1,52 5.9}
{0 CHEMBL1971430,7 1,19 1,25 1,34 1,52 5.1}
{0 CHEMBL1971519,11 1,16 1,19 1,21 1,37 1,52 7.1}
{0 CHEMBL1971534,8 1,34 1,52 5.4}
{0 CHEMBL1971606,16 1,21 1,25 1,34 1,49 1,52 6}
{0 CHEMBL1971649,15 1,16 1,19 1,20 1,21 1,29 1,34 1,40 1,52 5.1}
{0 CHEMBL1971694,19 1,21 1,25 1,29 1,34 1,52 5.1}
{0 CHEMBL1971801,29 1,34 1,52 5.1}
{0 CHEMBL1971943,3 1,4 1,5 1,6 1,8 1,11 1,13 1,14 1,15 1,21 1,22 1,34 1,52 6.9}
{0 CHEMBL1971947,12 1,16 1,20 1,29 1,34 1,52 5.1}
{0 CHEMBL1971951,16 1,23 1,34 1,52 5.1}
{0 CHEMBL1972119,20 1,26 1,34 1,52 5.1}
{0 CHEMBL1972125,1 1,7 1,8 1,11 1,13 1,16 1,29 1,34 1,39 1,52 5.1}
{0 CHEMBL1972142,3 1,4 1,5 1,6 1,8 1,11 1,12 1,13 1,16 1,25 1,34 1,39 1,52 5.1}
{0 CHEMBL1972158,11 1,16 1,27 1,31 1,34 1,37 1,52 7.3}
{0 CHEMBL1972183,11 1,34 1,35 1,52 5.1}
{0 CHEMBL1972220,16 1,20 1,29 1,34 1,52 5.9}
{0 CHEMBL1972221,11 1,16 1,29 1,30 1,34 1,37 1,52 5.1}
{0 CHEMBL1972250,11 1,16 1,18 1,30 1,34 1,35 1,37 1,52 5.1}
{0 CHEMBL1972258,34 1,52 6.1}
{0 CHEMBL1972276,11 1,13 1,34 1,35 1,52 5.1}
{0 CHEMBL1972290,1 1,2 1,3 1,4 1,5 1,6 1,8 1,11 1,12 1,13 1,15 1,17 1,22 1,34 1,52 7.8}
{0 CHEMBL1972339,11 1,16 1,19 1,21 1,27 1,31 1,34 1,37 1,52 8.2}
{0 CHEMBL1972346,4 1,34 1,52 5.8}
{0 CHEMBL1972355,11 1,13 1,34 1,52 6.3}
{0 CHEMBL1972362,8 1,16 1,34 1,52 5.1}
{0 CHEMBL1972454,29 1,34 1,52 4.3}
{0 CHEMBL1972489,8 1,11 1,19 1,21 1,29 1,34 1,37 1,52 5.1}
{0 CHEMBL1972568,34 1,52 5.5}
{0 CHEMBL1972576,20 1,24 1,29 1,34 1,52 5.1}
{0 CHEMBL1972583,16 1,24 1,34 1,52 4.3}
{0 CHEMBL1972584,11 1,16 1,24 1,29 1,34 1,35 1,39 1,52 5.1}
{0 CHEMBL1972659,34 1,52 6.4}
{0 CHEMBL1972820,34 1,48 1,52 5.1}
{0 CHEMBL1972840,7 1,8 1,11 1,13 1,23 1,34 1,52 7.2}
{0 CHEMBL1972849,16 1,19 1,21 1,24 1,32 1,34 1,52 5.1}
{0 CHEMBL1972934,24 1,52 4.5}
{0 CHEMBL1972937,25 1,34 1,52 5.1}
{0 CHEMBL1972988,1 1,2 1,3 1,4 1,5 1,6 1,8 1,9 1,11 1,12 1,13 1,15 1,22 1,23 1,52 5.9}
{0 CHEMBL1973013,7 1,21 1,34 1,52 5.9}
{0 CHEMBL1973098,25 1,34 1,52 5.1}
{0 CHEMBL1973138,29 1,34 1,36 1,52 5.9}
{0 CHEMBL1973142,19 1,21 1,34 1,52 5.4}
{0 CHEMBL1973145,16 1,20 1,24 1,29 1,34 1,52 5.1}
{0 CHEMBL1973211,16 1,20 1,29 1,34 1,35 1,52 5.1}
{0 CHEMBL1973348,1 1,7 1,8 1,11 1,13 1,16 1,19 1,21 1,29 1,34 1,39 1,52 5.1}
{0 CHEMBL1973359,11 1,24 1,34 1,52 6.3}
{0 CHEMBL1973363,11 1,13 1,29 1,34 1,52 6}
{0 CHEMBL1973395,2 1,3 1,5 1,6 1,7 1,8 1,11 1,13 1,16 1,26 1,34 1,52 5.9}
{0 CHEMBL1973399,30 1,34 1,52 4.3}
{0 CHEMBL1973483,20 1,34 1,52 5.1}
{0 CHEMBL1973516,11 1,18 1,22 1,29 1,30 1,34 1,35 1,37 1,52 5.9}
{0 CHEMBL1973540,11 1,12 1,13 1,34 1,52 5.4}
{0 CHEMBL1973711,19 1,21 1,24 1,25 1,34 1,35 1,52 5.1}
{0 CHEMBL1973720,1 1,2 1,3 1,4 1,5 1,6 1,7 1,8 1,9 1,10 1,11 1,12 1,13 1,14 1,15 1,22 1,23 1,34 1,52 8.1}
{0 CHEMBL1973793,5 1,16 1,19 1,21 1,29 1,34 1,52 5.9}
{0 CHEMBL1973795,16 1,25 1,34 1,39 1,52 4.3}
{0 CHEMBL1973808,11 1,19 1,21 1,29 1,34 1,37 1,52 5.1}
{0 CHEMBL1973860,16 1,34 1,49 1,52 5.1}
{0 CHEMBL1973868,16 1,49 1,52 5.9}
{0 CHEMBL1973893,11 1,16 1,29 1,30 1,34 1,37 1,52 5.1}
{0 CHEMBL1973937,11 1,16 1,19 1,20 1,21 1,29 1,34 1,37 1,43 1,52 5.1}
{0 CHEMBL1973961,11 1,21 1,34 1,35 1,37 1,52 5.7}
{0 CHEMBL1974157,4 1,12 1,24 1,25 1,34 1,35 1,52 5.1}
{0 CHEMBL1974250,12 1,23 1,24 1,25 1,34 1,49 1,52 5.4}
{0 CHEMBL1974254,16 1,20 1,29 1,34 1,52 5.1}
{0 CHEMBL1974288,16 1,25 1,34 1,49 1,52 7.6}
{0 CHEMBL1974310,8 1,16 1,19 1,21 1,34 1,52 5.4}
{0 CHEMBL1974328,7 1,22 1,29 1,30 1,34 1,52 6.8}
{0 CHEMBL1974416,1 1,2 1,3 1,4 1,5 1,6 1,8 1,11 1,13 1,16 1,19 1,21 1,34 1,52 5.1}
{0 CHEMBL1974457,8 1,16 1,19 1,21 1,34 1,52 5.1}
{0 CHEMBL1974480,19 1,21 1,29 1,34 1,43 1,52 6}
{0 CHEMBL1974617,11 1,16 1,34 1,37 1,52 5.3}
{0 CHEMBL1974664,11 1,13 1,34 1,52 5.1}
{0 CHEMBL1974702,19 1,21 1,34 1,42 1,52 5.1}
{0 CHEMBL1974803,19 1,21 1,34 1,52 5.1}
{0 CHEMBL1974875,25 1,30 1,34 1,46 1,48 1,52 4.3}
{0 CHEMBL1974935,7 1,8 1,11 1,13 1,34 1,52 7.5}
{0 CHEMBL1975121,16 1,25 1,34 1,49 1,52 5.1}
{0 CHEMBL1975128,11 1,16 1,22 1,27 1,34 1,37 1,52 7}
{0 CHEMBL1975138,19 1,21 1,29 1,34 1,52 5.1}
{0 CHEMBL1975208,7 1,21 1,24 1,25 1,26 1,34 1,48 1,52 5.1}
{0 CHEMBL1975212,16 1,24 1,52 5.1}
{0 CHEMBL1975233,18 1,20 1,21 1,30 1,34 1,35 1,52 5.1}
{0 CHEMBL1975256,12 1,30 1,34 1,52 5.1}
{0 CHEMBL1975357,2 1,32 1,34 1,52 5.1}
{0 CHEMBL1975418,11 1,16 1,27 1,34 1,37 1,52 6.5}
{0 CHEMBL1975440,2 1,3 1,5 1,6 1,8 1,11 1,13 1,16 1,22 1,29 1,34 1,52 5.7}
{0 CHEMBL1975490,16 1,22 1,25 1,29 1,34 1,52 5.1}
{0 CHEMBL1975500,16 1,25 1,29 1,34 1,46 1,52 5.1}
{0 CHEMBL1975503,29 1,34 1,52 4.3}
{0 CHEMBL1975534,7 1,21 1,24 1,34 1,52 5.2}
{0 CHEMBL1975647,19 1,20 1,21 1,34 1,42 1,52 5.1}
{0 CHEMBL1975787,8 1,16 1,19 1,21 1,34 1,52 5.7}
{0 CHEMBL1975900,12 1,19 1,21 1,25 1,34 1,52 6.8}
{0 CHEMBL1975903,16 1,22 1,23 1,29 1,34 1,52 5.9}
{0 CHEMBL1975921,20 1,21 1,34 1,52 4.3}
{0 CHEMBL1975927,22 1,24 1,34 1,52 6.2}
{0 CHEMBL1976090,24 1,52 5.8}
{0 CHEMBL1976093,16 1,19 1,21 1,24 1,32 1,34 1,35 1,50 1,52 5.1}
{0 CHEMBL1976134,3 1,4 1,5 1,6 1,8 1,11 1,13 1,16 1,29 1,37 1,52 5.1}
{0 CHEMBL1976196,11 1,13 1,15 1,21 1,29 1,34 1,52 5.9}
{0 CHEMBL1976220,16 1,19 1,20 1,21 1,29 1,34 1,52 5.1}
{0 CHEMBL1976240,16 1,25 1,34 1,49 1,52 8.3}
{0 CHEMBL1976290,16 1,19 1,21 1,25 1,34 1,39 1,52 4.3}
{0 CHEMBL1976328,16 1,20 1,29 1,34 1,52 5.1}
{0 CHEMBL1976376,12 1,16 1,24 1,34 1,52 5.9}
{0 CHEMBL1976420,4 1,6 1,11 1,13 1,16 1,34 1,52 5.4}
{0 CHEMBL1976455,20 1,34 1,52 5.1}
{0 CHEMBL1976732,16 1,19 1,21 1,24 1,32 1,34 1,52 5.1}
{0 CHEMBL1976872,12 1,34 1,52 4.3}
{0 CHEMBL1976936,1 1,2 1,3 1,4 1,5 1,6 1,7 1,8 1,10 1,11 1,12 1,13 1,15 1,22 1,34 1,47 1,52 7.1}
{0 CHEMBL1977041,16 1,20 1,29 1,30 1,34 1,52 5.1}
{0 CHEMBL1977128,11 1,16 1,18 1,27 1,30 1,34 1,35 1,37 1,52 5.4}
{0 CHEMBL1977134,16 1,19 1,20 1,24 1,29 1,34 1,52 5.9}
{0 CHEMBL1977135,12 1,16 1,25 1,34 1,49 1,52 7}
{0 CHEMBL1977138,18 1,19 1,21 1,30 1,34 1,35 1,52 6.1}
{0 CHEMBL1977148,16 1,20 1,29 1,34 1,52 5.1}
{0 CHEMBL1977223,11 1,16 1,27 1,34 1,37 1,52 5.2}
{0 CHEMBL1977346,22 1,29 1,34 1,52 5.1}
{0 CHEMBL1977374,16 1,19 1,21 1,24 1,32 1,34 1,52 5.1}
{0 CHEMBL1977604,7 1,21 1,22 1,34 1,41 1,52 5.1}
{0 CHEMBL1977681,11 1,16 1,19 1,21 1,24 1,25 1,34 1,37 1,52 5.1}
{0 CHEMBL1977713,11 1,12 1,19 1,21 1,25 1,29 1,34 1,37 1,52 5.1}
{0 CHEMBL1977749,19 1,34 1,52 5.9}
{0 CHEMBL1977814,19 1,21 1,26 1,34 1,52 5.4}
{0 CHEMBL1977931,3 1,5 1,6 1,8 1,11 1,13 1,16 1,34 1,52 4.8}
{0 CHEMBL1978014,16 1,27 1,34 1,35 1,52 5.1}
{0 CHEMBL1978099,21 1,22 1,25 1,29 1,34 1,52 5.2}
{0 CHEMBL1978166,16 1,20 1,29 1,34 1,52 6.7}
{0 CHEMBL1978167,4 1,6 1,11 1,13 1,22 1,34 1,52 5.9}
{0 CHEMBL1978195,8 1,16 1,19 1,21 1,34 1,52 6.5}
{0 CHEMBL1978200,16 1,19 1,21 1,24 1,30 1,32 1,34 1,52 5.1}
{0 CHEMBL1978267,16 1,22 1,29 1,32 1,34 1,52 5.9}
{0 CHEMBL1978271,20 1,25 1,29 1,34 1,52 5.9}
{0 CHEMBL1978371,19 1,21 1,24 1,34 1,35 1,52 5.9}
{0 CHEMBL1978448,11 1,12 1,29 1,34 1,35 1,52 5.4}
{0 CHEMBL1978562,4 1,6 1,11 1,13 1,18 1,22 1,30 1,34 1,35 1,52 5.9}
{0 CHEMBL1978567,4 1,25 1,34 1,49 1,52 5.9}
{0 CHEMBL1978656,16 1,24 1,29 1,34 1,52 5.1}
{0 CHEMBL1979057,11 1,13 1,16 1,22 1,25 1,29 1,34 1,52 5.1}
{0 CHEMBL1979093,16 1,19 1,20 1,21 1,29 1,34 1,52 5.1}
{0 CHEMBL1979176,20 1,34 1,52 5.1}
{0 CHEMBL1979252,12 1,25 1,34 1,52 6.6}
{0 CHEMBL1979318,11 1,19 1,21 1,24 1,26 1,34 1,35 1,37 1,49 1,52 5.1}
{0 CHEMBL1979357,34 1,52 7.3}
{0 CHEMBL1979516,16 1,19 1,20 1,21 1,25 1,29 1,34 1,52 5.1}
{0 CHEMBL1979554,11 1,19 1,21 1,25 1,29 1,34 1,37 1,52 7.8}
{0 CHEMBL1979577,16 1,20 1,29 1,34 1,52 5.1}
{0 CHEMBL1979690,11 1,21 1,22 1,29 1,34 1,35 1,37 1,52 7}
{0 CHEMBL1979718,11 1,21 1,34 1,37 1,52 6.6}
{0 CHEMBL1979773,13 1,20 1,29 1,34 1,52 5.9}
{0 CHEMBL1979855,20 1,24 1,25 1,29 1,34 1,35 1,52 5.1}
{0 CHEMBL1979883,16 1,20 1,29 1,34 1,35 1,52 5.1}
{0 CHEMBL1979933,19 1,21 1,22 1,29 1,34 1,48 1,52 5.4}
{0 CHEMBL1979970,11 1,16 1,19 1,21 1,24 1,34 1,37 1,52 5.1}
{0 CHEMBL1980142,20 1,34 1,52 5.1}
{0 CHEMBL1980144,20 1,24 1,29 1,34 1,52 5.1}
{0 CHEMBL1980163,22 1,29 1,34 1,52 5.1}
{0 CHEMBL1980167,16 1,23 1,29 1,34 1,52 6}
{0 CHEMBL1980178,1 1,2 1,3 1,4 1,5 1,6 1,7 1,8 1,9 1,10 1,11 1,12 1,13 1,14 1,15 1,22 1,23 1,25 1,34 1,52 6.8}
{0 CHEMBL1980246,4 1,16 1,22 1,29 1,34 1,52 5.9}
{0 CHEMBL1980253,1 1,2 1,3 1,4 1,5 1,6 1,7 1,8 1,9 1,10 1,11 1,12 1,13 1,14 1,15 1,22 1,23 1,34 1,52 6.8}
{0 CHEMBL1980297,16 1,19 1,20 1,21 1,29 1,34 1,52 5.9}
{0 CHEMBL1980329,8 1,11 1,13 1,16 1,34 1,52 5.9}
{0 CHEMBL1980376,16 1,34 1,39 1,52 5}
{0 CHEMBL1980391,11 1,19 1,21 1,34 1,37 1,41 1,52 5.5}
{0 CHEMBL1980407,7 1,8 1,11 1,13 1,16 1,29 1,34 1,39 1,52 8.9}
{0 CHEMBL1980435,11 1,16 1,27 1,34 1,37 1,52 5.5}
{0 CHEMBL1980489,12 1,19 1,21 1,25 1,34 1,52 6.3}
{0 CHEMBL1980540,19 1,20 1,21 1,34 1,42 1,52 5.1}
{0 CHEMBL1980562,1 1,2 1,3 1,4 1,5 1,6 1,7 1,8 1,9 1,10 1,11 1,12 1,13 1,14 1,15 1,22 1,23 1,25 1,34 1,52 7.3}
{0 CHEMBL1980592,34 1,49 1,52 5.1}
{0 CHEMBL1980671,29 1,34 1,52 4.3}
{0 CHEMBL1980704,12 1,14 1,24 1,34 1,52 5.1}
{0 CHEMBL1980715,29 1,34 1,52 5.1}
{0 CHEMBL1980763,3 1,5 1,6 1,8 1,11 1,13 1,21 1,22 1,29 1,34 1,52 5.9}
{0 CHEMBL1980802,7 1,18 1,19 1,20 1,21 1,26 1,30 1,34 1,35 1,52 5.1}
{0 CHEMBL1980896,16 1,19 1,21 1,22 1,24 1,29 1,34 1,52 5.1}
{0 CHEMBL1980995,7 1,25 1,34 1,52 9.1}
{0 CHEMBL1981045,7 1,16 1,29 1,34 1,52 5.1}
{0 CHEMBL1981047,11 1,34 1,35 1,36 1,37 1,52 5.5}
{0 CHEMBL1981079,11 1,13 1,16 1,19 1,21 1,34 1,52 5.5}
{0 CHEMBL1981133,7 1,8 1,11 1,13 1,16 1,34 1,52 5.9}
{0 CHEMBL1981215,20 1,34 1,52 5.9}
{0 CHEMBL1981410,18 1,20 1,29 1,34 1,52 5.1}
{0 CHEMBL1981492,12 1,24 1,34 1,46 1,52 5}
{0 CHEMBL1981511,16 1,29 1,30 1,34 1,49 1,52 5.1}
{0 CHEMBL1981720,20 1,34 1,52 5.1}
{0 CHEMBL1981725,12 1,15 1,16 1,19 1,21 1,22 1,24 1,29 1,32 1,34 1,35 1,39 1,52 5.1}
{0 CHEMBL1981744,19 1,20 1,21 1,34 1,44 1,52 5.9}
{0 CHEMBL1981782,11 1,12 1,19 1,21 1,25 1,29 1,34 1,37 1,52 6.7}
{0 CHEMBL1981792,20 1,21 1,34 1,44 1,52 5.9}
{0 CHEMBL1982122,16 1,34 1,49 1,52 6.9}
{0 CHEMBL1982135,16 1,20 1,24 1,29 1,34 1,52 5.1}
{0 CHEMBL1982167,16 1,24 1,34 1,52 5.1}
{0 CHEMBL1982271,1 1,2 1,3 1,4 1,5 1,6 1,7 1,8 1,9 1,10 1,11 1,12 1,13 1,14 1,15 1,22 1,23 1,25 1,34 1,35 1,52 7.6}
{0 CHEMBL1982361,19 1,21 1,25 1,34 1,52 6.4}
{0 CHEMBL1982383,16 1,19 1,21 1,24 1,30 1,32 1,34 1,52 5.1}
{0 CHEMBL1982400,11 1,16 1,27 1,34 1,37 1,52 5.4}
{0 CHEMBL1982413,11 1,12 1,14 1,21 1,34 1,35 1,52 5.9}
{0 CHEMBL1982465,16 1,20 1,29 1,34 1,35 1,52 5.1}
{0 CHEMBL1982466,16 1,20 1,29 1,34 1,52 5.1}
{0 CHEMBL1982476,16 1,19 1,20 1,21 1,25 1,29 1,34 1,52 5.1}
{0 CHEMBL1982506,25 1,30 1,34 1,52 5.1}
{0 CHEMBL1982541,18 1,25 1,26 1,30 1,34 1,35 1,52 5.1}
{0 CHEMBL1982563,16 1,19 1,21 1,24 1,30 1,32 1,34 1,52 5.1}
{0 CHEMBL1982610,7 1,16 1,19 1,21 1,25 1,34 1,52 5.1}
{0 CHEMBL1982660,20 1,34 1,52 5.9}
{0 CHEMBL1982700,17 1,25 1,34 1,52 5.9}
{0 CHEMBL1982711,2 1,3 1,4 1,5 1,6 1,8 1,11 1,13 1,16 1,21 1,34 1,52 7.1}
{0 CHEMBL1982753,7 1,19 1,21 1,22 1,29 1,34 1,52 5.9}
{0 CHEMBL1982866,16 1,19 1,21 1,23 1,34 1,50 1,52 5.1}
{0 CHEMBL1982874,16 1,19 1,21 1,32 1,34 1,52 5.1}
{0 CHEMBL1982880,16 1,24 1,30 1,34 1,52 5.1}
{0 CHEMBL1982924,1 1,2 1,3 1,4 1,5 1,6 1,8 1,11 1,13 1,16 1,34 1,52 5.1}
{0 CHEMBL1982957,1 1,2 1,3 1,4 1,5 1,6 1,8 1,11 1,13 1,16 1,34 1,39 1,52 5.1}
{0 CHEMBL1982980,11 1,13 1,15 1,19 1,21 1,34 1,52 5.1}
{0 CHEMBL1982982,12 1,16 1,19 1,21 1,34 1,49 1,52 5.1}
{0 CHEMBL1982992,21 1,22 1,24 1,27 1,29 1,52 5.2}
{0 CHEMBL1983006,18 1,20 1,21 1,30 1,34 1,35 1,48 1,52 5.1}
{0 CHEMBL1983025,16 1,20 1,29 1,34 1,52 5.1}
{0 CHEMBL1983070,11 1,16 1,24 1,34 1,37 1,52 5.9}
{0 CHEMBL1983111,7 1,10 1,22 1,25 1,29 1,34 1,52 6.9}
{0 CHEMBL1983157,11 1,34 1,37 1,49 1,52 6.4}
{0 CHEMBL1983195,12 1,29 1,34 1,52 5.1}
{0 CHEMBL1983268,7 1,10 1,11 1,21 1,34 1,35 1,37 1,52 5.7}
{0 CHEMBL1983309,19 1,21 1,34 1,44 1,52 5.1}
{0 CHEMBL1983315,11 1,16 1,27 1,31 1,34 1,37 1,52 8.4}
{0 CHEMBL1983348,11 1,13 1,24 1,34 1,35 1,37 1,52 6}
{0 CHEMBL1983393,8 1,11 1,16 1,19 1,20 1,21 1,29 1,34 1,37 1,52 6.1}
{0 CHEMBL1983449,34 1,45 1,52 5.9}
{0 CHEMBL1983534,12 1,16 1,34 1,49 1,52 6.7}
{0 CHEMBL1983573,16 1,24 1,34 1,52 4.3}
{0 CHEMBL1983575,21 1,29 1,34 1,52 6.5}
{0 CHEMBL1983589,1 1,2 1,3 1,4 1,5 1,6 1,7 1,8 1,10 1,11 1,12 1,13 1,15 1,22 1,34 1,47 1,52 7.1}
{0 CHEMBL1983595,11 1,16 1,19 1,21 1,27 1,34 1,37 1,52 5.4}
{0 CHEMBL1983630,16 1,34 1,39 1,52 4.3}
{0 CHEMBL1983640,15 1,16 1,19 1,20 1,21 1,29 1,34 1,35 1,52 5.9}
{0 CHEMBL1983715,22 1,29 1,34 1,52 6.3}
{0 CHEMBL1983855,11 1,16 1,25 1,34 1,37 1,52 6.1}
{0 CHEMBL1983923,11 1,26 1,34 1,35 1,37 1,49 1,52 5.5}
{0 CHEMBL1983932,15 1,20 1,22 1,34 1,52 5.1}
{0 CHEMBL1983945,7 1,8 1,11 1,13 1,34 1,52 7.9}
{0 CHEMBL1983963,16 1,20 1,24 1,29 1,34 1,52 5.1}
{0 CHEMBL1983980,12 1,16 1,18 1,34 1,52 6}
{0 CHEMBL1984038,16 1,29 1,34 1,52 5.4}
{0 CHEMBL1984039,11 1,13 1,15 1,16 1,34 1,52 5.1}
{0 CHEMBL1984044,11 1,13 1,16 1,34 1,35 1,52 5.1}
{0 CHEMBL1984162,16 1,22 1,24 1,29 1,34 1,52 5.3}
{0 CHEMBL1984191,11 1,16 1,19 1,21 1,23 1,37 1,52 5.2}
{0 CHEMBL1984206,12 1,18 1,25 1,26 1,30 1,34 1,35 1,52 5.1}
{0 CHEMBL1984274,16 1,19 1,34 1,35 1,52 5.1}
{0 CHEMBL1984363,11 1,16 1,19 1,21 1,29 1,34 1,37 1,52 6.1}
{0 CHEMBL1984367,11 1,12 1,16 1,24 1,25 1,34 1,37 1,52 5.1}
{0 CHEMBL1984402,34 1,40 1,52 4.3}
{0 CHEMBL1984432,11 1,16 1,27 1,34 1,37 1,52 7}
{0 CHEMBL1984541,19 1,21 1,34 1,45 1,52 5.1}
{0 CHEMBL1984548,21 1,29 1,34 1,52 7.6}
{0 CHEMBL1984586,16 1,20 1,24 1,29 1,34 1,52 5.1}
{0 CHEMBL1984633,4 1,25 1,34 1,49 1,52 6.2}
{0 CHEMBL1984700,16 1,19 1,21 1,24 1,26 1,32 1,34 1,52 5.1}
{0 CHEMBL1984711,22 1,34 1,52 5.1}
{0 CHEMBL1984760,3 1,5 1,6 1,8 1,11 1,13 1,22 1,25 1,29 1,34 1,52 5.9}
{0 CHEMBL1984788,11 1,13 1,16 1,21 1,25 1,34 1,52 5.1}
{0 CHEMBL1984842,16 1,19 1,21 1,24 1,26 1,32 1,34 1,52 5.4}
{0 CHEMBL1984847,16 1,19 1,21 1,34 1,52 5.9}
{0 CHEMBL1985074,21 1,25 1,34 1,52 5.1}
{0 CHEMBL1985092,11 1,16 1,19 1,21 1,22 1,29 1,37 1,52 5.6}
{0 CHEMBL1985095,8 1,11 1,23 1,34 1,37 1,52 6.2}
{0 CHEMBL1985153,7 1,29 1,34 1,48 1,52 5.1}
{0 CHEMBL1985206,11 1,12 1,16 1,34 1,37 1,52 5.9}
{0 CHEMBL1985311,11 1,12 1,15 1,16 1,19 1,20 1,21 1,29 1,34 1,37 1,52 6.5}
{0 CHEMBL1985367,4 1,16 1,34 1,52 5.9}
{0 CHEMBL1985406,11 1,16 1,19 1,21 1,34 1,37 1,52 5.1}
{0 CHEMBL1985566,16 1,24 1,29 1,34 1,35 1,52 5.1}
{0 CHEMBL1985580,7 1,34 1,52 6.7}
{0 CHEMBL1985654,1 1,2 1,3 1,4 1,5 1,6 1,8 1,11 1,12 1,13 1,15 1,22 1,26 1,34 1,52 6.3}
{0 CHEMBL1985681,18 1,29 1,30 1,34 1,35 1,52 5.9}
{0 CHEMBL1985723,1 1,2 1,3 1,4 1,5 1,6 1,8 1,11 1,12 1,13 1,15 1,17 1,22 1,34 1,52 7.7}
{0 CHEMBL1986139,21 1,22 1,24 1,29 1,52 5.1}
{0 CHEMBL1986143,16 1,25 1,34 1,49 1,52 7.5}
{0 CHEMBL1986177,19 1,20 1,21 1,29 1,34 1,52 5.9}
{0 CHEMBL1986186,34 1,45 1,52 5.1}
{0 CHEMBL1986263,19 1,22 1,29 1,34 1,52 5.1}
{0 CHEMBL1986265,19 1,21 1,34 1,35 1,52 5.9}
{0 CHEMBL1986328,12 1,29 1,34 1,52 5.1}
{0 CHEMBL1986499,11 1,16 1,19 1,21 1,27 1,31 1,34 1,37 1,52 7.3}
{0 CHEMBL1986530,19 1,21 1,34 1,52 5.1}
{0 CHEMBL1986590,8 1,11 1,13 1,20 1,29 1,34 1,52 5.9}
{0 CHEMBL1986597,11 1,13 1,16 1,29 1,34 1,35 1,51 1,52 5.1}
{0 CHEMBL1986603,16 1,25 1,34 1,52 5.1}
{0 CHEMBL1986666,8 1,11 1,22 1,29 1,34 1,37 1,48 1,52 5.4}
{0 CHEMBL1986684,24 1,34 1,52 4.3}
{0 CHEMBL1986756,20 1,34 1,52 5.9}
{0 CHEMBL1986767,19 1,34 1,40 1,52 5.3}
{0 CHEMBL1986781,7 1,10 1,16 1,19 1,21 1,32 1,34 1,52 5.1}
{0 CHEMBL1986855,1 1,2 1,3 1,4 1,5 1,6 1,8 1,11 1,12 1,13 1,15 1,17 1,22 1,34 1,52 7.1}
{0 CHEMBL1986869,23 1,24 1,34 1,49 1,52 5.1}
{0 CHEMBL1986899,16 1,19 1,21 1,23 1,29 1,34 1,52 5.9}
{0 CHEMBL1986943,1 1,2 1,3 1,4 1,5 1,6 1,7 1,8 1,9 1,10 1,11 1,12 1,13 1,14 1,15 1,22 1,23 1,34 1,52 7.5}
{0 CHEMBL1986970,11 1,13 1,16 1,27 1,34 1,37 1,52 6.5}
{0 CHEMBL1987007,7 1,11 1,16 1,24 1,25 1,34 1,35 1,37 1,52 5.1}
{0 CHEMBL1987009,11 1,12 1,16 1,24 1,25 1,34 1,37 1,52 5.1}
{0 CHEMBL1987034,21 1,22 1,24 1,29 1,34 1,35 1,52 7}
{0 CHEMBL1987054,16 1,21 1,22 1,24 1,29 1,34 1,42 1,52 5.2}
{0 CHEMBL1987073,11 1,16 1,19 1,21 1,27 1,34 1,37 1,52 5.5}
{0 CHEMBL1987261,1 1,2 1,3 1,4 1,5 1,6 1,8 1,11 1,12 1,13 1,15 1,17 1,22 1,34 1,52 7.4}
{0 CHEMBL1987359,25 1,29 1,34 1,46 1,52 5.1}
{0 CHEMBL1987430,20 1,34 1,52 5.9}
{0 CHEMBL1987448,1 1,2 1,3 1,4 1,5 1,6 1,8 1,11 1,12 1,13 1,15 1,17 1,22 1,52 6.8}
{0 CHEMBL1987533,8 1,11 1,19 1,21 1,29 1,34 1,37 1,52 5.1}
{0 CHEMBL1987535,3 1,4 1,5 1,6 1,8 1,11 1,12 1,13 1,25 1,30 1,34 1,52 7.2}
{0 CHEMBL1987648,16 1,19 1,21 1,24 1,30 1,32 1,34 1,52 5.1}
{0 CHEMBL1987679,7 1,8 1,11 1,13 1,16 1,29 1,34 1,52 6.5}
{0 CHEMBL1987745,16 1,21 1,29 1,34 1,49 1,52 6.1}
{0 CHEMBL1987756,19 1,21 1,25 1,34 1,46 1,52 7.9}
{0 CHEMBL1987793,16 1,34 1,52 5.1}
{0 CHEMBL1987815,12 1,24 1,34 1,52 4.3}
{0 CHEMBL1987910,16 1,20 1,29 1,34 1,52 5.1}
{0 CHEMBL1987948,1 1,2 1,3 1,4 1,5 1,6 1,7 1,8 1,9 1,10 1,11 1,12 1,13 1,14 1,15 1,22 1,23 1,25 1,34 1,52 6.8}
{0 CHEMBL1987982,8 1,11 1,13 1,16 1,25 1,34 1,52 5.1}
{0 CHEMBL1988075,16 1,19 1,20 1,21 1,29 1,30 1,34 1,52 5.1}
{0 CHEMBL1988076,16 1,29 1,32 1,34 1,52 5.9}
{0 CHEMBL1988141,25 1,27 1,29 1,34 1,52 7}
{0 CHEMBL1988153,8 1,30 1,34 1,52 5.1}
{0 CHEMBL1988163,22 1,24 1,29 1,34 1,52 5.9}
{0 CHEMBL1988173,19 1,21 1,29 1,34 1,52 5.1}
{0 CHEMBL1988300,11 1,13 1,16 1,29 1,34 1,52 5.1}
{0 CHEMBL1988331,1 1,2 1,3 1,4 1,5 1,6 1,8 1,11 1,12 1,13 1,15 1,17 1,22 1,34 1,52 6.8}
{0 CHEMBL1988370,16 1,22 1,24 1,34 1,35 1,52 5.1}
{0 CHEMBL1988387,16 1,20 1,29 1,34 1,52 5.1}
{0 CHEMBL1988437,11 1,12 1,25 1,30 1,34 1,37 1,52 5.5}
{0 CHEMBL1988537,21 1,34 1,52 5.7}
{0 CHEMBL1988581,34 1,35 1,52 7.1}
{0 CHEMBL1988594,20 1,24 1,29 1,34 1,52 5.1}
{0 CHEMBL1988608,11 1,29 1,34 1,37 1,45 1,52 6.4}
{0 CHEMBL1988622,24 1,34 1,52 5.3}
{0 CHEMBL1988662,11 1,34 1,35 1,37 1,49 1,52 5.5}
{0 CHEMBL1988692,7 1,11 1,13 1,15 1,24 1,25 1,34 1,52 5.9}
{0 CHEMBL1988717,16 1,19 1,20 1,24 1,29 1,34 1,52 5.1}
{0 CHEMBL1988805,18 1,30 1,34 1,35 1,52 5.9}
{0 CHEMBL1988838,22 1,29 1,34 1,52 6.3}
{0 CHEMBL1988995,16 1,19 1,21 1,24 1,32 1,34 1,52 5.1}
{0 CHEMBL1989006,1 1,2 1,3 1,4 1,5 1,6 1,8 1,11 1,12 1,13 1,15 1,17 1,22 1,34 1,52 6.8}
{0 CHEMBL1989029,11 1,20 1,26 1,34 1,37 1,49 1,52 5.1}
{0 CHEMBL1989043,19 1,21 1,22 1,29 1,34 1,35 1,52 5.9}
{0 CHEMBL1989136,16 1,29 1,34 1,49 1,52 5.9}
{0 CHEMBL1989265,7 1,21 1,22 1,34 1,52 5.1}
{0 CHEMBL1989267,16 1,25 1,29 1,34 1,35 1,52 5.9}
{0 CHEMBL1989293,16 1,21 1,29 1,34 1,49 1,52 6}
{0 CHEMBL1989423,11 1,16 1,34 1,37 1,46 1,52 4.3}
{0 CHEMBL1989471,24 1,29 1,34 1,52 5.9}
{0 CHEMBL1989474,16 1,19 1,21 1,23 1,34 1,50 1,52 5.1}
{0 CHEMBL1989518,34 1,52 6.2}
{0 CHEMBL1989646,11 1,16 1,27 1,34 1,37 1,52 6.1}
{0 CHEMBL1989708,7 1,16 1,20 1,29 1,34 1,52 5.2}
{0 CHEMBL1989805,12 1,22 1,24 1,30 1,34 1,35 1,52 5.1}
{0 CHEMBL1989856,18 1,24 1,30 1,34 1,35 1,52 5.1}
{0 CHEMBL1989957,16 1,34 1,52 5.1}
{0 CHEMBL1990162,11 1,16 1,18 1,27 1,30 1,34 1,35 1,37 1,52 5.4}
{0 CHEMBL1990212,16 1,21 1,24 1,30 1,34 1,52 5.1}
{0 CHEMBL1990288,16 1,19 1,21 1,32 1,34 1,52 5.1}
{0 CHEMBL1990346,11 1,16 1,19 1,21 1,37 1,52 6.9}
{0 CHEMBL1990415,11 1,24 1,34 1,37 1,52 5.1}
{0 CHEMBL1990482,11 1,13 1,34 1,49 1,52 5.4}
{0 CHEMBL1990496,7 1,19 1,25 1,34 1,52 5.7}
{0 CHEMBL1990583,19 1,20 1,21 1,29 1,34 1,52 5.1}
{0 CHEMBL1990590,6 1,11 1,16 1,19 1,21 1,34 1,37 1,52 5.9}
{0 CHEMBL1990708,23 1,24 1,34 1,49 1,52 5.1}
{0 CHEMBL1990821,11 1,13 1,15 1,16 1,34 1,52 5.1}
{0 CHEMBL1990884,15 1,16 1,21 1,29 1,34 1,52 5.1}
{0 CHEMBL1990885,8 1,11 1,13 1,19 1,21 1,25 1,29 1,34 1,35 1,52 5.7}
{0 CHEMBL1990904,16 1,19 1,21 1,24 1,32 1,34 1,50 1,52 5.1}
{0 CHEMBL1990912,12 1,16 1,34 1,52 5.1}
{0 CHEMBL1991078,11 1,16 1,27 1,34 1,37 1,52 6.3}
{0 CHEMBL1991138,16 1,34 1,35 1,52 5.1}
{0 CHEMBL1991143,19 1,21 1,26 1,34 1,52 5.1}
{0 CHEMBL1991180,34 1,52 7.7}
{0 CHEMBL1991188,16 1,21 1,25 1,34 1,49 1,52 6.6}
{0 CHEMBL1991285,18 1,20 1,21 1,30 1,34 1,35 1,52 5.1}
{0 CHEMBL1991356,16 1,29 1,34 1,52 5.1}
{0 CHEMBL1991395,16 1,19 1,21 1,24 1,32 1,34 1,50 1,52 5.1}
{0 CHEMBL1991410,1 1,2 1,3 1,4 1,5 1,6 1,8 1,11 1,12 1,13 1,15 1,17 1,19 1,21 1,22 1,34 1,52 5.6}
{0 CHEMBL1991429,16 1,22 1,29 1,32 1,34 1,52 5.1}
{0 CHEMBL1991434,19 1,21 1,34 1,40 1,52 5.1}
{0 CHEMBL1991577,34 1,45 1,52 5.1}
{0 CHEMBL1991640,12 1,15 1,21 1,22 1,34 1,41 1,52 5.1}
{0 CHEMBL1991674,1 1,2 1,3 1,4 1,5 1,6 1,7 1,8 1,10 1,11 1,12 1,13 1,15 1,22 1,34 1,47 1,52 6.9}
{0 CHEMBL1991678,16 1,19 1,21 1,24 1,30 1,32 1,34 1,52 5.7}
{0 CHEMBL1991725,7 1,8 1,11 1,13 1,16 1,25 1,34 1,35 1,52 6.2}
{0 CHEMBL1991728,25 1,34 1,40 1,52 5.1}
{0 CHEMBL1991734,6 1,29 1,34 1,52 6.1}
{0 CHEMBL1991782,12 1,16 1,23 1,25 1,34 1,52 4.6}
{0 CHEMBL1991800,16 1,19 1,21 1,24 1,30 1,32 1,34 1,52 5.1}
{0 CHEMBL1991846,7 1,34 1,52 6.9}
{0 CHEMBL1991867,11 1,24 1,37 1,52 4.5}
{0 CHEMBL1992042,12 1,19 1,21 1,29 1,34 1,52 5.9}
{0 CHEMBL1992073,3 1,4 1,6 1,7 1,8 1,11 1,13 1,25 1,34 1,52 6.7}
{0 CHEMBL1992125,6 1,22 1,34 1,52 6}
{0 CHEMBL1992220,1 1,2 1,3 1,4 1,5 1,6 1,7 1,8 1,9 1,10 1,11 1,12 1,13 1,14 1,15 1,22 1,23 1,25 1,34 1,52 7.6}
{0 CHEMBL1992231,19 1,21 1,22 1,29 1,34 1,48 1,52 5.4}
{0 CHEMBL1992242,16 1,20 1,29 1,34 1,52 5.1}
{0 CHEMBL1992306,20 1,25 1,29 1,30 1,34 1,52 5.1}
{0 CHEMBL1992323,19 1,21 1,25 1,34 1,52 5.1}
{0 CHEMBL1992342,11 1,16 1,29 1,34 1,37 1,52 5.6}
{0 CHEMBL1992363,11 1,16 1,27 1,34 1,37 1,52 6.4}
{0 CHEMBL1992371,20 1,29 1,34 1,52 5.9}
{0 CHEMBL1992536,11 1,34 1,37 1,45 1,52 5.1}
{0 CHEMBL1992555,11 1,13 1,26 1,34 1,52 5.1}
{0 CHEMBL1992581,12 1,16 1,29 1,34 1,52 5.9}
{0 CHEMBL1992634,1 1,2 1,3 1,4 1,5 1,6 1,8 1,11 1,13 1,16 1,21 1,52 5.1}
{0 CHEMBL1992644,11 1,16 1,37 1,49 1,52 6.1}
{0 CHEMBL1992645,8 1,16 1,19 1,21 1,25 1,29 1,34 1,52 5.1}
{0 CHEMBL1992673,19 1,21 1,29 1,34 1,52 4.5}
{0 CHEMBL1992723,16 1,24 1,52 5}
{0 CHEMBL1992732,26 1,34 1,52 5.1}
{0 CHEMBL1992740,11 1,16 1,18 1,19 1,21 1,24 1,34 1,35 1,37 1,52 5.1}
{0 CHEMBL1992796,19 1,21 1,29 1,34 1,52 6}
{0 CHEMBL1992922,2 1,3 1,5 1,6 1,7 1,8 1,11 1,13 1,16 1,34 1,52 5.8}
{0 CHEMBL1992937,11 1,13 1,34 1,52 5.5}
{0 CHEMBL1993166,25 1,34 1,35 1,40 1,52 5.1}
{0 CHEMBL1993243,16 1,25 1,34 1,52 5.1}
{0 CHEMBL1993335,4 1,6 1,11 1,13 1,19 1,21 1,22 1,34 1,52 6}
{0 CHEMBL1993413,1 1,2 1,3 1,4 1,5 1,6 1,8 1,11 1,12 1,13 1,15 1,17 1,22 1,34 1,52 5.6}
{0 CHEMBL1993424,22 1,24 1,29 1,34 1,52 5.1}
{0 CHEMBL1993548,7 1,22 1,34 1,52 6.6}
{0 CHEMBL1993584,7 1,8 1,11 1,13 1,34 1,52 6.4}
{0 CHEMBL1993648,1 1,2 1,3 1,4 1,5 1,6 1,8 1,11 1,12 1,13 1,16 1,19 1,21 1,52 5.6}
{0 CHEMBL1993661,21 1,22 1,25 1,29 1,30 1,34 1,52 7.1}
{0 CHEMBL1993722,11 1,15 1,16 1,19 1,20 1,21 1,29 1,34 1,37 1,48 1,52 5.7}
{0 CHEMBL1993781,7 1,34 1,52 6.9}
{0 CHEMBL1993877,24 1,34 1,52 6.1}
{0 CHEMBL1993904,16 1,22 1,29 1,34 1,52 6.2}
{0 CHEMBL1993941,16 1,19 1,20 1,21 1,29 1,34 1,52 5.1}
{0 CHEMBL1994040,16 1,19 1,21 1,24 1,30 1,32 1,34 1,52 5.1}
{0 CHEMBL1994074,11 1,16 1,19 1,21 1,37 1,52 5.1}
{0 CHEMBL1994159,16 1,24 1,34 1,39 1,52 4.4}
{0 CHEMBL1994241,11 1,13 1,20 1,21 1,24 1,34 1,35 1,52 5.1}
{0 CHEMBL1994321,16 1,20 1,25 1,29 1,34 1,52 5.1}
{0 CHEMBL1994361,7 1,8 1,11 1,13 1,16 1,19 1,21 1,29 1,34 1,39 1,52 5.1}
{0 CHEMBL1994438,1 1,2 1,3 1,4 1,5 1,6 1,7 1,8 1,9 1,11 1,12 1,13 1,14 1,15 1,22 1,23 1,34 1,52 8.5}
{0 CHEMBL1994526,7 1,34 1,52 5.9}
{0 CHEMBL1994538,20 1,34 1,52 5.1}
{0 CHEMBL1994555,4 1,6 1,11 1,13 1,16 1,34 1,52 5.9}
{0 CHEMBL1994669,21 1,29 1,34 1,52 7.8}
{0 CHEMBL1994693,16 1,20 1,24 1,29 1,34 1,52 5.1}
{0 CHEMBL1994724,23 1,25 1,34 1,49 1,52 7.1}
{0 CHEMBL1994830,8 1,19 1,21 1,30 1,52 5.1}
{0 CHEMBL1994864,34 1,45 1,52 6}
{0 CHEMBL1994938,16 1,19 1,21 1,25 1,34 1,52 5.1}
{0 CHEMBL1994977,20 1,25 1,29 1,34 1,52 5.9}
{0 CHEMBL1995172,8 1,11 1,19 1,21 1,34 1,37 1,52 4.5}
{0 CHEMBL1995211,2 1,3 1,5 1,6 1,8 1,11 1,13 1,16 1,34 1,52 6.5}
{0 CHEMBL1995391,7 1,11 1,29 1,34 1,37 1,52 4.7}
{0 CHEMBL1995448,22 1,29 1,34 1,52 5.8}
{0 CHEMBL1995592,19 1,21 1,26 1,34 1,52 5.9}
{0 CHEMBL1995712,1 1,2 1,3 1,4 1,5 1,6 1,7 1,8 1,9 1,10 1,11 1,12 1,13 1,14 1,15 1,22 1,23 1,25 1,34 1,35 1,52 7.4}
{0 CHEMBL1995736,7 1,11 1,13 1,16 1,18 1,34 1,52 5.1}
{0 CHEMBL1995740,16 1,29 1,34 1,52 5.1}
{0 CHEMBL1995765,12 1,26 1,34 1,52 4.8}
{0 CHEMBL1995811,11 1,16 1,19 1,21 1,27 1,34 1,37 1,52 5.6}
{0 CHEMBL1995813,1 1,2 1,3 1,4 1,5 1,6 1,7 1,8 1,11 1,12 1,13 1,23 1,34 1,52 7.6}
{0 CHEMBL1995832,16 1,19 1,21 1,24 1,26 1,32 1,34 1,52 5.1}
{0 CHEMBL1995916,11 1,16 1,25 1,34 1,37 1,52 4.3}
{0 CHEMBL1995927,21 1,34 1,44 1,52 5.1}
{0 CHEMBL1995932,1 1,2 1,3 1,4 1,5 1,6 1,8 1,11 1,12 1,13 1,23 1,34 1,52 6.8}
{0 CHEMBL1996048,11 1,13 1,16 1,29 1,34 1,51 1,52 6.9}
{0 CHEMBL1996066,16 1,18 1,30 1,34 1,35 1,52 5.1}
{0 CHEMBL1996111,11 1,16 1,27 1,34 1,37 1,52 6.5}
{0 CHEMBL1996155,11 1,34 1,35 1,52 5.1}
{0 CHEMBL1996176,8 1,11 1,13 1,29 1,34 1,52 5.9}
{0 CHEMBL1996208,12 1,19 1,26 1,30 1,34 1,39 1,49 1,52 5.4}
{0 CHEMBL1996234,16 1,23 1,34 1,52 5.1}
{0 CHEMBL1996339,1 1,2 1,3 1,4 1,5 1,6 1,8 1,11 1,12 1,13 1,15 1,17 1,22 1,34 1,52 6.4}
{0 CHEMBL1996345,18 1,30 1,34 1,35 1,52 5.9}
{0 CHEMBL1996390,8 1,16 1,34 1,52 5.1}
{0 CHEMBL1996447,11 1,34 1,37 1,49 1,52 5.9}
{0 CHEMBL1996500,16 1,19 1,21 1,24 1,30 1,32 1,34 1,52 5.6}
{0 CHEMBL1996510,8 1,11 1,13 1,25 1,34 1,52 7.5}
{0 CHEMBL1996543,7 1,8 1,11 1,13 1,16 1,19 1,21 1,34 1,52 5.1}
{0 CHEMBL1996576,11 1,13 1,15 1,25 1,34 1,38 1,52 5.9}
{0 CHEMBL1996587,16 1,19 1,21 1,24 1,32 1,34 1,52 5.1}
{0 CHEMBL1996646,7 1,10 1,19 1,21 1,34 1,52 5.9}
{0 CHEMBL1996649,16 1,19 1,20 1,21 1,25 1,29 1,34 1,35 1,52 5.9}
{0 CHEMBL1996702,16 1,25 1,29 1,34 1,35 1,52 5.9}
{0 CHEMBL1996780,6 1,16 1,34 1,49 1,52 5.9}
{0 CHEMBL1996791,7 1,22 1,24 1,34 1,52 5.3}
{0 CHEMBL1996817,2 1,3 1,5 1,6 1,8 1,11 1,13 1,16 1,26 1,34 1,52 6}
{0 CHEMBL1996831,34 1,48 1,52 5.1}
{0 CHEMBL1996837,24 1,34 1,52 4.4}
{0 CHEMBL1996923,11 1,21 1,44 1,52 5.1}
{0 CHEMBL1996931,7 1,16 1,19 1,21 1,25 1,34 1,49 1,52 6.3}
{0 CHEMBL1996979,1 1,2 1,3 1,4 1,5 1,6 1,8 1,11 1,13 1,16 1,19 1,21 1,34 1,52 5.1}
{0 CHEMBL1996980,1 1,2 1,3 1,4 1,5 1,6 1,7 1,8 1,9 1,10 1,11 1,12 1,13 1,14 1,15 1,22 1,23 1,25 1,34 1,52 7.9}
{0 CHEMBL1997007,3 1,5 1,6 1,8 1,11 1,13 1,22 1,25 1,29 1,34 1,52 5.9}
{0 CHEMBL1997023,13 1,34 1,52 5.2}
{0 CHEMBL1997025,11 1,13 1,16 1,21 1,25 1,34 1,52 5.1}
{0 CHEMBL1997041,3 1,5 1,6 1,8 1,11 1,13 1,16 1,19 1,21 1,34 1,39 1,52 5.6}
{0 CHEMBL1997051,16 1,19 1,21 1,29 1,32 1,34 1,35 1,52 5.9}
{0 CHEMBL1997119,8 1,16 1,52 4.4}
{0 CHEMBL1997129,11 1,13 1,25 1,30 1,34 1,49 1,52 5.1}
{0 CHEMBL1997193,19 1,21 1,24 1,25 1,34 1,35 1,52 6.6}
{0 CHEMBL1997197,12 1,34 1,52 5.9}
{0 CHEMBL1997335,1 1,29 1,34 1,52 5.9}
{0 CHEMBL1997340,7 1,11 1,16 1,34 1,37 1,52 5.1}
{0 CHEMBL1997349,19 1,21 1,24 1,34 1,35 1,52 5.1}
{0 CHEMBL1997503,7 1,10 1,16 1,21 1,29 1,30 1,34 1,52 5.1}
{0 CHEMBL1997534,11 1,16 1,25 1,34 1,37 1,52 5.9}
{0 CHEMBL1997554,22 1,29 1,34 1,52 6.7}
{0 CHEMBL1997597,11 1,16 1,29 1,34 1,37 1,52 5.1}
{0 CHEMBL1997617,11 1,16 1,18 1,24 1,34 1,35 1,52 5.1}
{0 CHEMBL1997623,11 1,16 1,20 1,29 1,34 1,37 1,52 5.1}
{0 CHEMBL1997643,11 1,16 1,27 1,34 1,37 1,52 5.1}
{0 CHEMBL1997759,16 1,24 1,29 1,34 1,52 5.1}
{0 CHEMBL1997764,1 1,2 1,3 1,4 1,5 1,6 1,8 1,11 1,13 1,16 1,34 1,52 5.1}
{0 CHEMBL1997822,11 1,13 1,15 1,16 1,34 1,39 1,52 5.1}
{0 CHEMBL1997846,1 1,2 1,3 1,4 1,5 1,6 1,7 1,8 1,10 1,11 1,12 1,13 1,15 1,22 1,34 1,47 1,52 6.4}
{0 CHEMBL1997872,3 1,4 1,5 1,6 1,8 1,11 1,13 1,16 1,34 1,39 1,52 5.1}
{0 CHEMBL1997892,15 1,19 1,20 1,21 1,29 1,34 1,52 5.9}
{0 CHEMBL1997909,16 1,29 1,32 1,34 1,52 5.9}
{0 CHEMBL1997924,11 1,12 1,34 1,37 1,52 7.2}
{0 CHEMBL1998068,1 1,2 1,3 1,4 1,5 1,6 1,7 1,8 1,11 1,12 1,13 1,15 1,17 1,22 1,34 1,52 6.6}
{0 CHEMBL1998110,4 1,25 1,34 1,49 1,52 5.9}
{0 CHEMBL1998112,16 1,23 1,24 1,29 1,34 1,52 5.1}
{0 CHEMBL1998193,12 1,25 1,29 1,34 1,52 5.1}
{0 CHEMBL1998414,11 1,19 1,21 1,24 1,25 1,34 1,37 1,52 5.1}
{0 CHEMBL1998432,1 1,2 1,3 1,4 1,5 1,6 1,7 1,8 1,9 1,10 1,11 1,12 1,13 1,14 1,15 1,22 1,23 1,34 1,52 8}
{0 CHEMBL1998435,16 1,34 1,49 1,52 5.1}
{0 CHEMBL1998470,1 1,2 1,3 1,4 1,5 1,6 1,8 1,11 1,12 1,13 1,15 1,17 1,22 1,34 1,52 6.7}
{0 CHEMBL1998545,7 1,16 1,25 1,34 1,49 1,52 6.6}
{0 CHEMBL1998551,16 1,19 1,21 1,24 1,32 1,34 1,52 5.1}
{0 CHEMBL1998585,15 1,16 1,19 1,20 1,21 1,24 1,29 1,34 1,52 5.1}
{0 CHEMBL1998611,19 1,21 1,34 1,42 1,52 5.6}
{0 CHEMBL1998826,11 1,16 1,34 1,35 1,37 1,52 6.2}
{0 CHEMBL1998829,1 1,2 1,3 1,4 1,5 1,6 1,8 1,11 1,13 1,16 1,19 1,21 1,34 1,52 5.1}
{0 CHEMBL1998953,2 1,3 1,5 1,6 1,8 1,11 1,13 1,16 1,26 1,34 1,52 5.4}
{0 CHEMBL1999112,12 1,22 1,24 1,30 1,34 1,35 1,52 5.1}
{0 CHEMBL1999120,11 1,34 1,37 1,52 4.3}
{0 CHEMBL1999126,24 1,34 1,35 1,52 5.1}
{0 CHEMBL1999153,1 1,2 1,3 1,4 1,5 1,6 1,8 1,11 1,12 1,13 1,23 1,34 1,52 7.2}
{0 CHEMBL1999279,1 1,2 1,3 1,4 1,5 1,6 1,8 1,11 1,12 1,13 1,23 1,34 1,52 7.9}
{0 CHEMBL1999321,25 1,34 1,52 5.1}
{0 CHEMBL1999414,16 1,20 1,25 1,29 1,34 1,35 1,52 5.9}
{0 CHEMBL1999428,16 1,25 1,34 1,49 1,52 7.4}
{0 CHEMBL1999484,22 1,25 1,29 1,34 1,52 6.7}
{0 CHEMBL1999496,34 1,52 5.5}
{0 CHEMBL1999556,8 1,16 1,34 1,52 5.7}
{0 CHEMBL1999590,12 1,16 1,30 1,34 1,52 5.1}
{0 CHEMBL1999714,29 1,34 1,52 5.1}
{0 CHEMBL1999718,18 1,20 1,30 1,34 1,35 1,52 5.1}
{0 CHEMBL1999749,16 1,19 1,22 1,29 1,34 1,35 1,52 5.1}
{0 CHEMBL1999774,21 1,24 1,26 1,34 1,43 1,48 1,52 5.1}
{0 CHEMBL1999811,29 1,34 1,52 5.7}
{0 CHEMBL1999918,8 1,16 1,19 1,21 1,34 1,52 5.5}
{0 CHEMBL1999931,11 1,16 1,27 1,34 1,37 1,52 6.7}
{0 CHEMBL2000029,11 1,16 1,27 1,31 1,34 1,37 1,52 8.1}
{0 CHEMBL2000071,2 1,3 1,5 1,6 1,8 1,11 1,13 1,16 1,34 1,52 5.4}
{0 CHEMBL2000078,16 1,22 1,29 1,32 1,34 1,52 5.9}
{0 CHEMBL2000104,8 1,16 1,34 1,52 5.1}
{0 CHEMBL2000114,3 1,5 1,6 1,8 1,11 1,13 1,34 1,52 5.3}
{0 CHEMBL2000271,11 1,16 1,34 1,37 1,52 8.4}
{0 CHEMBL2000335,16 1,20 1,24 1,29 1,34 1,52 5.1}
{0 CHEMBL2000345,11 1,13 1,20 1,21 1,24 1,34 1,35 1,52 5.1}
{0 CHEMBL2000354,25 1,34 1,52 5.1}
{0 CHEMBL2000393,19 1,21 1,26 1,34 1,44 1,52 5.1}
{0 CHEMBL2000408,16 1,19 1,21 1,24 1,32 1,34 1,52 5.1}
{0 CHEMBL2000429,16 1,19 1,21 1,24 1,26 1,32 1,34 1,52 5.1}
{0 CHEMBL2000433,18 1,24 1,30 1,34 1,35 1,52 5.1}
{0 CHEMBL2000481,1 1,25 1,29 1,34 1,46 1,52 5.3}
{0 CHEMBL2000508,16 1,19 1,21 1,32 1,49 1,52 5.1}
{0 CHEMBL2000568,3 1,4 1,5 1,6 1,8 1,11 1,13 1,16 1,34 1,39 1,52 5.4}
{0 CHEMBL2000685,34 1,40 1,52 5.8}
{0 CHEMBL2000724,6 1,11 1,16 1,18 1,30 1,34 1,35 1,37 1,52 5.9}
{0 CHEMBL2000801,16 1,19 1,20 1,21 1,29 1,34 1,52 5.1}
{0 CHEMBL2000832,12 1,16 1,19 1,21 1,25 1,29 1,34 1,52 5.1}
{0 CHEMBL2000879,11 1,34 1,37 1,52 4.5}
{0 CHEMBL2000894,6 1,16 1,34 1,49 1,52 6.1}
{0 CHEMBL2001019,12 1,24 1,34 1,52 5.9}
{0 CHEMBL2001224,18 1,20 1,21 1,30 1,34 1,35 1,52 5.1}
{0 CHEMBL2001228,16 1,19 1,21 1,22 1,29 1,32 1,34 1,52 5.9}
{0 CHEMBL2001239,16 1,19 1,21 1,22 1,25 1,34 1,52 5.1}
{0 CHEMBL2001257,16 1,20 1,29 1,34 1,35 1,52 5.1}
{0 CHEMBL2001288,7 1,22 1,24 1,34 1,52 5.1}
{0 CHEMBL2001477,12 1,16 1,34 1,49 1,52 5.1}
{0 CHEMBL2001485,16 1,20 1,29 1,34 1,52 5.1}
{0 CHEMBL2001539,11 1,30 1,34 1,37 1,49 1,52 4.8}
{0 CHEMBL2001547,16 1,19 1,21 1,24 1,30 1,32 1,34 1,52 5.1}
{0 CHEMBL2001584,29 1,34 1,36 1,52 5.9}
{0 CHEMBL2001613,11 1,19 1,21 1,37 1,52 4.7}
{0 CHEMBL2001641,11 1,34 1,37 1,52 5}
{0 CHEMBL2001668,7 1,16 1,25 1,34 1,52 5.1}
{0 CHEMBL2001751,7 1,8 1,11 1,12 1,13 1,16 1,29 1,30 1,34 1,39 1,52 7.9}
{0 CHEMBL2001920,19 1,21 1,25 1,29 1,34 1,52 5.1}
{0 CHEMBL2001923,3 1,8 1,16 1,21 1,29 1,34 1,52 5.4}
{0 CHEMBL2001957,16 1,19 1,21 1,24 1,26 1,32 1,34 1,52 5.1}
{0 CHEMBL2001987,19 1,20 1,21 1,34 1,42 1,52 5.9}
{0 CHEMBL2001998,11 1,16 1,18 1,25 1,30 1,34 1,35 1,37 1,39 1,52 5.1}
{0 CHEMBL2002099,3 1,5 1,6 1,8 1,11 1,13 1,24 1,34 1,35 1,52 6.7}
{0 CHEMBL2002105,11 1,21 1,24 1,37 1,52 4.4}
{0 CHEMBL2002165,7 1,16 1,19 1,20 1,21 1,29 1,34 1,52 5.1}
{0 CHEMBL2002202,16 1,19 1,21 1,25 1,34 1,39 1,52 4.3}
{0 CHEMBL2002240,16 1,18 1,30 1,34 1,35 1,52 5.1}
{0 CHEMBL2002322,8 1,34 1,39 1,52 5.1}
{0 CHEMBL2002323,16 1,19 1,21 1,24 1,34 1,39 1,52 5.1}
{0 CHEMBL2002346,1 1,2 1,3 1,4 1,5 1,6 1,8 1,11 1,12 1,13 1,23 1,34 1,52 7.2}
{0 CHEMBL2002373,16 1,32 1,34 1,49 1,52 5.1}
{0 CHEMBL2002407,11 1,18 1,20 1,24 1,30 1,34 1,35 1,37 1,52 5.1}
{0 CHEMBL2002432,7 1,16 1,34 1,52 5.9}
{0 CHEMBL2002446,11 1,16 1,18 1,19 1,30 1,34 1,35 1,37 1,52 5.1}
{0 CHEMBL2002450,16 1,29 1,34 1,52 4.3}
{0 CHEMBL2002456,11 1,34 1,37 1,49 1,52 6.8}
{0 CHEMBL2002479,16 1,19 1,21 1,22 1,25 1,29 1,34 1,44 1,52 5.1}
{0 CHEMBL2002586,7 1,10 1,21 1,22 1,29 1,34 1,52 5.9}
{0 CHEMBL2002599,20 1,34 1,52 5.9}
{0 CHEMBL2002613,11 1,16 1,27 1,34 1,37 1,52 5.4}
{0 CHEMBL2002649,8 1,11 1,13 1,29 1,34 1,52 5.1}
{0 CHEMBL2002682,11 1,13 1,15 1,16 1,19 1,21 1,25 1,34 1,52 5.1}
{0 CHEMBL2002690,16 1,20 1,29 1,34 1,52 5.9}
{0 CHEMBL2002702,8 1,11 1,13 1,29 1,34 1,52 5.1}
{0 CHEMBL2002723,7 1,24 1,29 1,34 1,46 1,52 5.9}
{0 CHEMBL2002726,7 1,11 1,16 1,34 1,37 1,52 7.7}
{0 CHEMBL2002992,3 1,4 1,5 1,6 1,7 1,8 1,11 1,13 1,34 1,52 7.1}
{0 CHEMBL2003229,11 1,34 1,37 1,49 1,52 6.3}
{0 CHEMBL2003271,19 1,21 1,34 1,52 5.5}
{0 CHEMBL2003286,25 1,34 1,52 5.1}
{0 CHEMBL2003341,16 1,21 1,25 1,34 1,49 1,52 6.7}
{0 CHEMBL2003420,12 1,25 1,34 1,52 5.1}
{0 CHEMBL2003456,16 1,20 1,34 1,52 5.1}
{0 CHEMBL2003482,11 1,19 1,21 1,34 1,37 1,52 5.1}
{0 CHEMBL2003514,4 1,25 1,34 1,49 1,52 6.9}
{0 CHEMBL2003524,25 1,34 1,52 5.1}
{0 CHEMBL2003637,16 1,21 1,24 1,26 1,30 1,34 1,52 5.1}
{0 CHEMBL2003638,11 1,16 1,19 1,21 1,27 1,34 1,37 1,52 5.9}
{0 CHEMBL2003657,10 1,16 1,19 1,21 1,32 1,34 1,52 5.1}
{0 CHEMBL2003682,2 1,12 1,19 1,21 1,25 1,34 1,52 5.2}
{0 CHEMBL2003768,34 1,45 1,52 5.2}
{0 CHEMBL2003785,6 1,11 1,12 1,13 1,19 1,21 1,34 1,52 5}
{0 CHEMBL2003817,20 1,34 1,52 5.1}
{0 CHEMBL2004025,16 1,29 1,34 1,47 1,52 6}
{0 CHEMBL2004072,8 1,16 1,19 1,21 1,34 1,52 5.1}
{0 CHEMBL2004118,3 1,5 1,6 1,8 1,11 1,13 1,21 1,22 1,29 1,34 1,52 5.9}
{0 CHEMBL2004156,16 1,19 1,21 1,23 1,24 1,52 5.1}
{0 CHEMBL2004159,4 1,12 1,25 1,34 1,49 1,52 6.5}
{0 CHEMBL2004290,16 1,20 1,29 1,34 1,52 5.4}
{0 CHEMBL2004311,16 1,20 1,25 1,29 1,34 1,52 5.1}
{0 CHEMBL2004355,12 1,18 1,25 1,26 1,30 1,34 1,35 1,52 5.1}
{0 CHEMBL2004365,12 1,22 1,30 1,34 1,52 5.1}
{0 CHEMBL2004419,16 1,19 1,21 1,32 1,34 1,42 1,52 5.1}
{0 CHEMBL2004438,16 1,20 1,29 1,34 1,40 1,52 5.4}
{0 CHEMBL2004443,16 1,19 1,21 1,23 1,24 1,52 5.1}
{0 CHEMBL2004447,11 1,19 1,21 1,24 1,26 1,34 1,35 1,37 1,49 1,52 5.1}
{0 CHEMBL2004513,16 1,29 1,34 1,52 5.1}
{0 CHEMBL2004515,3 1,5 1,6 1,8 1,11 1,13 1,16 1,34 1,52 5.8}
{0 CHEMBL2004544,12 1,29 1,34 1,52 5.1}
{0 CHEMBL2004615,12 1,26 1,34 1,47 1,52 5.4}
{0 CHEMBL2004631,11 1,16 1,27 1,34 1,37 1,52 6.2}
{0 CHEMBL2004637,20 1,29 1,34 1,52 6.2}
{0 CHEMBL2004647,7 1,21 1,24 1,25 1,26 1,34 1,48 1,52 5.1}
{0 CHEMBL2004692,12 1,16 1,30 1,34 1,52 5.1}
{0 CHEMBL2004716,16 1,20 1,25 1,29 1,34 1,35 1,52 5.1}
{0 CHEMBL2004771,16 1,22 1,25 1,29 1,34 1,52 5.1}
{0 CHEMBL2004871,16 1,19 1,21 1,32 1,34 1,49 1,52 5.1}
{0 CHEMBL2004872,16 1,23 1,25 1,34 1,52 6.4}
{0 CHEMBL2004892,11 1,16 1,29 1,34 1,37 1,52 5.1}
{0 CHEMBL2004934,16 1,21 1,25 1,34 1,49 1,52 7.3}
{0 CHEMBL2005112,19 1,21 1,24 1,34 1,35 1,52 5.1}
{0 CHEMBL2005186,4 1,7 1,11 1,16 1,22 1,25 1,29 1,34 1,37 1,52 5.1}
{0 CHEMBL2005216,1 1,2 1,3 1,4 1,5 1,6 1,7 1,8 1,10 1,11 1,12 1,13 1,15 1,22 1,25 1,34 1,47 1,52 7.2}
{0 CHEMBL2005375,7 1,25 1,26 1,29 1,34 1,50 1,52 5.1}
{0 CHEMBL2005387,1 1,2 1,3 1,4 1,5 1,6 1,8 1,11 1,12 1,13 1,15 1,17 1,22 1,34 1,52 6.5}
{0 CHEMBL2005449,11 1,12 1,14 1,15 1,22 1,34 1,37 1,52 5.9}
{0 CHEMBL2005475,11 1,16 1,24 1,25 1,34 1,37 1,52 5.1}
{0 CHEMBL2005478,4 1,6 1,11 1,13 1,22 1,34 1,52 5.9}
{0 CHEMBL2005482,15 1,16 1,19 1,21 1,22 1,29 1,32 1,34 1,52 5.9}
{0 CHEMBL2005509,1 1,2 1,3 1,4 1,5 1,6 1,7 1,8 1,9 1,10 1,11 1,12 1,13 1,14 1,15 1,22 1,23 1,25 1,34 1,52 7.5}
{0 CHEMBL2005528,11 1,13 1,15 1,25 1,34 1,52 5.1}
{0 CHEMBL2005548,19 1,21 1,25 1,29 1,34 1,52 6.1}
{0 CHEMBL2005631,15 1,16 1,19 1,20 1,21 1,25 1,29 1,34 1,52 5.1}
{0 CHEMBL2005699,21 1,34 1,52 5.9}
{0 CHEMBL2005718,1 1,2 1,3 1,4 1,5 1,6 1,8 1,11 1,12 1,13 1,15 1,17 1,22 1,25 1,34 1,46 1,52 7.4}
{0 CHEMBL2005792,16 1,19 1,21 1,24 1,26 1,32 1,34 1,52 5.4}
{0 CHEMBL2005828,16 1,20 1,24 1,29 1,34 1,52 5.1}
{0 CHEMBL2005886,11 1,13 1,19 1,21 1,25 1,34 1,35 1,52 6}
{0 CHEMBL2005899,34 1,52 5.1}
{0 CHEMBL2005936,11 1,16 1,27 1,31 1,34 1,37 1,52 7.2}
{0 CHEMBL2006010,19 1,20 1,21 1,34 1,52 5.1}
{0 CHEMBL2006156,12 1,29 1,34 1,52 5.1}
{0 CHEMBL2006188,16 1,25 1,34 1,49 1,52 7.1}
{0 CHEMBL2006237,11 1,13 1,18 1,34 1,35 1,52 5.1}
{0 CHEMBL2006263,29 1,34 1,52 5.1}
{0 CHEMBL2006276,22 1,29 1,34 1,52 5.1}
{0 CHEMBL2006299,12 1,16 1,25 1,34 1,49 1,52 7.4}
{0 CHEMBL2006439,1 1,2 1,3 1,4 1,5 1,6 1,7 1,8 1,9 1,10 1,11 1,12 1,13 1,14 1,15 1,22 1,23 1,34 1,52 6.6}
{0 CHEMBL2006450,1 1,2 1,3 1,4 1,5 1,6 1,8 1,11 1,12 1,13 1,15 1,17 1,22 1,34 1,52 6.5}
{0 CHEMBL2006456,1 1,2 1,3 1,4 1,5 1,6 1,7 1,8 1,9 1,10 1,11 1,12 1,13 1,14 1,15 1,22 1,23 1,25 1,34 1,52 7.2}
{0 CHEMBL2006481,11 1,16 1,34 1,37 1,52 5.1}
{0 CHEMBL2006493,34 1,52 5.1}
{0 CHEMBL2006564,7 1,10 1,11 1,13 1,22 1,24 1,29 1,32 1,34 1,52 6.1}
{0 CHEMBL2006567,18 1,30 1,34 1,35 1,49 1,52 5.1}
{0 CHEMBL2006580,21 1,22 1,24 1,29 1,52 5.1}
{0 CHEMBL2006581,21 1,25 1,26 1,34 1,52 5.1}
{0 CHEMBL2006674,24 1,26 1,34 1,49 1,52 5.9}
{0 CHEMBL2006715,16 1,19 1,21 1,22 1,29 1,32 1,34 1,52 5.1}
{0 CHEMBL2006765,3 1,5 1,6 1,8 1,11 1,13 1,22 1,25 1,29 1,34 1,49 1,52 6.6}
{0 CHEMBL2006778,11 1,13 1,15 1,21 1,25 1,34 1,52 5.1}
{0 CHEMBL2006785,18 1,19 1,21 1,34 1,35 1,52 5.1}
{0 CHEMBL2006836,24 1,34 1,35 1,48 1,52 5.1}
{0 CHEMBL2006933,34 1,52 6.2}
{0 CHEMBL2007002,11 1,16 1,29 1,34 1,37 1,52 5.1}
{0 CHEMBL2007044,11 1,16 1,18 1,30 1,34 1,35 1,37 1,39 1,52 5.1}
{0 CHEMBL2007064,8 1,11 1,13 1,29 1,34 1,52 5.1}
{0 CHEMBL2007097,34 1,52 4.3}
{0 CHEMBL2007124,20 1,29 1,34 1,52 5.9}
{0 CHEMBL2007138,25 1,29 1,34 1,52 4.7}
{0 CHEMBL2007151,11 1,16 1,24 1,34 1,35 1,52 5.1}
{0 CHEMBL2007266,11 1,12 1,15 1,16 1,19 1,20 1,21 1,29 1,34 1,37 1,52 5.9}
{0 CHEMBL2007296,16 1,25 1,34 1,49 1,52 5.9}
{0 CHEMBL2007372,16 1,18 1,19 1,21 1,24 1,26 1,32 1,34 1,52 5.1}
{0 CHEMBL2007375,20 1,34 1,52 5.9}
{0 CHEMBL2007421,11 1,19 1,21 1,26 1,30 1,34 1,37 1,52 5.9}
{0 CHEMBL2007479,1 1,34 1,52 5.9}
{0 CHEMBL2007559,22 1,25 1,29 1,34 1,49 1,52 5.9}
{0 CHEMBL2007574,1 1,2 1,3 1,4 1,5 1,6 1,8 1,9 1,11 1,12 1,13 1,14 1,15 1,22 1,23 1,52 7.7}
{0 CHEMBL2007592,16 1,34 1,52 5.1}
{0 CHEMBL2012519,7 1,34 1,52 5}
{0 CHEMBL2017214,19 1,25 1,29 1,34 1,52 4.398}
{0 CHEMBL202721,22 1,29 1,34 1,35 1,52 5.9}
{0 CHEMBL2031893,21 1,29 1,34 1,40 1,52 4}
{0 CHEMBL2063926,11 1,19 1,25 1,29 1,34 1,35 1,52 5}
{0 CHEMBL207253,19 1,21 1,26 1,34 1,52 5.1}
{0 CHEMBL207400,19 1,21 1,26 1,34 1,52 5.1}
{0 CHEMBL207995,18 1,20 1,21 1,30 1,34 1,35 1,52 5.1}
{0 CHEMBL208637,18 1,26 1,30 1,34 1,35 1,52 5.1}
{0 CHEMBL209534,12 1,18 1,25 1,26 1,30 1,34 1,35 1,52 5.1}
{0 CHEMBL210032,16 1,18 1,30 1,34 1,35 1,52 5.1}
{0 CHEMBL210618,18 1,26 1,30 1,34 1,35 1,52 5.1}
{0 CHEMBL210887,34 1,52 5.1}
{0 CHEMBL210928,21 1,26 1,34 1,52 5.1}
{0 CHEMBL210963,18 1,26 1,30 1,34 1,35 1,52 5.1}
{0 CHEMBL211378,16 1,20 1,24 1,29 1,34 1,52 5.1}
{0 CHEMBL21156,11 1,13 1,19 1,21 1,25 1,34 1,52 6.3}
{0 CHEMBL213207,1 1,2 1,3 1,4 1,5 1,6 1,8 1,11 1,12 1,13 1,23 1,34 1,52 6.7}
{0 CHEMBL213505,16 1,20 1,24 1,29 1,34 1,52 5.1}
{0 CHEMBL215152,11 1,19 1,21 1,29 1,34 1,35 1,37 1,52 5.25}
{0 CHEMBL219722,11 1,16 1,20 1,29 1,34 1,37 1,52 5.7}
{0 CHEMBL220057,11 1,16 1,20 1,29 1,34 1,37 1,52 5.6}
{0 CHEMBL220241,2 1,8 1,26 1,27 1,29 1,34 1,35 1,52 7.5}
{0 CHEMBL221959,3 1,5 1,6 1,8 1,11 1,13 1,24 1,26 1,34 1,35 1,43 1,52 5}
{0 CHEMBL223257,7 1,18 1,20 1,21 1,26 1,30 1,34 1,35 1,52 5.1}
{0 CHEMBL223360,11 1,15 1,16 1,19 1,20 1,21 1,29 1,34 1,37 1,52 5.531}
{0 CHEMBL223367,18 1,20 1,21 1,26 1,30 1,34 1,35 1,52 5.1}
{0 CHEMBL223460,15 1,18 1,20 1,21 1,26 1,30 1,34 1,35 1,52 5.1}
{0 CHEMBL225519,11 1,13 1,25 1,34 1,49 1,52 5.35}
{0 CHEMBL226232,11 1,13 1,15 1,22 1,25 1,34 1,49 1,52 5.1}
{0 CHEMBL226403,11 1,13 1,23 1,25 1,34 1,49 1,52 5.1}
{0 CHEMBL226471,11 1,13 1,16 1,19 1,21 1,23 1,25 1,34 1,49 1,52 5.1}
{0 CHEMBL230011,16 1,24 1,32 1,52 5}
{0 CHEMBL2309006,25 1,34 1,40 1,52 6.658}
{0 CHEMBL2309609,25 1,34 1,41 1,52 6.143}
{0 CHEMBL231209,16 1,19 1,20 1,21 1,29 1,34 1,52 5.1}
{0 CHEMBL234085,3 1,5 1,6 1,8 1,11 1,13 1,24 1,26 1,34 1,35 1,43 1,52 5.5}
{0 CHEMBL235157,29 1,34 1,52 5.9}
{0 CHEMBL242865,22 1,29 1,34 1,48 1,52 5.9}
{0 CHEMBL243088,22 1,27 1,29 1,34 1,48 1,52 5.7}
{0 CHEMBL243298,19 1,21 1,22 1,29 1,34 1,48 1,52 6.2}
{0 CHEMBL243518,21 1,22 1,29 1,34 1,48 1,52 5.1}
{0 CHEMBL244378,8 1,11 1,22 1,29 1,34 1,37 1,48 1,52 6}
{0 CHEMBL246970,19 1,21 1,34 1,52 5.3}
{0 CHEMBL24828,15 1,19 1,21 1,29 1,34 1,35 1,52 5.45}
{0 CHEMBL248757,15 1,18 1,20 1,21 1,26 1,30 1,34 1,35 1,36 1,52 5.1}
{0 CHEMBL249282,11 1,16 1,18 1,30 1,34 1,35 1,37 1,52 5.1}
{0 CHEMBL249697,24 1,26 1,34 1,52 5}
{0 CHEMBL253969,21 1,25 1,26 1,34 1,35 1,52 5.6}
{0 CHEMBL255863,12 1,16 1,23 1,34 1,52 5}
{0 CHEMBL256835,7 1,16 1,18 1,19 1,21 1,32 1,34 1,52 5.1}
{0 CHEMBL259084,16 1,19 1,21 1,22 1,29 1,34 1,48 1,52 5.35}
{0 CHEMBL259850,12 1,25 1,34 1,52 5.1}
{0 CHEMBL259922,24 1,34 1,52 5.1}
{0 CHEMBL260092,20 1,29 1,34 1,52 5.1}
{0 CHEMBL260135,11 1,16 1,24 1,37 1,52 5.3}
{0 CHEMBL261849,34 1,52 5.45}
{0 CHEMBL262433,15 1,16 1,19 1,20 1,21 1,24 1,29 1,34 1,52 5.1}
{0 CHEMBL262623,34 1,52 4.9}
{0 CHEMBL262980,7 1,25 1,34 1,48 1,52 5.585}
{0 CHEMBL263910,7 1,25 1,34 1,48 1,52 4.495}
{0 CHEMBL271381,16 1,19 1,20 1,21 1,29 1,34 1,52 5.1}
{0 CHEMBL272453,16 1,20 1,21 1,29 1,34 1,52 5.1}
{0 CHEMBL274064,16 1,19 1,21 1,25 1,32 1,34 1,52 5.8}
{0 CHEMBL278041,11 1,13 1,16 1,19 1,21 1,49 1,52 5.77}
{0 CHEMBL279185,7 1,10 1,24 1,25 1,28 1,34 1,52 6.963}
{0 CHEMBL288441,15 1,18 1,21 1,30 1,34 1,35 1,52 5}
{0 CHEMBL289959,22 1,29 1,52 4.4}
{0 CHEMBL296468,25 1,26 1,34 1,52 5.35}
{0 CHEMBL296586,11 1,13 1,16 1,19 1,21 1,29 1,34 1,52 5.1}
{0 CHEMBL297394,7 1,10 1,24 1,25 1,28 1,33 1,34 1,52 4.699}
{0 CHEMBL300138,12 1,19 1,25 1,30 1,34 1,35 1,52 6.481}
{0 CHEMBL302449,24 1,25 1,34 1,35 1,52 6.8}
{0 CHEMBL304549,7 1,25 1,34 1,48 1,52 5.854}
{0 CHEMBL305718,7 1,25 1,34 1,48 1,52 4.42}
{0 CHEMBL306373,7 1,25 1,34 1,48 1,52 6.347}
{0 CHEMBL306380,16 1,24 1,34 1,52 5.8}
{0 CHEMBL306580,7 1,25 1,34 1,48 1,52 6.886}
{0 CHEMBL306623,7 1,25 1,34 1,48 1,52 5.347}
{0 CHEMBL306883,7 1,11 1,25 1,34 1,35 1,48 1,52 4.301}
{0 CHEMBL307708,7 1,25 1,34 1,48 1,52 6.77}
{0 CHEMBL308263,7 1,25 1,34 1,48 1,52 7.046}
{0 CHEMBL309034,7 1,25 1,34 1,48 1,52 6.602}
{0 CHEMBL309078,7 1,25 1,34 1,48 1,52 4.585}
{0 CHEMBL312067,7 1,25 1,34 1,48 1,52 5.523}
{0 CHEMBL316264,11 1,13 1,16 1,19 1,21 1,49 1,52 5.1}
{0 CHEMBL31965,19 1,21 1,22 1,29 1,34 1,35 1,52 5}
{0 CHEMBL326282,19 1,21 1,34 1,44 1,52 5.1}
{0 CHEMBL336961,11 1,12 1,13 1,19 1,21 1,29 1,34 1,52 5.1}
{0 CHEMBL340384,6 1,16 1,21 1,34 1,49 1,52 7.2}
{0 CHEMBL340921,6 1,16 1,34 1,49 1,52 5.9}
{0 CHEMBL360847,25 1,34 1,35 1,52 6.2}
{0 CHEMBL362558,12 1,21 1,24 1,25 1,34 1,52 5.1}
{0 CHEMBL363648,16 1,17 1,32 1,34 1,39 1,49 1,52 5.1}
{0 CHEMBL365286,27 1,34 1,52 6.018}
{0 CHEMBL371206,16 1,20 1,24 1,29 1,34 1,52 5.1}
{0 CHEMBL373598,18 1,20 1,21 1,26 1,30 1,34 1,35 1,52 5.1}
{0 CHEMBL375284,11 1,16 1,20 1,29 1,34 1,37 1,52 5.1}
{0 CHEMBL377300,2 1,7 1,11 1,13 1,15 1,21 1,26 1,34 1,52 5}
{0 CHEMBL377383,12 1,21 1,25 1,26 1,34 1,52 5.1}
{0 CHEMBL377408,18 1,25 1,26 1,30 1,34 1,35 1,52 5.4}
{0 CHEMBL378627,18 1,26 1,30 1,34 1,35 1,52 5.1}
{0 CHEMBL379218,7 1,11 1,16 1,34 1,37 1,52 7.252}
{0 CHEMBL379835,19 1,21 1,26 1,34 1,52 5.1}
{0 CHEMBL379975,11 1,13 1,16 1,19 1,21 1,25 1,34 1,52 6.3}
{0 CHEMBL38380,25 1,34 1,35 1,51 1,52 7.1}
{0 CHEMBL384304,7 1,10 1,19 1,21 1,34 1,35 1,52 5}
{0 CHEMBL385478,1 1,2 1,3 1,4 1,5 1,6 1,7 1,8 1,10 1,11 1,12 1,13 1,23 1,34 1,52 7.3}
{0 CHEMBL386051,19 1,20 1,21 1,22 1,26 1,29 1,34 1,52 5}
{0 CHEMBL387971,11 1,16 1,18 1,19 1,30 1,34 1,35 1,37 1,52 5.1}
{0 CHEMBL392642,34 1,52 5.1}
{0 CHEMBL394619,16 1,20 1,29 1,34 1,52 5.1}
{0 CHEMBL394790,16 1,19 1,20 1,21 1,29 1,34 1,52 5.1}
{0 CHEMBL396523,11 1,22 1,29 1,34 1,37 1,48 1,52 5.4}
{0 CHEMBL397521,7 1,22 1,24 1,25 1,28 1,34 1,52 7.889}
{0 CHEMBL398951,11 1,16 1,18 1,30 1,34 1,35 1,37 1,52 5.5}
{0 CHEMBL402846,8 1,15 1,16 1,19 1,20 1,21 1,29 1,34 1,52 5.1}
{0 CHEMBL404367,8 1,16 1,20 1,29 1,34 1,52 5.1}
{0 CHEMBL406845,16 1,19 1,21 1,24 1,34 1,52 6.3}
{0 CHEMBL407391,6 1,11 1,13 1,26 1,34 1,52 4.8}
{0 CHEMBL411903,15 1,19 1,20 1,21 1,29 1,34 1,52 5.1}
{0 CHEMBL412142,8 1,11 1,13 1,16 1,18 1,19 1,21 1,30 1,34 1,35 1,52 5.1}
{0 CHEMBL413460,7 1,10 1,24 1,25 1,28 1,34 1,46 1,52 7.174}
{0 CHEMBL413779,18 1,20 1,21 1,26 1,30 1,34 1,35 1,52 5.1}
{0 CHEMBL415049,11 1,19 1,21 1,29 1,34 1,35 1,37 1,42 1,52 5.9}
{0 CHEMBL41783,11 1,16 1,19 1,21 1,24 1,34 1,35 1,37 1,52 5.1}
{0 CHEMBL422897,7 1,19 1,21 1,34 1,35 1,52 5.4}
{0 CHEMBL424872,12 1,18 1,25 1,26 1,30 1,34 1,35 1,52 5.3}
{0 CHEMBL428690,7 1,19 1,21 1,34 1,35 1,52 5}
{0 CHEMBL432168,7 1,25 1,34 1,48 1,52 7.301}
{0 CHEMBL437747,7 1,10 1,16 1,19 1,21 1,25 1,32 1,34 1,52 6.1}
{0 CHEMBL438491,7 1,22 1,24 1,25 1,28 1,34 1,52 7.012}
{0 CHEMBL440084,11 1,12 1,13 1,16 1,34 1,52 5.45}
{0 CHEMBL441802,7 1,25 1,34 1,48 1,52 5.444}
{0 CHEMBL443962,4 1,16 1,21 1,24 1,34 1,52 5.1}
{0 CHEMBL445813,7 1,8 1,11 1,19 1,21 1,25 1,34 1,37 1,52 5}
{0 CHEMBL447602,18 1,19 1,21 1,29 1,30 1,34 1,35 1,52 4.602}
{0 CHEMBL447678,7 1,10 1,24 1,25 1,28 1,33 1,34 1,52 6.226}
{0 CHEMBL449834,7 1,10 1,24 1,25 1,28 1,34 1,52 7.081}
{0 CHEMBL450179,7 1,10 1,24 1,25 1,28 1,34 1,52 5.585}
{0 CHEMBL450260,1 1,7 1,10 1,24 1,25 1,34 1,52 4}
{0 CHEMBL450786,8 1,11 1,13 1,19 1,21 1,29 1,34 1,35 1,52 5}
{0 CHEMBL451401,8 1,11 1,29 1,34 1,37 1,43 1,52 4.3}
{0 CHEMBL451964,7 1,10 1,16 1,24 1,30 1,34 1,52 5.1}
{0 CHEMBL453737,19 1,21 1,29 1,34 1,35 1,52 4}
{0 CHEMBL454225,1 1,7 1,10 1,24 1,25 1,34 1,52 5.708}
{0 CHEMBL458997,21 1,25 1,29 1,34 1,52 5.4}
{0 CHEMBL460472,34 1,40 1,52 4}
{0 CHEMBL461876,3 1,5 1,6 1,8 1,11 1,13 1,19 1,21 1,29 1,34 1,35 1,52 5.9}
{0 CHEMBL462120,19 1,21 1,29 1,34 1,52 5.1}
{0 CHEMBL464552,3 1,5 1,6 1,8 1,11 1,13 1,19 1,21 1,25 1,29 1,34 1,35 1,52 5}
{0 CHEMBL465518,7 1,10 1,24 1,25 1,28 1,34 1,52 6.607}
{0 CHEMBL468280,6 1,21 1,26 1,34 1,52 5.1}
{0 CHEMBL474432,34 1,52 5.1}
{0 CHEMBL475251,21 1,22 1,34 1,52 6.411}
{0 CHEMBL477772,22 1,26 1,29 1,34 1,52 5.45}
{0 CHEMBL481491,34 1,52 5.1}
{0 CHEMBL482538,1 1,3 1,4 1,5 1,6 1,8 1,11 1,13 1,16 1,49 1,52 6.8}
{0 CHEMBL482767,19 1,20 1,21 1,29 1,34 1,52 5.5}
{0 CHEMBL482967,22 1,29 1,34 1,52 5.8}
{0 CHEMBL483158,16 1,19 1,21 1,22 1,29 1,34 1,48 1,52 6.2}
{0 CHEMBL483321,13 1,22 1,25 1,29 1,30 1,34 1,52 5}
{0 CHEMBL484390,18 1,30 1,34 1,35 1,52 5.1}
{0 CHEMBL484990,12 1,26 1,34 1,52 7.301}
{0 CHEMBL485556,18 1,30 1,34 1,35 1,41 1,52 5.1}
{0 CHEMBL49120,19 1,20 1,21 1,22 1,26 1,29 1,34 1,35 1,52 6}
{0 CHEMBL491473,2 1,11 1,13 1,15 1,21 1,26 1,34 1,35 1,52 5.2}
{0 CHEMBL491758,21 1,22 1,29 1,52 5.1}
{0 CHEMBL494089,25 1,27 1,30 1,34 1,52 7.721}
{0 CHEMBL495088,7 1,10 1,24 1,25 1,28 1,33 1,34 1,52 8.022}
{0 CHEMBL495739,19 1,21 1,25 1,34 1,46 1,52 4.638}
{0 CHEMBL495766,7 1,10 1,24 1,25 1,34 1,52 4.585}
{0 CHEMBL495767,7 1,24 1,25 1,34 1,52 4.006}
{0 CHEMBL496141,7 1,10 1,24 1,25 1,34 1,52 5.785}
{0 CHEMBL496365,7 1,10 1,24 1,25 1,34 1,52 4.253}
{0 CHEMBL497151,8 1,19 1,21 1,30 1,52 5.4}
{0 CHEMBL497800,7 1,10 1,24 1,25 1,34 1,52 5.218}
{0 CHEMBL498924,7 1,22 1,24 1,25 1,28 1,33 1,34 1,52 7.676}
{0 CHEMBL500989,7 1,10 1,24 1,25 1,28 1,33 1,34 1,52 7.9}
{0 CHEMBL501706,7 1,10 1,24 1,25 1,34 1,52 5.678}
{0 CHEMBL504950,24 1,34 1,52 5.7}
{0 CHEMBL505896,21 1,34 1,35 1,38 1,52 4}
{0 CHEMBL505949,7 1,10 1,24 1,25 1,28 1,33 1,34 1,52 7.013}
{0 CHEMBL506331,7 1,10 1,24 1,25 1,28 1,33 1,34 1,52 8.06}
{0 CHEMBL507936,16 1,20 1,29 1,34 1,40 1,52 5.1}
{0 CHEMBL508928,16 1,19 1,20 1,24 1,29 1,34 1,52 5.1}
{0 CHEMBL50894,11 1,13 1,16 1,29 1,34 1,52 5.4}
{0 CHEMBL509032,11 1,18 1,21 1,29 1,34 1,35 1,52 5.398}
{0 CHEMBL509411,7 1,10 1,24 1,25 1,28 1,34 1,52 7.02}
{0 CHEMBL510221,7 1,10 1,24 1,25 1,34 1,46 1,52 4.728}
{0 CHEMBL513846,12 1,22 1,24 1,29 1,34 1,52 5.1}
{0 CHEMBL513909,7 1,25 1,26 1,29 1,34 1,35 1,50 1,52 5}
{0 CHEMBL514499,34 1,52 5.1}
{0 CHEMBL519697,18 1,30 1,34 1,35 1,52 5.1}
{0 CHEMBL521551,7 1,24 1,25 1,34 1,52 4.283}
{0 CHEMBL521851,4 1,5 1,11 1,16 1,18 1,19 1,26 1,34 1,35 1,37 1,52 5}
{0 CHEMBL522892,11 1,13 1,19 1,21 1,29 1,34 1,35 1,52 5.25}
{0 CHEMBL522899,7 1,10 1,12 1,24 1,25 1,34 1,52 4.87}
{0 CHEMBL523401,7 1,10 1,24 1,25 1,34 1,46 1,52 5.085}
{0 CHEMBL523738,7 1,10 1,24 1,25 1,34 1,52 6.354}
{0 CHEMBL523823,6 1,21 1,26 1,34 1,52 5.1}
{0 CHEMBL52387,7 1,12 1,24 1,34 1,52 5.1}
{0 CHEMBL524266,11 1,13 1,25 1,34 1,52 5.398}
{0 CHEMBL524516,7 1,10 1,24 1,25 1,28 1,33 1,34 1,52 7.873}
{0 CHEMBL525191,16 1,34 1,39 1,49 1,52 5}
{0 CHEMBL52529,7 1,25 1,34 1,48 1,52 7.523}
{0 CHEMBL525385,7 1,10 1,24 1,25 1,28 1,34 1,52 8.274}
{0 CHEMBL526133,11 1,25 1,34 1,37 1,52 5.1}
{0 CHEMBL535,8 1,11 1,13 1,19 1,21 1,25 1,29 1,34 1,35 1,52 5}
{0 CHEMBL535331,8 1,11 1,13 1,34 1,52 5.1}
{0 CHEMBL539474,12 1,34 1,52 5.1}
{0 CHEMBL546797,5 1,11 1,13 1,34 1,52 6.2}
{0 CHEMBL550418,16 1,29 1,34 1,52 5.9}
{0 CHEMBL553,22 1,29 1,34 1,41 1,52 5.45}
{0 CHEMBL554,16 1,19 1,21 1,22 1,23 1,25 1,29 1,34 1,52 5.45}
{0 CHEMBL558752,8 1,11 1,13 1,22 1,29 1,34 1,52 5}
{0 CHEMBL560813,18 1,20 1,29 1,30 1,34 1,35 1,48 1,52 5.1}
{0 CHEMBL564829,4 1,22 1,25 1,29 1,34 1,35 1,52 5}
{0 CHEMBL565612,8 1,11 1,13 1,25 1,34 1,35 1,52 5.9}
{0 CHEMBL572878,11 1,19 1,26 1,29 1,34 1,35 1,37 1,49 1,52 5.2}
{0 CHEMBL572881,12 1,29 1,34 1,52 5}
{0 CHEMBL573339,4 1,5 1,12 1,16 1,24 1,26 1,34 1,52 5}
{0 CHEMBL573578,24 1,34 1,52 6.301}
{0 CHEMBL574738,2 1,18 1,19 1,20 1,26 1,29 1,34 1,35 1,49 1,52 5.432}
{0 CHEMBL576982,16 1,20 1,29 1,34 1,35 1,52 5}
{0 CHEMBL578061,22 1,29 1,52 4.7}
{0 CHEMBL583144,19 1,21 1,25 1,34 1,42 1,52 5.1}
{0 CHEMBL590109,8 1,11 1,23 1,34 1,37 1,52 7.3}
{0 CHEMBL592030,8 1,11 1,23 1,34 1,37 1,52 7.4}
{0 CHEMBL59828,7 1,25 1,34 1,48 1,52 7.155}
{0 CHEMBL601719,19 1,21 1,25 1,34 1,52 5}
{0 CHEMBL60254,7 1,25 1,34 1,48 1,52 7.301}
{0 CHEMBL604712,11 1,21 1,34 1,37 1,52 5}
{0 CHEMBL607707,18 1,19 1,21 1,22 1,29 1,30 1,34 1,35 1,52 5}
{0 CHEMBL608154,11 1,12 1,13 1,21 1,30 1,34 1,52 5}
{0 CHEMBL67442,7 1,25 1,34 1,48 1,52 6.456}
{0 CHEMBL7064,11 1,16 1,34 1,37 1,52 5.1}
{0 CHEMBL75004,7 1,25 1,34 1,48 1,52 6.658}
{0 CHEMBL75661,7 1,25 1,34 1,48 1,52 6.638}
{0 CHEMBL76537,7 1,25 1,34 1,48 1,52 5.125}
{0 CHEMBL76920,7 1,25 1,34 1,48 1,52 6.481}
{0 CHEMBL77399,7 1,23 1,25 1,34 1,48 1,52 4.886}
{0 CHEMBL77970,7 1,25 1,34 1,48 1,52 5.284}
{0 CHEMBL78129,7 1,25 1,34 1,35 1,48 1,52 5.77}
{0 CHEMBL80525,7 1,25 1,34 1,48 1,52 5.721}
{0 CHEMBL91829,25 1,34 1,35 1,52 5.268}
{0 CHEMBL939,19 1,21 1,22 1,29 1,34 1,35 1,52 5.3}
{0 CHEMBL941,12 1,16 1,18 1,19 1,23 1,29 1,34 1,35 1,52 5.25}
{0 CHEMBL95692,16 1,18 1,19 1,21 1,25 1,32 1,34 1,52 5.9}
