"molecule_id","AMW","C.","H.","Me","Mi","Mp","Mv","MW","N.","nAB","nAT","nB","nBM","nBO","nBR","nBT","nC","nCL","nCsp","nCsp2","nCsp3","nDB","nF","nH","nHet","nHM","nI","nN","nO","nP","nS","nSK","nTB","nX","O.","RBF","RBN","SCBO","Se","Si","Sp","Sv","X.","pXC50"
{1 7.815,2 47.2,3 41.7,4 1.007,5 1.112,6 0.686,7 0.663,8 281.33,9 2.8,10 11,11 36,13 13,14 24,16 39,17 17,20 13,21 4,22 2,24 15,25 4,28 1,29 3,32 21,35 8.3,36 0.026,37 1,38 31.5,39 36.269,40 40.033,41 24.699,42 23.853,44 4}
{0 CHEMBL1078983,1 7.163,2 38.5,3 47.7,4 1.005,5 1.134,6 0.642,7 0.613,8 465.61,9 7.7,10 17,11 65,13 17,14 38,16 69,17 25,20 13,21 12,24 31,25 9,28 5,29 4,32 34,35 6.2,36 0.072,37 5,38 46.5,39 65.305,40 73.727,41 41.745,42 39.815,44 5}
{0 CHEMBL1094981,1 7.396,2 36,3 46.7,4 1.013,5 1.146,6 0.633,7 0.611,8 554.7,9 10.7,10 16,11 75,13 18,14 44,16 79,17 27,20 13,21 14,22 2,23 1,24 35,25 13,28 8,29 4,32 40,34 1,35 5.3,36 0.089,37 7,38 54,39 76.007,40 85.977,41 47.461,42 45.789,43 1.3,44 4.301}
{0 CHEMBL1095626,1 7.416,2 37.3,3 45.8,4 1.009,5 1.14,6 0.644,7 0.62,8 437.56,9 11.9,10 16,11 59,13 17,14 36,16 63,17 22,20 12,21 10,22 1,24 27,25 10,28 7,29 3,32 32,35 5.1,36 0.063,37 4,38 45,39 59.531,40 67.268,41 38.017,42 36.562,44 4.301}
{0 CHEMBL1095627,1 7.054,2 36.8,3 48.5,4 1.003,5 1.14,6 0.637,7 0.605,8 479.65,9 10.3,10 16,11 68,13 17,14 39,16 72,17 25,20 12,21 13,22 1,24 33,25 10,28 7,29 3,32 35,35 4.4,36 0.069,37 5,38 48,39 68.181,40 77.514,41 43.302,42 41.143,44 4.943}
{0 CHEMBL1095932,1 7.259,2 36.1,3 47.2,4 1.008,5 1.142,6 0.636,7 0.609,8 522.68,9 11.1,10 16,11 72,13 18,14 42,16 76,17 26,20 13,21 13,22 2,24 34,25 12,28 8,29 4,32 38,35 5.6,36 0.079,37 6,38 52,39 72.61,40 82.222,41 45.762,42 43.879,44 5.114}
{0 CHEMBL1095933,1 7.156,2 36,3 48,4 1.007,5 1.142,6 0.634,7 0.605,8 536.71,9 10.7,10 16,11 75,13 18,14 43,16 79,17 27,20 13,21 14,22 2,24 36,25 12,28 8,29 4,32 39,35 5.3,36 0.076,37 6,38 53,39 75.494,40 85.637,41 47.523,42 45.406,44 4.932}
{0 CHEMBL1097942,1 7.22,2 36.8,3 47.4,4 1.007,5 1.14,6 0.638,7 0.611,8 548.72,9 10.5,10 16,11 76,13 18,14 45,16 81,17 28,20 13,21 15,22 2,24 36,25 12,28 8,29 4,32 40,35 5.3,36 0.086,37 7,38 55,39 76.494,40 86.637,41 48.523,42 46.406,44 4.301}
{0 CHEMBL1098242,1 7.291,2 35.9,3 47.4,4 1.011,5 1.146,6 0.631,7 0.607,8 568.73,9 10.3,10 16,11 78,13 18,14 45,16 82,17 28,20 13,21 15,22 2,23 1,24 37,25 13,28 8,29 4,32 41,34 1,35 5.1,36 0.085,37 7,38 55,39 78.89,40 89.392,41 49.222,42 47.316,43 1.3,44 4.301}
{0 CHEMBL1098243,1 7.123,2 36.7,3 48.1,4 1.005,5 1.14,6 0.637,7 0.607,8 562.75,9 10.1,10 16,11 79,13 18,14 46,16 84,17 29,20 13,21 16,22 2,24 38,25 12,28 8,29 4,32 41,35 5.1,36 0.083,37 7,38 56,39 79.378,40 90.052,41 50.285,42 47.932,44 4.301}
{0 CHEMBL1221601,1 10.488,2 43.4,3 34,4 1.036,5 1.122,6 0.743,7 0.717,8 555.87,9 7.5,10 18,11 53,13 22,14 37,16 55,17 23,18 3,20 20,21 3,22 4,23 1,24 18,25 12,26 4,28 4,29 3,31 1,32 35,34 4,35 5.7,36 0.127,37 7,38 50,39 54.902,40 59.45,41 39.398,42 38.024,43 7.5,44 6.699}
{0 CHEMBL1765107,1 8.324,2 45.7,3 37.1,4 1.011,5 1.125,6 0.701,7 0.684,8 291.34,9 14.3,10 18,11 35,13 19,14 24,16 37,17 16,20 16,22 1,24 13,25 6,28 5,29 1,32 22,35 2.9,36 0.081,37 3,38 34,39 35.371,40 39.362,41 24.529,42 23.929,44 6.745}
{0 CHEMBL1766759,1 8.065,2 47.2,3 38.9,4 1.004,5 1.119,6 0.702,7 0.679,8 290.35,9 11.1,10 18,11 36,13 19,14 24,16 38,17 17,20 17,22 1,24 14,25 5,28 4,29 1,32 22,35 2.8,36 0.079,37 3,38 34,39 36.153,40 40.279,41 25.284,42 24.434,44 5.602}
{0 CHEMBL1766760,1 8.24,2 42.3,3 38.5,4 1.015,5 1.133,6 0.683,7 0.668,8 214.25,9 15.4,10 12,11 26,13 13,14 17,16 27,17 11,20 11,22 1,24 10,25 5,28 4,29 1,32 16,35 3.8,36 0.074,37 2,38 24,39 26.385,40 29.448,41 17.762,42 17.381,44 5.149}
{0 CHEMBL1766761,1 11.275,2 42.3,3 34.6,4 1.024,5 1.127,6 0.735,7 0.708,8 293.14,9 15.4,10 12,11 26,13 13,14 18,15 1,16 27,17 11,20 11,22 1,24 9,25 6,26 1,28 4,29 1,32 17,34 1,35 3.8,36 0.074,37 2,38 25,39 26.614,40 29.29,41 19.114,42 18.406,43 3.8,44 5.284}
{0 CHEMBL1766762,1 7.057,2 40.5,3 47.6,4 0.995,5 1.132,6 0.656,7 0.619,8 296.41,9 9.5,10 12,11 42,13 13,14 24,16 44,17 17,20 11,21 6,22 1,24 20,25 5,28 4,29 1,32 22,35 2.4,36 0.068,37 3,38 31,39 41.803,40 47.524,41 27.569,42 26.015,44 5.523}
{0 CHEMBL1766763,1 7.36,2 42.5,3 45,4 0.998,5 1.128,6 0.67,7 0.637,8 294.39,9 10,10 12,11 40,13 14,14 24,16 42,17 17,20 13,21 4,22 2,24 18,25 5,28 4,29 1,32 22,35 2.5,36 0.071,37 3,38 32,39 39.92,40 45.109,41 26.807,42 25.488,44 5.678}
{0 CHEMBL1766764,1 8.324,2 45.7,3 37.1,4 1.011,5 1.125,6 0.701,7 0.684,8 291.34,9 14.3,10 18,11 35,13 19,14 24,16 37,17 16,20 16,22 1,24 13,25 6,28 5,29 1,32 22,35 2.9,36 0.081,37 3,38 34,39 35.371,40 39.362,41 24.529,42 23.929,44 6.194}
{0 CHEMBL1766765,1 8.523,2 48.6,3 35.1,4 1.01,5 1.118,6 0.717,7 0.701,8 315.36,9 13.5,10 18,11 37,13 20,14 26,16 39,17 18,19 1,20 17,22 1,24 13,25 6,28 5,29 1,32 24,33 1,35 2.7,36 0.077,37 3,38 38,39 37.371,40 41.362,41 26.529,42 25.929,44 7.62}
{0 CHEMBL1766766,1 8.596,2 43.9,3 39,4 1.011,5 1.118,6 0.711,7 0.68,8 352.45,9 9.8,10 18,11 41,13 20,14 27,16 43,17 18,20 17,21 1,22 2,24 16,25 7,26 1,28 4,29 2,31 1,32 25,35 4.9,36 0.093,37 4,38 38,39 41.44,40 45.823,41 29.148,42 27.863,44 6.886}
{0 CHEMBL1766767,1 8.773,2 42.9,3 38.1,4 1.018,5 1.12,6 0.705,7 0.68,8 368.45,9 9.5,10 18,11 42,13 21,14 28,16 44,17 18,20 17,21 1,22 3,24 16,25 8,26 1,28 4,29 3,31 1,32 26,35 7.1,36 0.091,37 4,38 40,39 42.767,40 47.033,41 29.602,42 28.578,44 5.886}
{0 CHEMBL1766768,1 8.28,2 45.9,3 37.8,4 1.013,5 1.121,6 0.696,7 0.68,8 306.35,9 10.8,10 18,11 37,13 19,14 25,16 39,17 17,20 17,22 1,24 14,25 6,28 4,29 2,32 23,35 5.4,36 0.077,37 3,38 35,39 37.48,40 41.488,41 25.739,42 25.149,44 5.62}
{0 CHEMBL1766769,1 8.009,2 45,3 40,4 1.009,5 1.123,6 0.688,7 0.667,8 320.38,9 10,10 18,11 40,13 19,14 26,16 42,17 18,20 17,21 1,22 1,24 16,25 6,28 4,29 2,32 24,35 5,36 0.095,37 4,38 36,39 40.363,40 44.903,41 27.5,42 26.676,44 6.131}
{0 CHEMBL1766770,1 9.022,2 47.2,3 36.1,4 1.013,5 1.117,6 0.726,7 0.702,8 324.79,9 11.1,10 18,11 36,13 19,14 25,16 38,17 17,18 1,20 17,22 1,24 13,25 6,26 1,28 4,29 1,32 23,34 1,35 2.8,36 0.079,37 3,38 35,39 36.476,40 40.223,41 26.142,42 25.262,43 2.8,44 6.155}
{0 CHEMBL1766771,1 7.805,2 46.2,3 41,4 1.001,5 1.12,6 0.693,7 0.666,8 304.38,9 10.3,10 18,11 39,13 19,14 25,16 41,17 18,20 17,21 1,22 1,24 16,25 5,28 4,29 1,32 23,35 2.6,36 0.073,37 3,38 35,39 39.036,40 43.694,41 27.046,42 25.961,44 5.854}
{0 CHEMBL1766772,1 8.523,2 48.6,3 35.1,4 1.01,5 1.118,6 0.717,7 0.701,8 315.36,9 13.5,10 18,11 37,13 20,14 26,16 39,17 18,19 1,20 17,22 1,24 13,25 6,28 5,29 1,32 24,33 1,35 2.7,36 0.077,37 3,38 38,39 37.371,40 41.362,41 26.529,42 25.929,44 6.398}
{0 CHEMBL1766773,1 8.773,2 42.9,3 38.1,4 1.018,5 1.12,6 0.705,7 0.68,8 368.45,9 9.5,10 18,11 42,13 21,14 28,16 44,17 18,20 17,21 1,22 3,24 16,25 8,26 1,28 4,29 3,31 1,32 26,35 7.1,36 0.091,37 4,38 40,39 42.767,40 47.033,41 29.602,42 28.578,44 6.469}
{0 CHEMBL1766774,1 8.28,2 45.9,3 37.8,4 1.013,5 1.121,6 0.696,7 0.68,8 306.35,9 10.8,10 18,11 37,13 19,14 25,16 39,17 17,20 17,22 1,24 14,25 6,28 4,29 2,32 23,35 5.4,36 0.077,37 3,38 35,39 37.48,40 41.488,41 25.739,42 25.149,44 6.268}
{0 CHEMBL1766775,1 8.009,2 45,3 40,4 1.009,5 1.123,6 0.688,7 0.667,8 320.38,9 10,10 18,11 40,13 19,14 26,16 42,17 18,20 17,21 1,22 1,24 16,25 6,28 4,29 2,32 24,35 5,36 0.095,37 4,38 36,39 40.363,40 44.903,41 27.5,42 26.676,44 5.658}
{0 CHEMBL1766776,1 9.022,2 47.2,3 36.1,4 1.013,5 1.117,6 0.726,7 0.702,8 324.79,9 11.1,10 18,11 36,13 19,14 25,16 38,17 17,18 1,20 17,22 1,24 13,25 6,26 1,28 4,29 1,32 23,34 1,35 2.8,36 0.079,37 3,38 35,39 36.476,40 40.223,41 26.142,42 25.262,43 2.8,44 5.796}
{0 CHEMBL1766777,1 7.805,2 46.2,3 41,4 1.001,5 1.12,6 0.693,7 0.666,8 304.38,9 10.3,10 18,11 39,13 19,14 25,16 41,17 18,20 17,21 1,22 1,24 16,25 5,28 4,29 1,32 23,35 2.6,36 0.073,37 3,38 35,39 39.036,40 43.694,41 27.046,42 25.961,44 6.252}
{0 CHEMBL1766778,1 8.523,2 48.6,3 35.1,4 1.01,5 1.118,6 0.717,7 0.701,8 315.36,9 13.5,10 18,11 37,13 20,14 26,16 39,17 18,19 1,20 17,22 1,24 13,25 6,28 5,29 1,32 24,33 1,35 2.7,36 0.077,37 3,38 38,39 37.371,40 41.362,41 26.529,42 25.929,44 6.745}
{0 CHEMBL1766779,1 8.773,2 42.9,3 38.1,4 1.018,5 1.12,6 0.705,7 0.68,8 368.45,9 9.5,10 18,11 42,13 21,14 28,16 44,17 18,20 17,21 1,22 3,24 16,25 8,26 1,28 4,29 3,31 1,32 26,35 7.1,36 0.091,37 4,38 40,39 42.767,40 47.033,41 29.602,42 28.578,44 7.585}
{0 CHEMBL1766780,1 8.28,2 45.9,3 37.8,4 1.013,5 1.121,6 0.696,7 0.68,8 306.35,9 10.8,10 18,11 37,13 19,14 25,16 39,17 17,20 17,22 1,24 14,25 6,28 4,29 2,32 23,35 5.4,36 0.077,37 3,38 35,39 37.48,40 41.488,41 25.739,42 25.149,44 6.495}
{0 CHEMBL1766781,1 8.009,2 45,3 40,4 1.009,5 1.123,6 0.688,7 0.667,8 320.38,9 10,10 18,11 40,13 19,14 26,16 42,17 18,20 17,21 1,22 1,24 16,25 6,28 4,29 2,32 24,35 5,36 0.095,37 4,38 36,39 40.363,40 44.903,41 27.5,42 26.676,44 5.824}
{0 CHEMBL1766782,1 9.022,2 47.2,3 36.1,4 1.013,5 1.117,6 0.726,7 0.702,8 324.79,9 11.1,10 18,11 36,13 19,14 25,16 38,17 17,18 1,20 17,22 1,24 13,25 6,26 1,28 4,29 1,32 23,34 1,35 2.8,36 0.079,37 3,38 35,39 36.476,40 40.223,41 26.142,42 25.262,43 2.8,44 5.62}
{0 CHEMBL1766783,1 7.805,2 46.2,3 41,4 1.001,5 1.12,6 0.693,7 0.666,8 304.38,9 10.3,10 18,11 39,13 19,14 25,16 41,17 18,20 17,21 1,22 1,24 16,25 5,28 4,29 1,32 23,35 2.6,36 0.073,37 3,38 35,39 39.036,40 43.694,41 27.046,42 25.961,44 5.77}
{0 CHEMBL1766784,1 8.334,2 45,3 37.5,4 1.015,5 1.125,6 0.694,7 0.679,8 333.38,9 12.5,10 18,11 40,13 20,14 27,16 42,17 18,20 18,22 2,24 15,25 7,28 5,29 2,32 25,35 5,36 0.095,37 4,38 38,39 40.582,40 44.986,41 27.745,42 27.171,44 6.959}
{0 CHEMBL1766785,1 8.079,2 44.2,3 39.5,4 1.011,5 1.126,6 0.686,7 0.667,8 347.41,9 11.6,10 18,11 43,13 20,14 28,16 45,17 19,20 18,21 1,22 2,24 17,25 7,28 5,29 2,32 26,35 4.7,36 0.089,37 4,38 39,39 43.465,40 48.402,41 29.506,42 28.697,44 6.745}
{0 CHEMBL1766786,1 7.946,2 44.7,3 40.4,4 1.007,5 1.124,6 0.687,7 0.664,8 373.45,9 10.6,10 18,11 47,13 20,14 31,16 50,17 21,20 18,21 3,22 2,24 19,25 7,28 5,29 2,32 28,35 4.3,36 0.08,37 4,38 42,39 47.349,40 52.817,41 32.267,42 31.224,44 6}
{0 CHEMBL1766787,1 7.857,2 43.5,3 41.3,4 1.008,5 1.126,6 0.68,7 0.657,8 361.44,9 10.9,10 18,11 46,13 20,14 29,16 48,17 20,20 18,21 2,22 2,24 19,25 7,28 5,29 2,32 27,35 4.3,36 0.083,37 4,38 40,39 46.349,40 51.817,41 31.267,42 30.224,44 5.699}
{0 CHEMBL1766788,1 7.75,2 44,3 42,4 1.005,5 1.125,6 0.681,7 0.655,8 387.48,9 10,10 18,11 50,13 20,14 32,16 53,17 22,20 18,21 4,22 2,24 21,25 7,28 5,29 2,32 29,35 4,36 0.075,37 4,38 43,39 50.232,40 56.232,41 34.029,42 32.751,44 5.854}
{0 CHEMBL1766789,1 7.576,2 43.4,3 43.4,4 1.002,5 1.125,6 0.675,7 0.647,8 401.51,9 9.4,10 18,11 53,13 20,14 33,16 56,17 23,20 18,21 5,22 2,24 23,25 7,28 5,29 2,32 30,35 3.8,36 0.071,37 4,38 44,39 53.116,40 59.647,41 35.79,42 34.278,44 5.187}
{0 CHEMBL1766790,1 8.606,2 43.5,3 39.1,4 1.015,5 1.125,6 0.698,7 0.675,8 395.88,9 10.9,10 18,11 46,13 20,14 30,16 48,17 20,18 1,20 18,21 2,22 2,24 18,25 8,26 1,28 5,29 2,32 28,34 1,35 4.3,36 0.083,37 4,38 41,39 46.673,40 51.761,41 32.125,42 31.052,43 2.2,44 4.921}
{0 CHEMBL1766791,1 8.596,2 43.9,3 39,4 1.011,5 1.118,6 0.711,7 0.68,8 352.45,9 9.8,10 18,11 41,13 20,14 27,16 43,17 18,20 17,21 1,22 2,24 16,25 7,26 1,28 4,29 2,31 1,32 25,35 4.9,36 0.093,37 4,38 38,39 41.44,40 45.823,41 29.148,42 27.863,44 5.268}
{0 CHEMBL1766792,1 8.5,2 42.2,3 40,4 1.014,5 1.121,6 0.697,7 0.669,8 382.48,9 8.9,10 18,11 45,13 21,14 29,16 47,17 19,20 17,21 2,22 3,24 18,25 8,26 1,28 4,29 3,31 1,32 27,35 6.7,36 0.106,37 5,38 41,39 45.651,40 50.448,41 31.364,42 30.105,44 5.824}
{0 CHEMBL1766793,1 8.261,2 41.7,3 41.7,4 1.011,5 1.122,6 0.69,7 0.659,8 396.51,9 8.3,10 18,11 48,13 21,14 30,16 50,17 20,20 17,21 3,22 3,24 20,25 8,26 1,28 4,29 3,31 1,32 28,35 6.3,36 0.1,37 5,38 42,39 48.534,40 53.863,41 33.125,42 31.632,44 6}
{0 CHEMBL1766794,1 8.261,2 41.7,3 41.7,4 1.011,5 1.122,6 0.69,7 0.659,8 396.51,9 8.3,10 18,11 48,13 21,14 30,16 50,17 20,20 17,21 3,22 3,24 20,25 8,26 1,28 4,29 3,31 1,32 28,35 6.3,36 0.12,37 6,38 42,39 48.534,40 53.863,41 33.125,42 31.632,44 5.699}
{0 CHEMBL1766795,1 8.05,2 41.2,3 43.1,4 1.008,5 1.123,6 0.684,7 0.65,8 410.54,9 7.8,10 18,11 51,13 21,14 31,16 53,17 21,20 17,21 4,22 3,24 22,25 8,26 1,28 4,29 3,31 1,32 29,35 5.9,36 0.113,37 6,38 43,39 51.418,40 57.278,41 34.887,42 33.158,44 5.796}
{0 CHEMBL1766796,1 8.05,2 41.2,3 43.1,4 1.008,5 1.123,6 0.684,7 0.65,8 410.54,9 7.8,10 18,11 51,13 21,14 31,16 53,17 21,20 17,21 4,22 3,24 22,25 8,26 1,28 4,29 3,31 1,32 29,35 5.9,36 0.094,37 5,38 43,39 51.418,40 57.278,41 34.887,42 33.158,44 6}
{0 CHEMBL1766797,1 7.85,2 39.3,3 44.6,4 1.007,5 1.128,6 0.672,7 0.638,8 439.59,9 8.9,10 18,11 56,13 21,14 33,16 58,17 22,20 17,21 5,22 3,24 25,25 9,26 1,28 5,29 3,31 1,32 31,35 5.4,36 0.121,37 7,38 45,39 56.403,40 63.192,41 37.654,42 35.706,44 6.377}
{0 CHEMBL1766798,1 8.203,2 40.4,3 42.3,4 1.014,5 1.125,6 0.68,7 0.651,8 426.54,9 7.7,10 18,11 52,13 21,14 32,16 54,17 21,20 17,21 4,22 3,24 22,25 9,26 1,28 4,29 4,31 1,32 30,35 7.7,36 0.13,37 7,38 44,39 52.745,40 58.488,41 35.341,42 33.873,44 6.42}
{0 CHEMBL1766799,1 8.49,2 42,3 40,4 1.017,5 1.121,6 0.692,7 0.667,8 424.52,9 8,10 18,11 50,13 21,14 33,16 53,17 21,20 17,21 4,22 3,24 20,25 9,26 1,28 4,29 4,31 1,32 30,35 8,36 0.094,37 5,38 45,39 50.862,40 56.072,41 34.58,42 33.346,44 6.337}
{0 CHEMBL1766800,1 7.802,2 37.5,3 45.8,4 1.009,5 1.131,6 0.664,7 0.628,8 374.51,9 8.3,10 12,11 48,13 15,14 28,16 50,17 18,20 11,21 7,22 3,24 22,25 8,26 1,28 4,29 3,31 1,32 26,35 6.3,36 0.08,37 4,38 37,39 48.418,40 54.278,41 31.887,42 30.158,44 5.449}
{0 CHEMBL1766801,1 8.913,2 43.9,3 36.6,4 1.016,5 1.12,6 0.717,7 0.692,8 365.45,9 12.2,10 22,11 41,13 24,14 29,16 44,17 18,20 17,21 1,22 2,24 15,25 8,26 1,28 5,29 2,31 1,32 26,35 4.9,36 0.068,37 3,38 42,39 41.658,40 45.906,41 29.392,42 28.358,44 7.523}
{0 CHEMBL1766802,1 9.161,2 45,3 35,4 1.022,5 1.115,6 0.721,7 0.701,8 366.43,9 10,10 22,11 40,13 24,14 29,16 43,17 18,20 17,21 1,22 2,24 14,25 8,26 1,28 4,29 3,31 1,32 26,35 7.5,36 0.07,37 3,38 42,39 40.884,40 44.617,41 28.841,42 28.051,44 7.444}
{0 CHEMBL1766803,1 9.562,2 45,3 35,4 1.016,5 1.108,6 0.751,7 0.713,8 382.5,9 10,10 22,11 40,13 24,14 29,16 43,17 18,20 17,21 1,22 2,24 14,25 8,26 2,28 4,29 2,31 2,32 26,35 5,36 0.07,37 3,38 42,39 40.633,40 44.328,41 30.034,42 28.523,44 7.658}
{0 CHEMBL1766804,1 8.678,2 45.2,3 38.1,4 1.01,5 1.115,6 0.718,7 0.687,8 364.46,9 9.5,10 22,11 42,13 24,14 29,16 45,17 19,20 18,21 1,22 2,24 16,25 7,26 1,28 4,29 2,31 1,32 26,35 4.8,36 0.067,37 3,38 42,39 42.44,40 46.823,41 30.148,42 28.863,44 7.638}
{0 CHEMBL179242,1 7.815,2 44.4,3 41.7,4 1.007,5 1.122,6 0.68,7 0.657,8 281.34,9 8.3,10 6,11 36,13 10,14 24,16 39,17 16,20 12,21 4,22 4,24 15,25 5,28 3,29 2,32 21,35 5.6,36 0.026,37 1,38 31,39 36.262,40 40.405,41 24.495,42 23.655,44 4}
{0 CHEMBL188678,1 8.439,2 51,3 38.8,4 1.002,5 1.098,6 0.732,7 0.696,8 413.52,9 2,10 21,11 49,13 23,14 35,16 54,17 25,20 21,21 4,22 2,24 19,25 5,26 1,28 1,29 3,31 1,32 30,35 6.1,36 0.037,37 2,38 47.5,39 49.113,40 53.783,41 35.87,42 34.094,44 4}
{0 CHEMBL2030436,1 8.098,2 39.1,3 43.5,4 1.012,5 1.127,6 0.677,7 0.644,8 372.49,9 8.7,10 16,11 46,13 18,14 29,16 49,17 18,20 12,21 6,22 2,24 20,25 8,26 1,28 4,29 3,31 1,32 26,35 6.5,36 0.082,37 4,38 39,39 46.534,40 51.863,41 31.125,42 29.632,44 4.523}
{0 CHEMBL2030442,1 8.098,2 39.1,3 43.5,4 1.012,5 1.127,6 0.677,7 0.644,8 372.49,9 8.7,10 16,11 46,13 18,14 29,16 49,17 18,20 12,21 6,22 2,24 20,25 8,26 1,28 4,29 3,31 1,32 26,35 6.5,36 0.082,37 4,38 39,39 46.534,40 51.863,41 31.125,42 29.632,44 5.959}
{0 CHEMBL2205766,1 8.249,2 35.7,3 42.9,4 1.015,5 1.139,6 0.67,7 0.641,8 346.46,9 14.3,10 16,11 42,13 18,14 26,16 44,17 15,20 11,21 4,22 2,24 18,25 9,26 1,28 6,29 2,31 1,32 24,35 4.8,36 0.091,37 4,38 36,39 42.643,40 47.82,41 28.159,42 26.906,44 5.23}
{0 CHEMBL222102,1 8.989,2 47.7,3 38.6,4 1.007,5 1.097,6 0.744,7 0.699,8 395.53,9 2.3,10 12,11 44,13 15,14 31,16 48,17 21,20 17,21 4,22 3,24 17,25 6,26 2,28 1,29 3,31 2,32 27,35 6.8,36 0.042,37 2,38 40,39 44.305,40 48.288,41 32.756,42 30.754,44 4}
{0 CHEMBL2321916,1 7.784,2 39.6,3 45.3,4 1.006,5 1.126,6 0.673,7 0.636,8 412.56,9 7.5,10 16,11 53,13 18,14 33,16 57,17 21,20 12,21 9,22 2,24 24,25 8,26 1,28 4,29 3,31 1,32 29,35 5.7,36 0.07,37 4,38 43,39 53.302,40 59.693,41 35.648,42 33.685,44 4.689}
{0 CHEMBL2325438,1 8.177,2 38.9,3 42.6,4 1.016,5 1.129,6 0.673,7 0.646,8 441.56,9 9.3,10 16,11 54,13 19,14 35,16 58,17 21,20 13,21 8,22 3,24 23,25 10,26 1,28 5,29 4,31 1,32 31,35 7.4,36 0.086,37 5,38 46,39 54.847,40 60.986,41 36.347,42 34.894,44 5.036}
{0 CHEMBL2325439,1 8.33,2 40,3 42,4 1.019,5 1.132,6 0.676,7 0.651,8 416.52,9 8,10 16,11 50,13 18,14 33,16 54,17 20,20 12,21 8,22 2,23 1,24 21,25 9,26 1,28 4,29 3,31 1,32 29,34 1,35 6,36 0.074,37 4,38 43,39 50.931,40 56.618,41 33.824,42 32.542,43 2,44 6.357}
{0 CHEMBL2325440,1 8.659,2 40,3 42,4 1.015,5 1.124,6 0.695,7 0.66,8 432.97,9 8,10 16,11 50,13 18,14 33,16 54,17 20,18 1,20 12,21 8,22 2,24 21,25 9,26 2,28 4,29 3,31 1,32 29,34 1,35 6,36 0.074,37 4,38 43,39 50.742,40 56.222,41 34.745,42 32.986,43 2,44 6.143}
{0 CHEMBL2325695,1 7.936,2 38.9,3 44.4,4 1.012,5 1.128,6 0.669,7 0.637,8 428.56,9 7.4,10 16,11 54,13 18,14 34,16 58,17 21,20 12,21 9,22 2,24 24,25 9,26 1,28 4,29 4,31 1,32 30,35 7.4,36 0.086,37 5,38 44,39 54.629,40 60.903,41 36.103,42 34.4,44 6.097}
{0 CHEMBL2325696,1 7.784,2 39.6,3 45.3,4 1.006,5 1.126,6 0.673,7 0.636,8 412.56,9 7.5,10 16,11 53,13 18,14 33,16 57,17 21,20 12,21 9,22 2,24 24,25 8,26 1,28 4,29 3,31 1,32 29,35 5.7,36 0.07,37 4,38 43,39 53.302,40 59.693,41 35.648,42 33.685,44 5.432}
{0 CHEMBL2325697,1 7.784,2 39.6,3 45.3,4 1.006,5 1.126,6 0.673,7 0.636,8 412.56,9 7.5,10 16,11 53,13 18,14 33,16 57,17 21,20 12,21 9,22 2,24 24,25 8,26 1,28 4,29 3,31 1,32 29,35 5.7,36 0.07,37 4,38 43,39 53.302,40 59.693,41 35.648,42 33.685,44 7.301}
{0 CHEMBL2325698,1 7.618,2 39.3,3 46.4,4 1.003,5 1.127,6 0.668,7 0.629,8 426.59,9 7.1,10 16,11 56,13 18,14 34,16 60,17 22,20 12,21 10,22 2,24 26,25 8,26 1,28 4,29 3,31 1,32 30,35 5.4,36 0.083,37 5,38 44,39 56.185,40 63.109,41 37.409,42 35.212,44 5.357}
{0 CHEMBL2325699,1 7.862,2 40.7,3 44.4,4 1.006,5 1.124,6 0.679,7 0.642,8 424.57,9 7.4,10 16,11 54,13 18,14 35,16 59,17 22,20 12,21 10,22 2,24 24,25 8,26 1,28 4,29 3,31 1,32 30,35 5.6,36 0.068,37 4,38 45,39 54.302,40 60.693,41 36.648,42 34.685,44 6.456}
{0 CHEMBL2325700,1 8.098,2 39.1,3 43.5,4 1.012,5 1.127,6 0.677,7 0.644,8 372.49,9 8.7,10 16,11 46,13 18,14 29,16 49,17 18,20 12,21 6,22 2,24 20,25 8,26 1,28 4,29 3,31 1,32 26,35 6.5,36 0.082,37 4,38 39,39 46.534,40 51.863,41 31.125,42 29.632,44 4.523}
{0 CHEMBL2325701,1 8.098,2 39.1,3 43.5,4 1.012,5 1.127,6 0.677,7 0.644,8 372.49,9 8.7,10 16,11 46,13 18,14 29,16 49,17 18,20 12,21 6,22 2,24 20,25 8,26 1,28 4,29 3,31 1,32 26,35 6.5,36 0.082,37 4,38 39,39 46.534,40 51.863,41 31.125,42 29.632,44 4.523}
{0 CHEMBL2325702,1 7.888,2 38.8,3 44.9,4 1.009,5 1.128,6 0.671,7 0.636,8 386.52,9 8.2,10 16,11 49,13 18,14 30,16 52,17 19,20 12,21 7,22 2,24 22,25 8,26 1,28 4,29 3,31 1,32 27,35 6.1,36 0.077,37 4,38 40,39 49.418,40 55.278,41 32.887,42 31.158,44 4.523}
{0 CHEMBL2325703,1 7.703,2 38.5,3 46.2,4 1.006,5 1.129,6 0.666,7 0.629,8 400.55,9 7.7,10 16,11 52,13 18,14 31,16 55,17 20,20 12,21 8,22 2,24 24,25 8,26 1,28 4,29 3,31 1,32 28,35 5.8,36 0.073,37 4,38 41,39 52.302,40 58.693,41 34.648,42 32.685,44 6.553}
{0 CHEMBL2325704,1 7.971,2 40,3 44,4 1.008,5 1.126,6 0.678,7 0.643,8 398.53,9 8,10 16,11 50,13 18,14 32,16 54,17 20,20 12,21 8,22 2,24 22,25 8,26 1,28 4,29 3,31 1,32 28,35 6,36 0.074,37 4,38 42,39 50.418,40 56.278,41 33.887,42 32.158,44 6.444}
{0 CHEMBL2325705,1 7.765,2 38.6,3 45.6,4 1.009,5 1.128,6 0.664,7 0.63,8 442.59,9 7,10 16,11 57,13 18,14 35,16 61,17 22,20 12,21 10,22 2,24 26,25 9,26 1,28 4,29 4,31 1,32 31,35 7,36 0.066,37 4,38 45,39 57.512,40 64.318,41 37.864,42 35.927,44 6.745}
{0 CHEMBL2325706,1 7.614,2 37.9,3 46.6,4 1.005,5 1.131,6 0.662,7 0.625,8 441.61,9 8.6,10 16,11 58,13 18,14 35,16 62,17 22,20 12,21 10,22 2,24 27,25 9,26 1,28 5,29 3,31 1,32 31,35 5.2,36 0.065,37 4,38 45,39 58.287,40 65.607,41 38.415,42 36.233,44 6.377}
{0 CHEMBL2325707,1 7.47,2 37.7,3 47.5,4 1.003,5 1.132,6 0.659,7 0.619,8 455.64,9 8.2,10 16,11 61,13 18,14 36,16 65,17 23,20 12,21 11,22 2,24 29,25 9,26 1,28 5,29 3,31 1,32 32,35 4.9,36 0.062,37 4,38 46,39 61.171,40 69.022,41 40.176,42 37.76,44 5.432}
{0 CHEMBL2325708,1 7.618,2 39.3,3 46.4,4 1.003,5 1.127,6 0.668,7 0.629,8 426.59,9 7.1,10 16,11 56,13 18,14 34,16 60,17 22,20 12,21 10,22 2,24 26,25 8,26 1,28 4,29 3,31 1,32 30,35 5.4,36 0.083,37 5,38 44,39 56.185,40 63.109,41 37.409,42 35.212,44 6.114}
{0 CHEMBL2325709,1 7.682,2 39.3,3 45.9,4 1.006,5 1.127,6 0.666,7 0.63,8 468.63,9 6.6,10 16,11 61,13 18,14 38,16 66,17 24,20 12,21 12,22 2,24 28,25 9,26 1,28 4,29 4,31 1,32 33,35 6.6,36 0.076,37 5,38 48,39 61.396,40 68.733,41 40.625,42 38.453,44 5.553}
{0 CHEMBL2325710,1 7.543,2 38.7,3 46.8,4 1.003,5 1.129,6 0.664,7 0.625,8 467.65,9 8.1,10 16,11 62,13 18,14 38,16 67,17 24,20 12,21 12,22 2,24 29,25 9,26 1,28 5,29 3,31 1,32 33,35 4.8,36 0.075,37 5,38 48,39 62.171,40 70.022,41 41.176,42 38.76,44 5.538}
{0 CHEMBL2325711,1 8.081,2 43.9,3 42.1,4 1.005,5 1.117,6 0.696,7 0.661,8 460.6,9 7,10 22,11 57,13 24,14 38,16 62,17 25,20 18,21 7,22 2,24 24,25 8,26 1,28 4,29 3,31 1,32 33,35 5.3,36 0.081,37 5,38 51,39 57.302,40 63.693,41 39.648,42 37.685,44 6.229}
{0 CHEMBL2325712,1 8.243,2 42.9,3 41.1,4 1.009,5 1.121,6 0.695,7 0.664,8 461.59,9 8.9,10 22,11 56,13 24,14 38,16 61,17 24,20 17,21 7,22 2,24 23,25 9,26 1,28 5,29 3,31 1,32 33,35 5.4,36 0.082,37 5,38 51,39 56.52,40 62.777,41 38.892,42 37.18,44 5.699}
{0 CHEMBL2325713,1 7.815,2 39.1,3 45.7,4 1.007,5 1.126,6 0.671,7 0.633,8 359.49,9 6.5,10 12,11 46,13 14,14 28,16 49,17 18,20 10,21 8,22 2,24 21,25 7,26 1,28 3,29 3,31 1,32 25,35 6.5,36 0.082,37 4,38 36,39 46.316,40 51.78,41 30.881,42 29.137,44 4.523}
{0 CHEMBL2325714,1 7.802,2 37.5,3 45.8,4 1.009,5 1.131,6 0.664,7 0.628,8 374.51,9 8.3,10 12,11 48,13 14,14 29,16 51,17 18,20 10,21 8,22 2,24 22,25 8,26 1,28 4,29 3,31 1,32 26,35 6.3,36 0.078,37 4,38 37,39 48.418,40 54.278,41 31.887,42 30.158,44 4.523}
{0 CHEMBL2325715,1 8.128,2 39.2,3 43.1,4 1.015,5 1.127,6 0.673,7 0.645,8 414.53,9 7.8,10 12,11 51,13 15,14 33,16 55,17 20,20 11,21 9,22 3,24 22,25 9,26 1,28 4,29 4,31 1,32 29,35 7.8,36 0.073,37 4,38 42,39 51.745,40 57.488,41 34.341,42 32.873,44 4.796}
{0 CHEMBL2325716,1 8.153,2 38.8,3 42.9,4 1.013,5 1.13,6 0.676,7 0.646,8 399.52,9 10.2,10 16,11 49,13 18,14 32,16 53,17 19,20 11,21 8,22 2,24 21,25 9,26 1,28 5,29 3,31 1,32 28,35 6.1,36 0.075,37 4,38 42,39 49.636,40 55.361,41 33.131,42 31.653,44 4.886}
{0 CHEMBL2325717,1 8.153,2 38.8,3 42.9,4 1.013,5 1.13,6 0.676,7 0.646,8 399.52,9 10.2,10 16,11 49,13 18,14 32,16 53,17 19,20 11,21 8,22 2,24 21,25 9,26 1,28 5,29 3,31 1,32 28,35 6.1,36 0.075,37 4,38 42,39 49.636,40 55.361,41 33.131,42 31.653,44 5.051}
{0 CHEMBL2325718,1 7.784,2 39.6,3 45.3,4 1.006,5 1.126,6 0.673,7 0.636,8 412.56,9 7.5,10 16,11 53,13 18,14 33,16 57,17 21,20 12,21 9,22 2,24 24,25 8,26 1,28 4,29 3,31 1,32 29,35 5.7,36 0.07,37 4,38 43,39 53.302,40 59.693,41 35.648,42 33.685,44 5.602}
{0 CHEMBL2325719,1 7.784,2 39.6,3 45.3,4 1.006,5 1.126,6 0.673,7 0.636,8 412.56,9 7.5,10 16,11 53,13 18,14 33,16 57,17 21,20 12,21 9,22 2,24 24,25 8,26 1,28 4,29 3,31 1,32 29,35 5.7,36 0.07,37 4,38 43,39 53.302,40 59.693,41 35.648,42 33.685,44 4.523}
{0 CHEMBL2325720,1 7.784,2 39.6,3 45.3,4 1.006,5 1.126,6 0.673,7 0.636,8 412.56,9 7.5,10 16,11 53,13 18,14 33,16 57,17 21,20 12,21 9,22 2,24 24,25 8,26 1,28 4,29 3,31 1,32 29,35 5.7,36 0.07,37 4,38 43,39 53.302,40 59.693,41 35.648,42 33.685,44 6.31}
{0 CHEMBL2325721,1 7.784,2 39.6,3 45.3,4 1.006,5 1.126,6 0.673,7 0.636,8 412.56,9 7.5,10 16,11 53,13 18,14 33,16 57,17 21,20 12,21 9,22 2,24 24,25 8,26 1,28 4,29 3,31 1,32 29,35 5.7,36 0.07,37 4,38 43,39 53.302,40 59.693,41 35.648,42 33.685,44 5.201}
{0 CHEMBL2325722,1 8.177,2 38.9,3 42.6,4 1.016,5 1.129,6 0.673,7 0.646,8 441.56,9 9.3,10 16,11 54,13 19,14 35,16 58,17 21,20 13,21 8,22 3,24 23,25 10,26 1,28 5,29 4,31 1,32 31,35 7.4,36 0.086,37 5,38 46,39 54.847,40 60.986,41 36.347,42 34.894,44 4.523}
{0 CHEMBL2325723,1 8.305,2 41.2,3 41.2,4 1.012,5 1.125,6 0.689,7 0.66,8 423.54,9 9.8,10 16,11 51,13 19,14 34,16 55,17 21,19 1,20 12,21 8,22 2,24 21,25 9,26 1,28 5,29 3,31 1,32 30,33 1,35 5.9,36 0.073,37 4,38 46,39 51.636,40 57.361,41 35.131,42 33.653,44 5.143}
{0 CHEMBL2325724,1 8.305,2 41.2,3 41.2,4 1.012,5 1.125,6 0.689,7 0.66,8 423.54,9 9.8,10 16,11 51,13 19,14 34,16 55,17 21,19 1,20 12,21 8,22 2,24 21,25 9,26 1,28 5,29 3,31 1,32 30,33 1,35 5.9,36 0.073,37 4,38 46,39 51.636,40 57.361,41 35.131,42 33.653,44 5.824}
{0 CHEMBL2325725,1 7.827,2 38.3,3 45,4 1.01,5 1.13,6 0.664,7 0.632,8 469.62,9 8.3,10 16,11 60,13 19,14 37,16 64,17 23,20 13,21 10,22 3,24 27,25 10,26 1,28 5,29 4,31 1,32 33,35 6.7,36 0.078,37 5,38 48,39 60.614,40 67.816,41 39.87,42 37.948,44 4.62}
{0 CHEMBL2325726,1 7.993,2 38.6,3 43.9,4 1.013,5 1.13,6 0.669,7 0.639,8 455.59,9 8.8,10 16,11 57,13 19,14 36,16 61,17 22,20 13,21 9,22 3,24 25,25 10,26 1,28 5,29 4,31 1,32 32,35 7,36 0.082,37 5,38 47,39 57.731,40 64.401,41 38.108,42 36.421,44 4.824}
{0 CHEMBL260876,1 9.518,2 12.5,3 50,4 1.02,5 1.166,6 0.678,7 0.595,8 76.14,9 25,11 8,13 1,14 3,16 7,17 1,20 1,22 1,24 4,25 3,26 1,28 2,31 1,32 4,38 4,39 8.164,40 9.332,41 5.421,42 4.757,44 6.699}
{0 CHEMBL303958,1 7.181,2 31.4,3 48.6,4 1.013,5 1.154,6 0.614,7 0.591,8 251.33,9 14.3,10 6,11 35,13 7,14 19,16 36,17 11,20 4,21 7,22 1,24 17,25 7,28 5,29 2,32 18,35 5.7,36 0.111,37 4,38 23,39 35.465,40 40.402,41 21.506,42 20.697,44 5.174}
{0 CHEMBL435507,1 7.573,2 46.2,3 43.6,4 1.004,5 1.114,6 0.678,7 0.651,8 295.36,9 2.6,10 11,11 39,13 13,14 25,16 42,17 18,20 13,21 5,22 2,24 17,25 4,28 1,29 3,32 22,35 7.7,36 0.024,37 1,38 32.5,39 39.153,40 43.448,41 26.46,42 25.38,44 4}
{0 CHEMBL479488,1 7.026,2 40.4,3 49.1,4 1.006,5 1.124,6 0.638,7 0.608,8 400.51,10 12,11 57,13 12,14 32,16 60,17 23,20 12,21 11,24 28,25 6,29 6,32 29,35 10.5,36 0.067,37 4,38 38,39 57.334,40 64.069,41 36.387,42 34.664,44 5.14}
{0 CHEMBL561907,1 7.632,2 36.2,3 44.9,4 1.018,5 1.147,6 0.637,7 0.619,8 526.64,9 11.6,10 16,11 69,13 18,14 42,16 73,17 25,20 13,21 12,22 2,23 1,24 31,25 13,28 8,29 4,32 38,34 1,35 5.8,36 0.082,37 6,38 52,39 70.24,40 79.146,41 43.938,42 42.735,43 1.4,44 4.382}
{0 CHEMBL562999,1 7.438,2 37.1,3 45.7,4 1.01,5 1.14,6 0.643,7 0.619,8 520.66,9 11.4,10 16,11 70,13 18,14 43,16 75,17 26,20 13,21 13,22 2,24 32,25 12,28 8,29 4,32 38,35 5.7,36 0.08,37 6,38 53,39 70.727,40 79.806,41 45,42 43.352,44 4.582}
{0 CHEMBL563985,1 7.494,2 36.4,3 45.5,4 1.013,5 1.142,6 0.64,7 0.619,8 494.62,9 12.1,10 16,11 66,13 18,14 40,16 70,17 24,20 13,21 11,22 2,24 30,25 12,28 8,29 4,32 36,35 6.1,36 0.071,37 5,38 50,39 66.843,40 75.391,41 42.239,42 40.825,44 5.319}
{0 CHEMBL98350,1 7.684,2 47.5,3 42.5,4 1.004,5 1.111,6 0.687,7 0.66,8 307.37,9 2.5,10 12,11 40,13 14,14 26,16 43,17 19,20 15,21 4,22 2,24 17,25 4,28 1,29 3,32 23,35 7.5,36 0.047,37 2,38 34,39 40.153,40 44.448,41 27.46,42 26.38,44 4}
