"molecule_id","nDB","nHet","nO","O.","pXC50"
{1 1,2 6,3 2,4 4.2,5 4.319}
{0 CHEMBL47414,1 3,2 8,3 4,4 6,5 8.602}
{0 CHEMBL47468,1 4,2 11,3 6,4 7.6,5 9.301}
{0 CHEMBL514138,1 3,2 9,3 5,4 10,5 8}
{0 CHEMBL68315,1 2,2 7,3 1,4 2.6,5 4.125}
{0 CHEMBL68529,2 4,3 1,4 2,5 4.143}
{0 CHEMBL70273,1 2,2 6,3 1,4 2.7,5 4.071}
{0 CHEMBL70561,2 5,5 4.252}
{0 CHEMBL70817,1 1,2 4,5 4.036}
{0 CHEMBL70885,2 5,3 1,4 2,5 4.292}
{0 CHEMBL71110,2 5,3 2,4 4.2,5 4}
{0 CHEMBL71547,1 1,2 6,3 2,4 3.7,5 4}
{0 CHEMBL73115,2 5,3 1,4 2,5 4.886}
{0 CHEMBL73117,1 1,2 6,3 2,4 3.7,5 4.081}
{0 CHEMBL73945,1 2,2 6,3 2,4 4.3,5 4.337}
