{
  "data_set_description": {
    "collection_date": "November 2013",
    "creator": "Dr Jeremy Besnard, Dr Ivan Olier, Dr Noureddin Sadawi, Dr Larisa Soldatova, Dr Crina Grosan, Prof Ross King, Dr Richard Bickerton, Prof Andrew Hopkins and Dr Willem van Hoorn",
    "default_target_attribute": "pXC50",
    "description": "This dataset contains QSAR data (from ChEMBL version 17) showing activity values (unit is pseudo-pCI50) of several compounds on drug target ChEMBL_ID: CHEMBL4552 (TID: 10841), and it has 801 rows and 1324 features (not including molecule IDs and class feature: molecule_id and pXC50). The features represent Molecular Descriptors which were generated from SMILES strings. Missing value imputation was applied to this dataset (By choosing the Median).",
    "description_version": "1",
    "file_id": "3534361",
    "format": "ARFF",
    "id": "34631",
    "licence": "Public",
    "md5_checksum": "35fe89da0d8765e59aa83918c5b8059a",
    "minio_url": "https://data.openml.org/datasets/0003/34631/dataset_34631.pq",
    "name": "QSAR-DATASET-FOR-DRUG-TARGET-CHEMBL4552",
    "original_data_url": "https://www.ebi.ac.uk/chembl/target/inspect/CHEMBL4552",
    "parquet_url": "https://data.openml.org/datasets/0003/34631/dataset_34631.pq",
    "processing_date": "2018-10-04 04:13:59",
    "row_id_attribute": "molecule_id",
    "status": "deactivated",
    "tag": [
      "MetaQSAR",
      "study_13"
    ],
    "upload_date": "2016-07-15T15:52:44",
    "url": "https://api.openml.org/data/v1/download/3534361/QSAR-DATASET-FOR-DRUG-TARGET-CHEMBL4552.arff",
    "version": "11",
    "visibility": "public"
  }
}