{
  "data_features": {
    "feature": [
      {
        "data_type": "nominal",
        "index": "0",
        "is_ignore": "false",
        "is_row_identifier": "true",
        "is_target": "false",
        "name": "molecule_id",
        "nominal_value": [
          "CHEMBL359730",
          "CHEMBL444913",
          "CHEMBL448763",
          "CHEMBL454726",
          "CHEMBL483378",
          "CHEMBL484373",
          "CHEMBL484374",
          "CHEMBL484383",
          "CHEMBL484385",
          "CHEMBL485562",
          "CHEMBL505418",
          "CHEMBL505661",
          "CHEMBL519009",
          "CHEMBL519852",
          "CHEMBL520191",
          "CHEMBL525239"
        ],
        "number_of_missing_values": "0"
      },
      {
        "data_type": "numeric",
        "index": "1",
        "is_ignore": "false",
        "is_row_identifier": "false",
        "is_target": "false",
        "name": "Sp",
        "number_of_missing_values": "0"
      },
      {
        "data_type": "numeric",
        "index": "2",
        "is_ignore": "false",
        "is_row_identifier": "false",
        "is_target": "false",
        "name": "Sv",
        "number_of_missing_values": "0"
      },
      {
        "data_type": "numeric",
        "index": "3",
        "is_ignore": "false",
        "is_row_identifier": "false",
        "is_target": "true",
        "name": "pXC50",
        "number_of_missing_values": "0"
      }
    ]
  }
}