{
  "data_features": {
    "feature": [
      {
        "data_type": "nominal",
        "index": "0",
        "is_ignore": "false",
        "is_row_identifier": "true",
        "is_target": "false",
        "name": "molecule_id",
        "nominal_value": [
          "CHEMBL10453",
          "CHEMBL105383",
          "CHEMBL10574",
          "CHEMBL107714",
          "CHEMBL107981",
          "CHEMBL10813",
          "CHEMBL10825",
          "CHEMBL108472",
          "CHEMBL10879",
          "CHEMBL108843",
          "CHEMBL109292",
          "CHEMBL1094323",
          "CHEMBL1094483",
          "CHEMBL1094486",
          "CHEMBL1094487",
          "CHEMBL1094785",
          "CHEMBL1095777",
          "CHEMBL1095778",
          "CHEMBL1095779",
          "CHEMBL10983",
          "CHEMBL10988",
          "CHEMBL11051",
          "CHEMBL110659",
          "CHEMBL11080",
          "CHEMBL110891",
          "CHEMBL11092",
          "CHEMBL11093",
          "CHEMBL11097",
          "CHEMBL111090",
          "CHEMBL111103",
          "CHEMBL11125",
          "CHEMBL11135",
          "CHEMBL111415",
          "CHEMBL111706",
          "CHEMBL11171",
          "CHEMBL11178",
          "CHEMBL11224",
          "CHEMBL11268",
          "CHEMBL11307",
          "CHEMBL11362",
          "CHEMBL11396",
          "CHEMBL11401",
          "CHEMBL11406",
          "CHEMBL11414",
          "CHEMBL11427",
          "CHEMBL11431",
          "CHEMBL11467",
          "CHEMBL1160723",
          "CHEMBL1161382",
          "CHEMBL1161383",
          "CHEMBL1161384",
          "CHEMBL1161385",
          "CHEMBL1161386",
          "CHEMBL1161387",
          "CHEMBL1161388",
          "CHEMBL11671",
          "CHEMBL1200811",
          "CHEMBL123566",
          "CHEMBL1263",
          "CHEMBL126394",
          "CHEMBL13",
          "CHEMBL13284",
          "CHEMBL13358",
          "CHEMBL13365",
          "CHEMBL13504",
          "CHEMBL1363",
          "CHEMBL1369414",
          "CHEMBL142428",
          "CHEMBL143645",
          "CHEMBL1437",
          "CHEMBL145381",
          "CHEMBL148306",
          "CHEMBL155714",
          "CHEMBL156147",
          "CHEMBL156258",
          "CHEMBL156271",
          "CHEMBL156304",
          "CHEMBL156603",
          "CHEMBL156682",
          "CHEMBL156683",
          "CHEMBL156871",
          "CHEMBL157557",
          "CHEMBL160282",
          "CHEMBL1682210",
          "CHEMBL1682211",
          "CHEMBL1682212",
          "CHEMBL1682213",
          "CHEMBL1682214",
          "CHEMBL1682215",
          "CHEMBL1682216",
          "CHEMBL1682217",
          "CHEMBL1682218",
          "CHEMBL1682219",
          "CHEMBL1682220",
          "CHEMBL1682221",
          "CHEMBL1682302",
          "CHEMBL171059",
          "CHEMBL172723",
          "CHEMBL173424",
          "CHEMBL173629",
          "CHEMBL173976",
          "CHEMBL1741004",
          "CHEMBL174259",
          "CHEMBL1744069",
          "CHEMBL174783",
          "CHEMBL174853",
          "CHEMBL174882",
          "CHEMBL175010",
          "CHEMBL1773197",
          "CHEMBL1773267",
          "CHEMBL177765",
          "CHEMBL177860",
          "CHEMBL1788251",
          "CHEMBL1788270",
          "CHEMBL1788274",
          "CHEMBL1788320",
          "CHEMBL1814268",
          "CHEMBL1814272",
          "CHEMBL1814278",
          "CHEMBL1814280",
          "CHEMBL1835853",
          "CHEMBL1835854",
          "CHEMBL1835859",
          "CHEMBL1835862",
          "CHEMBL1944691",
          "CHEMBL1945032",
          "CHEMBL1945033",
          "CHEMBL1945039",
          "CHEMBL1945292",
          "CHEMBL1947151",
          "CHEMBL1947152",
          "CHEMBL1951065",
          "CHEMBL1951066",
          "CHEMBL1951067",
          "CHEMBL1951068",
          "CHEMBL1951069",
          "CHEMBL1951070",
          "CHEMBL1951071",
          "CHEMBL2052004",
          "CHEMBL2052005",
          "CHEMBL2052006",
          "CHEMBL206100",
          "CHEMBL2088197",
          "CHEMBL2088198",
          "CHEMBL2092996",
          "CHEMBL2093060",
          "CHEMBL2096750",
          "CHEMBL2096751",
          "CHEMBL2096752",
          "CHEMBL2110257",
          "CHEMBL2335408",
          "CHEMBL2335409",
          "CHEMBL2335410",
          "CHEMBL2335411",
          "CHEMBL2335412",
          "CHEMBL2335413",
          "CHEMBL2335414",
          "CHEMBL2335415",
          "CHEMBL24",
          "CHEMBL24045",
          "CHEMBL243266",
          "CHEMBL24391",
          "CHEMBL244321",
          "CHEMBL244687",
          "CHEMBL24480",
          "CHEMBL244906",
          "CHEMBL24500",
          "CHEMBL24586",
          "CHEMBL24644",
          "CHEMBL25929",
          "CHEMBL26003",
          "CHEMBL26049",
          "CHEMBL26059",
          "CHEMBL26224",
          "CHEMBL263065",
          "CHEMBL26506",
          "CHEMBL26507",
          "CHEMBL26607",
          "CHEMBL266619",
          "CHEMBL26917",
          "CHEMBL269219",
          "CHEMBL269467",
          "CHEMBL27",
          "CHEMBL274830",
          "CHEMBL275691",
          "CHEMBL275934",
          "CHEMBL276029",
          "CHEMBL279777",
          "CHEMBL281109",
          "CHEMBL281294",
          "CHEMBL281298",
          "CHEMBL281967",
          "CHEMBL282537",
          "CHEMBL283289",
          "CHEMBL284808",
          "CHEMBL284909",
          "CHEMBL285309",
          "CHEMBL285972",
          "CHEMBL286783",
          "CHEMBL286894",
          "CHEMBL287242",
          "CHEMBL287651",
          "CHEMBL287766",
          "CHEMBL288140",
          "CHEMBL288546",
          "CHEMBL289093",
          "CHEMBL289858",
          "CHEMBL289868",
          "CHEMBL290153",
          "CHEMBL291115",
          "CHEMBL299175",
          "CHEMBL302339",
          "CHEMBL30289",
          "CHEMBL30292",
          "CHEMBL302935",
          "CHEMBL304344",
          "CHEMBL304725",
          "CHEMBL305153",
          "CHEMBL30622",
          "CHEMBL30816",
          "CHEMBL30899",
          "CHEMBL30942",
          "CHEMBL31021",
          "CHEMBL31025",
          "CHEMBL31036",
          "CHEMBL31050",
          "CHEMBL31099",
          "CHEMBL31117",
          "CHEMBL31335",
          "CHEMBL31392",
          "CHEMBL31411",
          "CHEMBL31416",
          "CHEMBL31450",
          "CHEMBL31529",
          "CHEMBL31568",
          "CHEMBL31583",
          "CHEMBL31598",
          "CHEMBL31608",
          "CHEMBL31611",
          "CHEMBL31638",
          "CHEMBL31677",
          "CHEMBL31772",
          "CHEMBL31811",
          "CHEMBL31857",
          "CHEMBL31888",
          "CHEMBL31938",
          "CHEMBL320696",
          "CHEMBL320704",
          "CHEMBL320761",
          "CHEMBL322130",
          "CHEMBL322139",
          "CHEMBL322842",
          "CHEMBL323176",
          "CHEMBL324412",
          "CHEMBL325371",
          "CHEMBL327091",
          "CHEMBL32736",
          "CHEMBL32800",
          "CHEMBL32902",
          "CHEMBL331036",
          "CHEMBL341654",
          "CHEMBL346326",
          "CHEMBL346539",
          "CHEMBL346972",
          "CHEMBL347002",
          "CHEMBL355100",
          "CHEMBL358648",
          "CHEMBL363325",
          "CHEMBL366389",
          "CHEMBL366558",
          "CHEMBL366573",
          "CHEMBL366769",
          "CHEMBL368457",
          "CHEMBL38033",
          "CHEMBL38114",
          "CHEMBL394600",
          "CHEMBL395082",
          "CHEMBL39682",
          "CHEMBL39706",
          "CHEMBL39873",
          "CHEMBL39987",
          "CHEMBL40626",
          "CHEMBL40783",
          "CHEMBL40971",
          "CHEMBL41378",
          "CHEMBL415970",
          "CHEMBL416030",
          "CHEMBL416150",
          "CHEMBL416151",
          "CHEMBL41839",
          "CHEMBL418819",
          "CHEMBL419741",
          "CHEMBL419994",
          "CHEMBL424369",
          "CHEMBL427297",
          "CHEMBL427310",
          "CHEMBL429",
          "CHEMBL431713",
          "CHEMBL434",
          "CHEMBL434360",
          "CHEMBL442522",
          "CHEMBL448775",
          "CHEMBL449651",
          "CHEMBL460574",
          "CHEMBL462313",
          "CHEMBL470584",
          "CHEMBL49080",
          "CHEMBL499",
          "CHEMBL509336",
          "CHEMBL536552",
          "CHEMBL537445",
          "CHEMBL538537",
          "CHEMBL540337",
          "CHEMBL541088",
          "CHEMBL541607",
          "CHEMBL543940",
          "CHEMBL545289",
          "CHEMBL545293",
          "CHEMBL545575",
          "CHEMBL552398",
          "CHEMBL554669",
          "CHEMBL554785",
          "CHEMBL555391",
          "CHEMBL555637",
          "CHEMBL555848",
          "CHEMBL63421",
          "CHEMBL63582",
          "CHEMBL66324",
          "CHEMBL66331",
          "CHEMBL66384",
          "CHEMBL66449",
          "CHEMBL66662",
          "CHEMBL66702",
          "CHEMBL66724",
          "CHEMBL67096",
          "CHEMBL67151",
          "CHEMBL67331",
          "CHEMBL67631",
          "CHEMBL679",
          "CHEMBL68419",
          "CHEMBL68945",
          "CHEMBL68996",
          "CHEMBL69635",
          "CHEMBL6995",
          "CHEMBL7067",
          "CHEMBL714",
          "CHEMBL7154",
          "CHEMBL7585",
          "CHEMBL768",
          "CHEMBL92103"
        ],
        "number_of_missing_values": "0"
      },
      {
        "data_type": "numeric",
        "index": "1",
        "is_ignore": "false",
        "is_row_identifier": "false",
        "is_target": "false",
        "name": "CATS2D_04_DL",
        "number_of_missing_values": "0"
      },
      {
        "data_type": "numeric",
        "index": "2",
        "is_ignore": "false",
        "is_row_identifier": "false",
        "is_target": "false",
        "name": "Eig05_AEA.dm.",
        "number_of_missing_values": "0"
      },
      {
        "data_type": "numeric",
        "index": "3",
        "is_ignore": "false",
        "is_row_identifier": "false",
        "is_target": "false",
        "name": "CATS2D_07_LL",
        "number_of_missing_values": "0"
      },
      {
        "data_type": "numeric",
        "index": "4",
        "is_ignore": "false",
        "is_row_identifier": "false",
        "is_target": "false",
        "name": "N.072",
        "number_of_missing_values": "0"
      },
      {
        "data_type": "numeric",
        "index": "5",
        "is_ignore": "false",
        "is_row_identifier": "false",
        "is_target": "false",
        "name": "P_VSA_LogP_3",
        "number_of_missing_values": "0"
      },
      {
        "data_type": "numeric",
        "index": "6",
        "is_ignore": "false",
        "is_row_identifier": "false",
        "is_target": "false",
        "name": "CATS2D_07_DD",
        "number_of_missing_values": "0"
      },
      {
        "data_type": "numeric",
        "index": "7",
        "is_ignore": "false",
        "is_row_identifier": "false",
        "is_target": "false",
        "name": "LLS_01",
        "number_of_missing_values": "0"
      },
      {
        "data_type": "numeric",
        "index": "8",
        "is_ignore": "false",
        "is_row_identifier": "false",
        "is_target": "false",
        "name": "CATS2D_06_DD",
        "number_of_missing_values": "0"
      },
      {
        "data_type": "numeric",
        "index": "9",
        "is_ignore": "false",
        "is_row_identifier": "false",
        "is_target": "false",
        "name": "CATS2D_08_LL",
        "number_of_missing_values": "0"
      },
      {
        "data_type": "numeric",
        "index": "10",
        "is_ignore": "false",
        "is_row_identifier": "false",
        "is_target": "false",
        "name": "Eig04_EA.ri.",
        "number_of_missing_values": "0"
      },
      {
        "data_type": "numeric",
        "index": "11",
        "is_ignore": "false",
        "is_row_identifier": "false",
        "is_target": "false",
        "name": "CATS2D_09_LL",
        "number_of_missing_values": "0"
      },
      {
        "data_type": "numeric",
        "index": "12",
        "is_ignore": "false",
        "is_row_identifier": "false",
        "is_target": "false",
        "name": "NssNH",
        "number_of_missing_values": "0"
      },
      {
        "data_type": "numeric",
        "index": "13",
        "is_ignore": "false",
        "is_row_identifier": "false",
        "is_target": "false",
        "name": "SssNH",
        "number_of_missing_values": "0"
      },
      {
        "data_type": "numeric",
        "index": "14",
        "is_ignore": "false",
        "is_row_identifier": "false",
        "is_target": "false",
        "name": "SpMin3_Bh.e.",
        "number_of_missing_values": "0"
      },
      {
        "data_type": "numeric",
        "index": "15",
        "is_ignore": "false",
        "is_row_identifier": "false",
        "is_target": "false",
        "name": "Eig04_AEA.ri.",
        "number_of_missing_values": "0"
      },
      {
        "data_type": "numeric",
        "index": "16",
        "is_ignore": "false",
        "is_row_identifier": "false",
        "is_target": "false",
        "name": "SpMin1_Bh.i.",
        "number_of_missing_values": "0"
      },
      {
        "data_type": "numeric",
        "index": "17",
        "is_ignore": "false",
        "is_row_identifier": "false",
        "is_target": "false",
        "name": "Eig12_AEA.dm.",
        "number_of_missing_values": "0"
      },
      {
        "data_type": "numeric",
        "index": "18",
        "is_ignore": "false",
        "is_row_identifier": "false",
        "is_target": "false",
        "name": "Chi1_EA.dm.",
        "number_of_missing_values": "0"
      },
      {
        "data_type": "numeric",
        "index": "19",
        "is_ignore": "false",
        "is_row_identifier": "false",
        "is_target": "false",
        "name": "IC4",
        "number_of_missing_values": "0"
      },
      {
        "data_type": "numeric",
        "index": "20",
        "is_ignore": "false",
        "is_row_identifier": "false",
        "is_target": "false",
        "name": "CATS2D_02_DL",
        "number_of_missing_values": "0"
      },
      {
        "data_type": "numeric",
        "index": "21",
        "is_ignore": "false",
        "is_row_identifier": "false",
        "is_target": "false",
        "name": "SdO",
        "number_of_missing_values": "0"
      },
      {
        "data_type": "numeric",
        "index": "22",
        "is_ignore": "false",
        "is_row_identifier": "false",
        "is_target": "false",
        "name": "SpMin1_Bh.e.",
        "number_of_missing_values": "0"
      },
      {
        "data_type": "numeric",
        "index": "23",
        "is_ignore": "false",
        "is_row_identifier": "false",
        "is_target": "false",
        "name": "Eig13_AEA.dm.",
        "number_of_missing_values": "0"
      },
      {
        "data_type": "numeric",
        "index": "24",
        "is_ignore": "false",
        "is_row_identifier": "false",
        "is_target": "false",
        "name": "IC5",
        "number_of_missing_values": "0"
      },
      {
        "data_type": "numeric",
        "index": "25",
        "is_ignore": "false",
        "is_row_identifier": "false",
        "is_target": "false",
        "name": "Eig12_EA",
        "number_of_missing_values": "0"
      },
      {
        "data_type": "numeric",
        "index": "26",
        "is_ignore": "false",
        "is_row_identifier": "false",
        "is_target": "false",
        "name": "SM06_AEA.dm.",
        "number_of_missing_values": "0"
      },
      {
        "data_type": "numeric",
        "index": "27",
        "is_ignore": "false",
        "is_row_identifier": "false",
        "is_target": "false",
        "name": "ATS3p",
        "number_of_missing_values": "0"
      },
      {
        "data_type": "numeric",
        "index": "28",
        "is_ignore": "false",
        "is_row_identifier": "false",
        "is_target": "false",
        "name": "Eig13_EA",
        "number_of_missing_values": "0"
      },
      {
        "data_type": "numeric",
        "index": "29",
        "is_ignore": "false",
        "is_row_identifier": "false",
        "is_target": "false",
        "name": "SM07_AEA.dm.",
        "number_of_missing_values": "0"
      },
      {
        "data_type": "numeric",
        "index": "30",
        "is_ignore": "false",
        "is_row_identifier": "false",
        "is_target": "false",
        "name": "Eig11_EA.ri.",
        "number_of_missing_values": "0"
      },
      {
        "data_type": "numeric",
        "index": "31",
        "is_ignore": "false",
        "is_row_identifier": "false",
        "is_target": "false",
        "name": "C.025",
        "number_of_missing_values": "0"
      },
      {
        "data_type": "numeric",
        "index": "32",
        "is_ignore": "false",
        "is_row_identifier": "false",
        "is_target": "false",
        "name": "ATSC8i",
        "number_of_missing_values": "0"
      },
      {
        "data_type": "numeric",
        "index": "33",
        "is_ignore": "false",
        "is_row_identifier": "false",
        "is_target": "false",
        "name": "Eig13_EA.ed.",
        "number_of_missing_values": "0"
      },
      {
        "data_type": "numeric",
        "index": "34",
        "is_ignore": "false",
        "is_row_identifier": "false",
        "is_target": "false",
        "name": "SM08_AEA.ri.",
        "number_of_missing_values": "0"
      },
      {
        "data_type": "numeric",
        "index": "35",
        "is_ignore": "false",
        "is_row_identifier": "false",
        "is_target": "false",
        "name": "ATSC8v",
        "number_of_missing_values": "0"
      },
      {
        "data_type": "numeric",
        "index": "36",
        "is_ignore": "false",
        "is_row_identifier": "false",
        "is_target": "false",
        "name": "D.Dtr06",
        "number_of_missing_values": "0"
      },
      {
        "data_type": "numeric",
        "index": "37",
        "is_ignore": "false",
        "is_row_identifier": "false",
        "is_target": "false",
        "name": "Eig14_AEA.dm.",
        "number_of_missing_values": "0"
      },
      {
        "data_type": "numeric",
        "index": "38",
        "is_ignore": "false",
        "is_row_identifier": "false",
        "is_target": "false",
        "name": "Eig13_EA.bo.",
        "number_of_missing_values": "0"
      },
      {
        "data_type": "numeric",
        "index": "39",
        "is_ignore": "false",
        "is_row_identifier": "false",
        "is_target": "false",
        "name": "Eig10_AEA.ri.",
        "number_of_missing_values": "0"
      },
      {
        "data_type": "numeric",
        "index": "40",
        "is_ignore": "false",
        "is_row_identifier": "false",
        "is_target": "false",
        "name": "CATS2D_05_DL",
        "number_of_missing_values": "0"
      },
      {
        "data_type": "numeric",
        "index": "41",
        "is_ignore": "false",
        "is_row_identifier": "false",
        "is_target": "false",
        "name": "Eig13_AEA.ri.",
        "number_of_missing_values": "0"
      },
      {
        "data_type": "numeric",
        "index": "42",
        "is_ignore": "false",
        "is_row_identifier": "false",
        "is_target": "false",
        "name": "Eig13_EA.ri.",
        "number_of_missing_values": "0"
      },
      {
        "data_type": "numeric",
        "index": "43",
        "is_ignore": "false",
        "is_row_identifier": "false",
        "is_target": "false",
        "name": "Eig10_EA.ri.",
        "number_of_missing_values": "0"
      },
      {
        "data_type": "numeric",
        "index": "44",
        "is_ignore": "false",
        "is_row_identifier": "false",
        "is_target": "false",
        "name": "Eig10_EA.bo.",
        "number_of_missing_values": "0"
      },
      {
        "data_type": "numeric",
        "index": "45",
        "is_ignore": "false",
        "is_row_identifier": "false",
        "is_target": "false",
        "name": "Eig11_EA.ed.",
        "number_of_missing_values": "0"
      },
      {
        "data_type": "numeric",
        "index": "46",
        "is_ignore": "false",
        "is_row_identifier": "false",
        "is_target": "false",
        "name": "SM06_AEA.ri.",
        "number_of_missing_values": "0"
      },
      {
        "data_type": "numeric",
        "index": "47",
        "is_ignore": "false",
        "is_row_identifier": "false",
        "is_target": "false",
        "name": "Eig10_EA",
        "number_of_missing_values": "0"
      },
      {
        "data_type": "numeric",
        "index": "48",
        "is_ignore": "false",
        "is_row_identifier": "false",
        "is_target": "false",
        "name": "SM04_AEA.dm.",
        "number_of_missing_values": "0"
      },
      {
        "data_type": "numeric",
        "index": "49",
        "is_ignore": "false",
        "is_row_identifier": "false",
        "is_target": "false",
        "name": "DLS_01",
        "number_of_missing_values": "0"
      },
      {
        "data_type": "numeric",
        "index": "50",
        "is_ignore": "false",
        "is_row_identifier": "false",
        "is_target": "false",
        "name": "ATS3v",
        "number_of_missing_values": "0"
      },
      {
        "data_type": "numeric",
        "index": "51",
        "is_ignore": "false",
        "is_row_identifier": "false",
        "is_target": "false",
        "name": "C.041",
        "number_of_missing_values": "0"
      },
      {
        "data_type": "numeric",
        "index": "52",
        "is_ignore": "false",
        "is_row_identifier": "false",
        "is_target": "false",
        "name": "Eig11_AEA.ri.",
        "number_of_missing_values": "0"
      },
      {
        "data_type": "numeric",
        "index": "53",
        "is_ignore": "false",
        "is_row_identifier": "false",
        "is_target": "false",
        "name": "Eig12_AEA.ri.",
        "number_of_missing_values": "0"
      },
      {
        "data_type": "numeric",
        "index": "54",
        "is_ignore": "false",
        "is_row_identifier": "false",
        "is_target": "false",
        "name": "Eig12_EA.ri.",
        "number_of_missing_values": "0"
      },
      {
        "data_type": "numeric",
        "index": "55",
        "is_ignore": "false",
        "is_row_identifier": "false",
        "is_target": "false",
        "name": "ATS2p",
        "number_of_missing_values": "0"
      },
      {
        "data_type": "numeric",
        "index": "56",
        "is_ignore": "false",
        "is_row_identifier": "false",
        "is_target": "false",
        "name": "ATS2v",
        "number_of_missing_values": "0"
      },
      {
        "data_type": "numeric",
        "index": "57",
        "is_ignore": "false",
        "is_row_identifier": "false",
        "is_target": "false",
        "name": "ATS5s",
        "number_of_missing_values": "0"
      },
      {
        "data_type": "numeric",
        "index": "58",
        "is_ignore": "false",
        "is_row_identifier": "false",
        "is_target": "false",
        "name": "SpMax6_Bh.v.",
        "number_of_missing_values": "0"
      },
      {
        "data_type": "numeric",
        "index": "59",
        "is_ignore": "false",
        "is_row_identifier": "false",
        "is_target": "false",
        "name": "SM02_EA.ri.",
        "number_of_missing_values": "0"
      },
      {
        "data_type": "numeric",
        "index": "60",
        "is_ignore": "false",
        "is_row_identifier": "false",
        "is_target": "false",
        "name": "Eig12_EA.ed.",
        "number_of_missing_values": "0"
      },
      {
        "data_type": "numeric",
        "index": "61",
        "is_ignore": "false",
        "is_row_identifier": "false",
        "is_target": "false",
        "name": "SM07_AEA.ri.",
        "number_of_missing_values": "0"
      },
      {
        "data_type": "numeric",
        "index": "62",
        "is_ignore": "false",
        "is_row_identifier": "false",
        "is_target": "false",
        "name": "Eig11_EA",
        "number_of_missing_values": "0"
      },
      {
        "data_type": "numeric",
        "index": "63",
        "is_ignore": "false",
        "is_row_identifier": "false",
        "is_target": "false",
        "name": "SM05_AEA.dm.",
        "number_of_missing_values": "0"
      },
      {
        "data_type": "numeric",
        "index": "64",
        "is_ignore": "false",
        "is_row_identifier": "false",
        "is_target": "false",
        "name": "CATS2D_03_DL",
        "number_of_missing_values": "0"
      },
      {
        "data_type": "numeric",
        "index": "65",
        "is_ignore": "false",
        "is_row_identifier": "false",
        "is_target": "false",
        "name": "BIC4",
        "number_of_missing_values": "0"
      },
      {
        "data_type": "numeric",
        "index": "66",
        "is_ignore": "false",
        "is_row_identifier": "false",
        "is_target": "true",
        "name": "pXC50",
        "number_of_missing_values": "0"
      }
    ]
  }
}