{
  "data_features": {
    "feature": [
      {
        "data_type": "nominal",
        "index": "0",
        "is_ignore": "false",
        "is_row_identifier": "true",
        "is_target": "false",
        "name": "molecule_id",
        "nominal_value": [
          "CHEMBL10",
          "CHEMBL101253",
          "CHEMBL101311",
          "CHEMBL102301",
          "CHEMBL102346",
          "CHEMBL103667",
          "CHEMBL104067",
          "CHEMBL104466",
          "CHEMBL105442",
          "CHEMBL106966",
          "CHEMBL1079545",
          "CHEMBL1080994",
          "CHEMBL1080995",
          "CHEMBL1081312",
          "CHEMBL1081509",
          "CHEMBL1084546",
          "CHEMBL1085511",
          "CHEMBL1087650",
          "CHEMBL1089865",
          "CHEMBL1091356",
          "CHEMBL1092754",
          "CHEMBL1095626",
          "CHEMBL1095627",
          "CHEMBL1163016",
          "CHEMBL1164180",
          "CHEMBL1164957",
          "CHEMBL1173411",
          "CHEMBL1173655",
          "CHEMBL117697",
          "CHEMBL119385",
          "CHEMBL120077",
          "CHEMBL1230020",
          "CHEMBL1233887",
          "CHEMBL1236107",
          "CHEMBL1240703",
          "CHEMBL1241674",
          "CHEMBL1242557",
          "CHEMBL124660",
          "CHEMBL1254007",
          "CHEMBL1269806",
          "CHEMBL1271470",
          "CHEMBL1271471",
          "CHEMBL1271472",
          "CHEMBL1271524",
          "CHEMBL1271576",
          "CHEMBL1271577",
          "CHEMBL1271631",
          "CHEMBL1271683",
          "CHEMBL1271736",
          "CHEMBL1271796",
          "CHEMBL1271853",
          "CHEMBL1271965",
          "CHEMBL1272020",
          "CHEMBL1272021",
          "CHEMBL1272076",
          "CHEMBL1272077",
          "CHEMBL1272116",
          "CHEMBL1272126",
          "CHEMBL1272127",
          "CHEMBL1272128",
          "CHEMBL1272171",
          "CHEMBL1272180",
          "CHEMBL1272181",
          "CHEMBL1272182",
          "CHEMBL1272236",
          "CHEMBL1272237",
          "CHEMBL1272238",
          "CHEMBL1272289",
          "CHEMBL1272290",
          "CHEMBL1272291",
          "CHEMBL1287853",
          "CHEMBL1289926",
          "CHEMBL1336",
          "CHEMBL1421",
          "CHEMBL1421720",
          "CHEMBL14762",
          "CHEMBL1614701",
          "CHEMBL1614725",
          "CHEMBL162",
          "CHEMBL1651523",
          "CHEMBL1668411",
          "CHEMBL1668412",
          "CHEMBL1668413",
          "CHEMBL1668414",
          "CHEMBL1668415",
          "CHEMBL1668416",
          "CHEMBL1668417",
          "CHEMBL1668418",
          "CHEMBL1668419",
          "CHEMBL1668420",
          "CHEMBL16699",
          "CHEMBL1681932",
          "CHEMBL1721885",
          "CHEMBL1727312",
          "CHEMBL1765715",
          "CHEMBL1765716",
          "CHEMBL1765717",
          "CHEMBL1765718",
          "CHEMBL1765719",
          "CHEMBL1765781",
          "CHEMBL1766529",
          "CHEMBL178156",
          "CHEMBL178276",
          "CHEMBL178455",
          "CHEMBL1784637",
          "CHEMBL1784725",
          "CHEMBL178568",
          "CHEMBL178981",
          "CHEMBL1789941",
          "CHEMBL179061",
          "CHEMBL179082",
          "CHEMBL179165",
          "CHEMBL179227",
          "CHEMBL179307",
          "CHEMBL179360",
          "CHEMBL179422",
          "CHEMBL179450",
          "CHEMBL179522",
          "CHEMBL179593",
          "CHEMBL179603",
          "CHEMBL179698",
          "CHEMBL179719",
          "CHEMBL179753",
          "CHEMBL179815",
          "CHEMBL179816",
          "CHEMBL180022",
          "CHEMBL180331",
          "CHEMBL1813632",
          "CHEMBL1822792",
          "CHEMBL1825138",
          "CHEMBL1834657",
          "CHEMBL1870106",
          "CHEMBL1879463",
          "CHEMBL189963",
          "CHEMBL1908391",
          "CHEMBL1908392",
          "CHEMBL1908393",
          "CHEMBL1908394",
          "CHEMBL1908395",
          "CHEMBL1908396",
          "CHEMBL1908397",
          "CHEMBL191003",
          "CHEMBL1929238",
          "CHEMBL1933288",
          "CHEMBL1934327",
          "CHEMBL1945559",
          "CHEMBL1949855",
          "CHEMBL196363",
          "CHEMBL1964382",
          "CHEMBL1964441",
          "CHEMBL1964902",
          "CHEMBL1964948",
          "CHEMBL1965033",
          "CHEMBL1965169",
          "CHEMBL1965170",
          "CHEMBL1965387",
          "CHEMBL1965507",
          "CHEMBL1965660",
          "CHEMBL1965683",
          "CHEMBL1966175",
          "CHEMBL1967252",
          "CHEMBL1967336",
          "CHEMBL1967513",
          "CHEMBL1967538",
          "CHEMBL1967720",
          "CHEMBL1967878",
          "CHEMBL1967992",
          "CHEMBL1967998",
          "CHEMBL1968705",
          "CHEMBL1968868",
          "CHEMBL1969151",
          "CHEMBL1969156",
          "CHEMBL1969664",
          "CHEMBL1969942",
          "CHEMBL1970290",
          "CHEMBL1970317",
          "CHEMBL1970340",
          "CHEMBL1970352",
          "CHEMBL1971132",
          "CHEMBL1971289",
          "CHEMBL1971606",
          "CHEMBL1971785",
          "CHEMBL1971943",
          "CHEMBL1972220",
          "CHEMBL1972346",
          "CHEMBL1972355",
          "CHEMBL1973013",
          "CHEMBL1973138",
          "CHEMBL1973359",
          "CHEMBL1973363",
          "CHEMBL1973516",
          "CHEMBL1973720",
          "CHEMBL1973793",
          "CHEMBL1973868",
          "CHEMBL1973961",
          "CHEMBL1974328",
          "CHEMBL1974617",
          "CHEMBL1974875",
          "CHEMBL1975121",
          "CHEMBL1975212",
          "CHEMBL1975903",
          "CHEMBL1975921",
          "CHEMBL1975923",
          "CHEMBL1975927",
          "CHEMBL1976040",
          "CHEMBL1976196",
          "CHEMBL1976376",
          "CHEMBL1976420",
          "CHEMBL1977134",
          "CHEMBL1977138",
          "CHEMBL1977634",
          "CHEMBL1977749",
          "CHEMBL1977931",
          "CHEMBL1978166",
          "CHEMBL1978167",
          "CHEMBL1978195",
          "CHEMBL1978271",
          "CHEMBL1978371",
          "CHEMBL1978448",
          "CHEMBL1978562",
          "CHEMBL1978567",
          "CHEMBL1979577",
          "CHEMBL1979690",
          "CHEMBL1979773",
          "CHEMBL1980167",
          "CHEMBL1980246",
          "CHEMBL1980297",
          "CHEMBL1980329",
          "CHEMBL1980376",
          "CHEMBL1980391",
          "CHEMBL1980407",
          "CHEMBL1980671",
          "CHEMBL1980763",
          "CHEMBL1980995",
          "CHEMBL1981047",
          "CHEMBL1981133",
          "CHEMBL1981215",
          "CHEMBL1981492",
          "CHEMBL1981744",
          "CHEMBL1981792",
          "CHEMBL1982413",
          "CHEMBL1982660",
          "CHEMBL1982700",
          "CHEMBL1982711",
          "CHEMBL1982753",
          "CHEMBL1983070",
          "CHEMBL1983111",
          "CHEMBL1983268",
          "CHEMBL1983348",
          "CHEMBL1983393",
          "CHEMBL1983575",
          "CHEMBL1983630",
          "CHEMBL1983640",
          "CHEMBL1983715",
          "CHEMBL1983923",
          "CHEMBL1983945",
          "CHEMBL1983980",
          "CHEMBL1984038",
          "CHEMBL1984236",
          "CHEMBL1984296",
          "CHEMBL1984686",
          "CHEMBL1984760",
          "CHEMBL1984842",
          "CHEMBL1984847",
          "CHEMBL1985042",
          "CHEMBL1985206",
          "CHEMBL1985367",
          "CHEMBL1985681",
          "CHEMBL1986143",
          "CHEMBL1986177",
          "CHEMBL1986265",
          "CHEMBL1986590",
          "CHEMBL1986756",
          "CHEMBL1986851",
          "CHEMBL1986899",
          "CHEMBL1986943",
          "CHEMBL1987430",
          "CHEMBL1987535",
          "CHEMBL1987998",
          "CHEMBL1988141",
          "CHEMBL1988437",
          "CHEMBL1988581",
          "CHEMBL1988692",
          "CHEMBL1988805",
          "CHEMBL1989043",
          "CHEMBL1989267",
          "CHEMBL1989423",
          "CHEMBL1989471",
          "CHEMBL1989708",
          "CHEMBL1989834",
          "CHEMBL1990223",
          "CHEMBL1990254",
          "CHEMBL1990496",
          "CHEMBL1990590",
          "CHEMBL1990885",
          "CHEMBL1991008",
          "CHEMBL1991410",
          "CHEMBL1991674",
          "CHEMBL1991678",
          "CHEMBL1991734",
          "CHEMBL1991782",
          "CHEMBL1991818",
          "CHEMBL1991867",
          "CHEMBL1992042",
          "CHEMBL1992073",
          "CHEMBL1992125",
          "CHEMBL1992354",
          "CHEMBL1992371",
          "CHEMBL1992581",
          "CHEMBL1992673",
          "CHEMBL1992937",
          "CHEMBL1993335",
          "CHEMBL1993374",
          "CHEMBL1993413",
          "CHEMBL1993634",
          "CHEMBL1993661",
          "CHEMBL1993877",
          "CHEMBL1993904",
          "CHEMBL1994318",
          "CHEMBL1994526",
          "CHEMBL1994555",
          "CHEMBL1994724",
          "CHEMBL1994808",
          "CHEMBL1994956",
          "CHEMBL1994977",
          "CHEMBL1995172",
          "CHEMBL1995211",
          "CHEMBL1995765",
          "CHEMBL1995811",
          "CHEMBL1995916",
          "CHEMBL1996048",
          "CHEMBL1996176",
          "CHEMBL1996345",
          "CHEMBL1996500",
          "CHEMBL1996510",
          "CHEMBL1996576",
          "CHEMBL1996646",
          "CHEMBL1996649",
          "CHEMBL1996702",
          "CHEMBL1997007",
          "CHEMBL1997193",
          "CHEMBL1997197",
          "CHEMBL1997275",
          "CHEMBL1997335",
          "CHEMBL1997611",
          "CHEMBL1997892",
          "CHEMBL1998110",
          "CHEMBL1998228",
          "CHEMBL1998470",
          "CHEMBL1998680",
          "CHEMBL1998953",
          "CHEMBL1999120",
          "CHEMBL1999414",
          "CHEMBL1999484",
          "CHEMBL1999506",
          "CHEMBL2000029",
          "CHEMBL2000568",
          "CHEMBL2000724",
          "CHEMBL2001019",
          "CHEMBL2001149",
          "CHEMBL2001257",
          "CHEMBL2001451",
          "CHEMBL2001539",
          "CHEMBL2001584",
          "CHEMBL2001613",
          "CHEMBL2001641",
          "CHEMBL2001704",
          "CHEMBL2001923",
          "CHEMBL2001987",
          "CHEMBL2002099",
          "CHEMBL2002105",
          "CHEMBL2002586",
          "CHEMBL2002599",
          "CHEMBL2002690",
          "CHEMBL2002992",
          "CHEMBL2003514",
          "CHEMBL2004025",
          "CHEMBL2004118",
          "CHEMBL2004159",
          "CHEMBL2004290",
          "CHEMBL2004438",
          "CHEMBL2004637",
          "CHEMBL2004716",
          "CHEMBL2005449",
          "CHEMBL2005478",
          "CHEMBL2005699",
          "CHEMBL2005792",
          "CHEMBL2006299",
          "CHEMBL2006450",
          "CHEMBL2006564",
          "CHEMBL2006674",
          "CHEMBL2006765",
          "CHEMBL2007124",
          "CHEMBL2007266",
          "CHEMBL2007375",
          "CHEMBL2007421",
          "CHEMBL2007479",
          "CHEMBL2007559",
          "CHEMBL2007574",
          "CHEMBL2010872",
          "CHEMBL201511",
          "CHEMBL2022856",
          "CHEMBL2023489",
          "CHEMBL202721",
          "CHEMBL202919",
          "CHEMBL203227",
          "CHEMBL203279",
          "CHEMBL2035810",
          "CHEMBL204120",
          "CHEMBL204225",
          "CHEMBL204409",
          "CHEMBL2046883",
          "CHEMBL2048912",
          "CHEMBL205089",
          "CHEMBL205372",
          "CHEMBL205674",
          "CHEMBL205953",
          "CHEMBL2071201",
          "CHEMBL2086397",
          "CHEMBL2086744",
          "CHEMBL2086746",
          "CHEMBL2086747",
          "CHEMBL2086748",
          "CHEMBL2086749",
          "CHEMBL2086750",
          "CHEMBL2086751",
          "CHEMBL2086752",
          "CHEMBL2086753",
          "CHEMBL2086754",
          "CHEMBL2086755",
          "CHEMBL2086756",
          "CHEMBL2086757",
          "CHEMBL2086758",
          "CHEMBL2086759",
          "CHEMBL2086760",
          "CHEMBL2087167",
          "CHEMBL2087168",
          "CHEMBL2087169",
          "CHEMBL21156",
          "CHEMBL2148053",
          "CHEMBL215152",
          "CHEMBL215803",
          "CHEMBL217092",
          "CHEMBL2180604",
          "CHEMBL2203434",
          "CHEMBL2204532",
          "CHEMBL2206277",
          "CHEMBL2206278",
          "CHEMBL2206666",
          "CHEMBL2208034",
          "CHEMBL221959",
          "CHEMBL223360",
          "CHEMBL225519",
          "CHEMBL230011",
          "CHEMBL2309006",
          "CHEMBL2309609",
          "CHEMBL2311806",
          "CHEMBL2311807",
          "CHEMBL2311808",
          "CHEMBL2332119",
          "CHEMBL2332840",
          "CHEMBL2333120",
          "CHEMBL2333126",
          "CHEMBL2333128",
          "CHEMBL2333129",
          "CHEMBL234085",
          "CHEMBL2347053",
          "CHEMBL2348417",
          "CHEMBL235157",
          "CHEMBL237570",
          "CHEMBL242865",
          "CHEMBL24828",
          "CHEMBL249697",
          "CHEMBL253968",
          "CHEMBL253969",
          "CHEMBL255863",
          "CHEMBL259084",
          "CHEMBL261849",
          "CHEMBL262623",
          "CHEMBL26559",
          "CHEMBL276711",
          "CHEMBL278041",
          "CHEMBL279351",
          "CHEMBL288441",
          "CHEMBL296468",
          "CHEMBL300138",
          "CHEMBL31965",
          "CHEMBL319894",
          "CHEMBL323336",
          "CHEMBL359617",
          "CHEMBL360349",
          "CHEMBL360526",
          "CHEMBL360781",
          "CHEMBL360847",
          "CHEMBL362188",
          "CHEMBL362486",
          "CHEMBL362634",
          "CHEMBL368252",
          "CHEMBL369747",
          "CHEMBL369760",
          "CHEMBL377300",
          "CHEMBL377408",
          "CHEMBL378489",
          "CHEMBL379218",
          "CHEMBL379975",
          "CHEMBL380703",
          "CHEMBL382399",
          "CHEMBL38380",
          "CHEMBL384304",
          "CHEMBL386051",
          "CHEMBL398951",
          "CHEMBL406381",
          "CHEMBL406845",
          "CHEMBL415049",
          "CHEMBL422897",
          "CHEMBL424872",
          "CHEMBL425043",
          "CHEMBL425935",
          "CHEMBL426047",
          "CHEMBL426602",
          "CHEMBL428690",
          "CHEMBL440084",
          "CHEMBL440202",
          "CHEMBL445813",
          "CHEMBL450786",
          "CHEMBL451401",
          "CHEMBL458997",
          "CHEMBL459850",
          "CHEMBL461876",
          "CHEMBL464552",
          "CHEMBL465015",
          "CHEMBL466496",
          "CHEMBL467079",
          "CHEMBL468125",
          "CHEMBL475251",
          "CHEMBL476141",
          "CHEMBL477772",
          "CHEMBL477817",
          "CHEMBL481248",
          "CHEMBL482767",
          "CHEMBL482967",
          "CHEMBL482968",
          "CHEMBL483158",
          "CHEMBL483321",
          "CHEMBL488840",
          "CHEMBL49120",
          "CHEMBL491429",
          "CHEMBL491473",
          "CHEMBL494089",
          "CHEMBL496862",
          "CHEMBL497049",
          "CHEMBL498088",
          "CHEMBL498105",
          "CHEMBL498265",
          "CHEMBL498266",
          "CHEMBL502835",
          "CHEMBL504075",
          "CHEMBL504805",
          "CHEMBL50894",
          "CHEMBL509032",
          "CHEMBL511410",
          "CHEMBL513909",
          "CHEMBL519113",
          "CHEMBL521851",
          "CHEMBL522892",
          "CHEMBL524453",
          "CHEMBL525191",
          "CHEMBL525203",
          "CHEMBL525550",
          "CHEMBL525909",
          "CHEMBL535",
          "CHEMBL546797",
          "CHEMBL550418",
          "CHEMBL55137",
          "CHEMBL553",
          "CHEMBL554",
          "CHEMBL558752",
          "CHEMBL561708",
          "CHEMBL565612",
          "CHEMBL568922",
          "CHEMBL569880",
          "CHEMBL571040",
          "CHEMBL572878",
          "CHEMBL572881",
          "CHEMBL573339",
          "CHEMBL574588",
          "CHEMBL574613",
          "CHEMBL574738",
          "CHEMBL575925",
          "CHEMBL576887",
          "CHEMBL576982",
          "CHEMBL576989",
          "CHEMBL578601",
          "CHEMBL592030",
          "CHEMBL597492",
          "CHEMBL597592",
          "CHEMBL598626",
          "CHEMBL601719",
          "CHEMBL602123",
          "CHEMBL605957",
          "CHEMBL606168",
          "CHEMBL606245",
          "CHEMBL607707",
          "CHEMBL608154",
          "CHEMBL7432",
          "CHEMBL7572",
          "CHEMBL7600",
          "CHEMBL7735",
          "CHEMBL91829",
          "CHEMBL939",
          "CHEMBL941",
          "CHEMBL99743"
        ],
        "number_of_missing_values": "0"
      },
      {
        "data_type": "numeric",
        "index": "1",
        "is_ignore": "false",
        "is_row_identifier": "false",
        "is_target": "false",
        "name": "SssO",
        "number_of_missing_values": "0"
      },
      {
        "data_type": "numeric",
        "index": "2",
        "is_ignore": "false",
        "is_row_identifier": "false",
        "is_target": "false",
        "name": "Vindex",
        "number_of_missing_values": "0"
      },
      {
        "data_type": "numeric",
        "index": "3",
        "is_ignore": "false",
        "is_row_identifier": "false",
        "is_target": "false",
        "name": "Xindex",
        "number_of_missing_values": "0"
      },
      {
        "data_type": "numeric",
        "index": "4",
        "is_ignore": "false",
        "is_row_identifier": "false",
        "is_target": "false",
        "name": "Chi0_EA.dm.",
        "number_of_missing_values": "0"
      },
      {
        "data_type": "numeric",
        "index": "5",
        "is_ignore": "false",
        "is_row_identifier": "false",
        "is_target": "false",
        "name": "nArOR",
        "number_of_missing_values": "0"
      },
      {
        "data_type": "numeric",
        "index": "6",
        "is_ignore": "false",
        "is_row_identifier": "false",
        "is_target": "false",
        "name": "SpMin3_Bh.i.",
        "number_of_missing_values": "0"
      },
      {
        "data_type": "numeric",
        "index": "7",
        "is_ignore": "false",
        "is_row_identifier": "false",
        "is_target": "false",
        "name": "O.060",
        "number_of_missing_values": "0"
      },
      {
        "data_type": "numeric",
        "index": "8",
        "is_ignore": "false",
        "is_row_identifier": "false",
        "is_target": "false",
        "name": "Eig07_EA.bo.",
        "number_of_missing_values": "0"
      },
      {
        "data_type": "numeric",
        "index": "9",
        "is_ignore": "false",
        "is_row_identifier": "false",
        "is_target": "false",
        "name": "SpMin3_Bh.e.",
        "number_of_missing_values": "0"
      },
      {
        "data_type": "numeric",
        "index": "10",
        "is_ignore": "false",
        "is_row_identifier": "false",
        "is_target": "false",
        "name": "X1sol",
        "number_of_missing_values": "0"
      },
      {
        "data_type": "numeric",
        "index": "11",
        "is_ignore": "false",
        "is_row_identifier": "false",
        "is_target": "false",
        "name": "SpMax3_Bh.e.",
        "number_of_missing_values": "0"
      },
      {
        "data_type": "numeric",
        "index": "12",
        "is_ignore": "false",
        "is_row_identifier": "false",
        "is_target": "false",
        "name": "IDET",
        "number_of_missing_values": "0"
      },
      {
        "data_type": "numeric",
        "index": "13",
        "is_ignore": "false",
        "is_row_identifier": "false",
        "is_target": "false",
        "name": "SpMax3_Bh.i.",
        "number_of_missing_values": "0"
      },
      {
        "data_type": "numeric",
        "index": "14",
        "is_ignore": "false",
        "is_row_identifier": "false",
        "is_target": "false",
        "name": "P_VSA_MR_1",
        "number_of_missing_values": "0"
      },
      {
        "data_type": "numeric",
        "index": "15",
        "is_ignore": "false",
        "is_row_identifier": "false",
        "is_target": "false",
        "name": "Xu",
        "number_of_missing_values": "0"
      },
      {
        "data_type": "numeric",
        "index": "16",
        "is_ignore": "false",
        "is_row_identifier": "false",
        "is_target": "false",
        "name": "SpMax3_Bh.p.",
        "number_of_missing_values": "0"
      },
      {
        "data_type": "numeric",
        "index": "17",
        "is_ignore": "false",
        "is_row_identifier": "false",
        "is_target": "false",
        "name": "SpMax3_Bh.v.",
        "number_of_missing_values": "0"
      },
      {
        "data_type": "numeric",
        "index": "18",
        "is_ignore": "false",
        "is_row_identifier": "false",
        "is_target": "false",
        "name": "LPRS",
        "number_of_missing_values": "0"
      },
      {
        "data_type": "numeric",
        "index": "19",
        "is_ignore": "false",
        "is_row_identifier": "false",
        "is_target": "false",
        "name": "Chi0_EA.ri.",
        "number_of_missing_values": "0"
      },
      {
        "data_type": "numeric",
        "index": "20",
        "is_ignore": "false",
        "is_row_identifier": "false",
        "is_target": "false",
        "name": "MSD",
        "number_of_missing_values": "0"
      },
      {
        "data_type": "numeric",
        "index": "21",
        "is_ignore": "false",
        "is_row_identifier": "false",
        "is_target": "false",
        "name": "AECC",
        "number_of_missing_values": "0"
      },
      {
        "data_type": "numeric",
        "index": "22",
        "is_ignore": "false",
        "is_row_identifier": "false",
        "is_target": "false",
        "name": "X5",
        "number_of_missing_values": "0"
      },
      {
        "data_type": "numeric",
        "index": "23",
        "is_ignore": "false",
        "is_row_identifier": "false",
        "is_target": "false",
        "name": "X1",
        "number_of_missing_values": "0"
      },
      {
        "data_type": "numeric",
        "index": "24",
        "is_ignore": "false",
        "is_row_identifier": "false",
        "is_target": "false",
        "name": "Psi_e_0",
        "number_of_missing_values": "0"
      },
      {
        "data_type": "numeric",
        "index": "25",
        "is_ignore": "false",
        "is_row_identifier": "false",
        "is_target": "false",
        "name": "S1K",
        "number_of_missing_values": "0"
      },
      {
        "data_type": "numeric",
        "index": "26",
        "is_ignore": "false",
        "is_row_identifier": "false",
        "is_target": "false",
        "name": "Chi0_EA.bo.",
        "number_of_missing_values": "0"
      },
      {
        "data_type": "numeric",
        "index": "27",
        "is_ignore": "false",
        "is_row_identifier": "false",
        "is_target": "false",
        "name": "ON1",
        "number_of_missing_values": "0"
      },
      {
        "data_type": "numeric",
        "index": "28",
        "is_ignore": "false",
        "is_row_identifier": "false",
        "is_target": "false",
        "name": "IDMT",
        "number_of_missing_values": "0"
      },
      {
        "data_type": "numeric",
        "index": "29",
        "is_ignore": "false",
        "is_row_identifier": "false",
        "is_target": "false",
        "name": "Eig05_EA",
        "number_of_missing_values": "0"
      },
      {
        "data_type": "numeric",
        "index": "30",
        "is_ignore": "false",
        "is_row_identifier": "false",
        "is_target": "false",
        "name": "SM13_AEA.bo.",
        "number_of_missing_values": "0"
      },
      {
        "data_type": "numeric",
        "index": "31",
        "is_ignore": "false",
        "is_row_identifier": "false",
        "is_target": "false",
        "name": "IDDM",
        "number_of_missing_values": "0"
      },
      {
        "data_type": "numeric",
        "index": "32",
        "is_ignore": "false",
        "is_row_identifier": "false",
        "is_target": "false",
        "name": "NssO",
        "number_of_missing_values": "0"
      },
      {
        "data_type": "numeric",
        "index": "33",
        "is_ignore": "false",
        "is_row_identifier": "false",
        "is_target": "false",
        "name": "ATS7v",
        "number_of_missing_values": "0"
      },
      {
        "data_type": "numeric",
        "index": "34",
        "is_ignore": "false",
        "is_row_identifier": "false",
        "is_target": "false",
        "name": "SpMaxA_EA.bo.",
        "number_of_missing_values": "0"
      },
      {
        "data_type": "numeric",
        "index": "35",
        "is_ignore": "false",
        "is_row_identifier": "false",
        "is_target": "false",
        "name": "SpMaxA_AEA.ed.",
        "number_of_missing_values": "0"
      },
      {
        "data_type": "numeric",
        "index": "36",
        "is_ignore": "false",
        "is_row_identifier": "false",
        "is_target": "false",
        "name": "SAtot",
        "number_of_missing_values": "0"
      },
      {
        "data_type": "numeric",
        "index": "37",
        "is_ignore": "false",
        "is_row_identifier": "false",
        "is_target": "false",
        "name": "Chi0_AEA.bo.",
        "number_of_missing_values": "0"
      },
      {
        "data_type": "numeric",
        "index": "38",
        "is_ignore": "false",
        "is_row_identifier": "false",
        "is_target": "false",
        "name": "Chi0_AEA.dm.",
        "number_of_missing_values": "0"
      },
      {
        "data_type": "numeric",
        "index": "39",
        "is_ignore": "false",
        "is_row_identifier": "false",
        "is_target": "false",
        "name": "Chi0_AEA.ed.",
        "number_of_missing_values": "0"
      },
      {
        "data_type": "numeric",
        "index": "40",
        "is_ignore": "false",
        "is_row_identifier": "false",
        "is_target": "false",
        "name": "Chi0_AEA.ri.",
        "number_of_missing_values": "0"
      },
      {
        "data_type": "numeric",
        "index": "41",
        "is_ignore": "false",
        "is_row_identifier": "false",
        "is_target": "false",
        "name": "Chi0_EA",
        "number_of_missing_values": "0"
      },
      {
        "data_type": "numeric",
        "index": "42",
        "is_ignore": "false",
        "is_row_identifier": "false",
        "is_target": "false",
        "name": "SpMax2_Bh.i.",
        "number_of_missing_values": "0"
      },
      {
        "data_type": "numeric",
        "index": "43",
        "is_ignore": "false",
        "is_row_identifier": "false",
        "is_target": "false",
        "name": "SpMaxA_AEA.ri.",
        "number_of_missing_values": "0"
      },
      {
        "data_type": "numeric",
        "index": "44",
        "is_ignore": "false",
        "is_row_identifier": "false",
        "is_target": "false",
        "name": "IDE",
        "number_of_missing_values": "0"
      },
      {
        "data_type": "numeric",
        "index": "45",
        "is_ignore": "false",
        "is_row_identifier": "false",
        "is_target": "false",
        "name": "CENT",
        "number_of_missing_values": "0"
      },
      {
        "data_type": "numeric",
        "index": "46",
        "is_ignore": "false",
        "is_row_identifier": "false",
        "is_target": "false",
        "name": "CID",
        "number_of_missing_values": "0"
      },
      {
        "data_type": "numeric",
        "index": "47",
        "is_ignore": "false",
        "is_row_identifier": "false",
        "is_target": "false",
        "name": "Chi0_EA.ed.",
        "number_of_missing_values": "0"
      },
      {
        "data_type": "numeric",
        "index": "48",
        "is_ignore": "false",
        "is_row_identifier": "false",
        "is_target": "false",
        "name": "IVDM",
        "number_of_missing_values": "0"
      },
      {
        "data_type": "numeric",
        "index": "49",
        "is_ignore": "false",
        "is_row_identifier": "false",
        "is_target": "false",
        "name": "ICR",
        "number_of_missing_values": "0"
      },
      {
        "data_type": "numeric",
        "index": "50",
        "is_ignore": "false",
        "is_row_identifier": "false",
        "is_target": "false",
        "name": "Eta_alpha",
        "number_of_missing_values": "0"
      },
      {
        "data_type": "numeric",
        "index": "51",
        "is_ignore": "false",
        "is_row_identifier": "false",
        "is_target": "false",
        "name": "VvdwMG",
        "number_of_missing_values": "0"
      },
      {
        "data_type": "numeric",
        "index": "52",
        "is_ignore": "false",
        "is_row_identifier": "false",
        "is_target": "false",
        "name": "Vx",
        "number_of_missing_values": "0"
      },
      {
        "data_type": "numeric",
        "index": "53",
        "is_ignore": "false",
        "is_row_identifier": "false",
        "is_target": "false",
        "name": "SpMaxA_EA",
        "number_of_missing_values": "0"
      },
      {
        "data_type": "numeric",
        "index": "54",
        "is_ignore": "false",
        "is_row_identifier": "false",
        "is_target": "false",
        "name": "P_VSA_s_4",
        "number_of_missing_values": "0"
      },
      {
        "data_type": "numeric",
        "index": "55",
        "is_ignore": "false",
        "is_row_identifier": "false",
        "is_target": "false",
        "name": "XMOD",
        "number_of_missing_values": "0"
      },
      {
        "data_type": "numeric",
        "index": "56",
        "is_ignore": "false",
        "is_row_identifier": "false",
        "is_target": "false",
        "name": "X0sol",
        "number_of_missing_values": "0"
      },
      {
        "data_type": "numeric",
        "index": "57",
        "is_ignore": "false",
        "is_row_identifier": "false",
        "is_target": "false",
        "name": "ECC",
        "number_of_missing_values": "0"
      },
      {
        "data_type": "numeric",
        "index": "58",
        "is_ignore": "false",
        "is_row_identifier": "false",
        "is_target": "false",
        "name": "SpAD_AEA.bo.",
        "number_of_missing_values": "0"
      },
      {
        "data_type": "numeric",
        "index": "59",
        "is_ignore": "false",
        "is_row_identifier": "false",
        "is_target": "false",
        "name": "ATS1p",
        "number_of_missing_values": "0"
      },
      {
        "data_type": "numeric",
        "index": "60",
        "is_ignore": "false",
        "is_row_identifier": "false",
        "is_target": "false",
        "name": "Chi1_EA.ri.",
        "number_of_missing_values": "0"
      },
      {
        "data_type": "numeric",
        "index": "61",
        "is_ignore": "false",
        "is_row_identifier": "false",
        "is_target": "false",
        "name": "S2K",
        "number_of_missing_values": "0"
      },
      {
        "data_type": "numeric",
        "index": "62",
        "is_ignore": "false",
        "is_row_identifier": "false",
        "is_target": "false",
        "name": "X2",
        "number_of_missing_values": "0"
      },
      {
        "data_type": "numeric",
        "index": "63",
        "is_ignore": "false",
        "is_row_identifier": "false",
        "is_target": "false",
        "name": "Chi1_EA.ed.",
        "number_of_missing_values": "0"
      },
      {
        "data_type": "numeric",
        "index": "64",
        "is_ignore": "false",
        "is_row_identifier": "false",
        "is_target": "false",
        "name": "X0v",
        "number_of_missing_values": "0"
      },
      {
        "data_type": "numeric",
        "index": "65",
        "is_ignore": "false",
        "is_row_identifier": "false",
        "is_target": "false",
        "name": "CSI",
        "number_of_missing_values": "0"
      },
      {
        "data_type": "numeric",
        "index": "66",
        "is_ignore": "false",
        "is_row_identifier": "false",
        "is_target": "false",
        "name": "Eig05_AEA.ri.",
        "number_of_missing_values": "0"
      },
      {
        "data_type": "numeric",
        "index": "67",
        "is_ignore": "false",
        "is_row_identifier": "false",
        "is_target": "false",
        "name": "MDDD",
        "number_of_missing_values": "0"
      },
      {
        "data_type": "numeric",
        "index": "68",
        "is_ignore": "false",
        "is_row_identifier": "false",
        "is_target": "false",
        "name": "ATS8p",
        "number_of_missing_values": "0"
      },
      {
        "data_type": "numeric",
        "index": "69",
        "is_ignore": "false",
        "is_row_identifier": "false",
        "is_target": "false",
        "name": "Chi1_AEA.bo.",
        "number_of_missing_values": "0"
      },
      {
        "data_type": "numeric",
        "index": "70",
        "is_ignore": "false",
        "is_row_identifier": "false",
        "is_target": "true",
        "name": "pXC50",
        "number_of_missing_values": "0"
      }
    ]
  }
}