{
  "data_set_description": {
    "collection_date": "November 2013",
    "creator": "Dr Jeremy Besnard, Dr Ivan Olier, Dr Noureddin Sadawi, Dr Larisa Soldatova, Dr Crina Grosan, Prof Ross King, Dr Richard Bickerton, Prof Andrew Hopkins and Dr Willem van Hoorn",
    "default_target_attribute": "pXC50",
    "description": "This dataset contains QSAR data (from ChEMBL version 17) showing activity values (unit is pseudo-pCI50) of several compounds on drug target ChEMBL_ID: CHEMBL1938227 (TID: 104438), and it has 22 rows and 1145 features (not including molecule IDs and class feature: molecule_id and pXC50). The features represent Molecular Descriptors which were generated from SMILES strings. Missing value imputation was applied to this dataset (By choosing the Median).",
    "description_version": "1",
    "file_id": "3532108",
    "format": "ARFF",
    "id": "34542",
    "licence": "Public",
    "md5_checksum": "6946e11ef2dc7bc56e38851c6085c50e",
    "minio_url": "https://data.openml.org/datasets/0003/34542/dataset_34542.pq",
    "name": "QSAR-DATASET-FOR-DRUG-TARGET-CHEMBL1938227",
    "original_data_url": "https://www.ebi.ac.uk/chembl/target/inspect/CHEMBL1938227",
    "parquet_url": "https://data.openml.org/datasets/0003/34542/dataset_34542.pq",
    "processing_date": "2018-10-04 03:56:48",
    "row_id_attribute": "molecule_id",
    "status": "deactivated",
    "tag": [
      "MetaQSAR",
      "study_13"
    ],
    "upload_date": "2016-07-15T15:38:47",
    "url": "https://api.openml.org/data/v1/download/3532108/QSAR-DATASET-FOR-DRUG-TARGET-CHEMBL1938227.arff",
    "version": "11",
    "visibility": "public"
  }
}