"molecule_id","FCFP4_1024b604","FCFP4_1024b638","FCFP4_1024b204","FCFP4_1024b434","FCFP4_1024b855","FCFP4_1024b643","FCFP4_1024b536","FCFP4_1024b270","FCFP4_1024b437","FCFP4_1024b86","FCFP4_1024b635","FCFP4_1024b143","FCFP4_1024b595","FCFP4_1024b385","FCFP4_1024b614","FCFP4_1024b364","FCFP4_1024b63","FCFP4_1024b128","FCFP4_1024b764","FCFP4_1024b199","FCFP4_1024b580","FCFP4_1024b453","FCFP4_1024b455","FCFP4_1024b133","FCFP4_1024b860","FCFP4_1024b898","FCFP4_1024b327","FCFP4_1024b876","FCFP4_1024b714","FCFP4_1024b316","FCFP4_1024b537","FCFP4_1024b54","FCFP4_1024b10","FCFP4_1024b767","FCFP4_1024b903","FCFP4_1024b603","FCFP4_1024b976","FCFP4_1024b45","FCFP4_1024b504","FCFP4_1024b152","FCFP4_1024b215","FCFP4_1024b600","FCFP4_1024b793","FCFP4_1024b606","FCFP4_1024b844","FCFP4_1024b875","FCFP4_1024b348","FCFP4_1024b969","FCFP4_1024b446","FCFP4_1024b822","FCFP4_1024b879","FCFP4_1024b57","FCFP4_1024b971","FCFP4_1024b20","FCFP4_1024b343","FCFP4_1024b263","FCFP4_1024b492","FCFP4_1024b680","FCFP4_1024b13","FCFP4_1024b265","FCFP4_1024b644","FCFP4_1024b235","FCFP4_1024b388","FCFP4_1024b399","FCFP4_1024b521","FCFP4_1024b395","FCFP4_1024b985","FCFP4_1024b709","FCFP4_1024b983","FCFP4_1024b1000","FCFP4_1024b981","FCFP4_1024b148","FCFP4_1024b324","FCFP4_1024b372","FCFP4_1024b612","FCFP4_1024b319","FCFP4_1024b553","FCFP4_1024b139","FCFP4_1024b357","FCFP4_1024b283","FCFP4_1024b1015","FCFP4_1024b429","FCFP4_1024b4","FCFP4_1024b107","FCFP4_1024b37","FCFP4_1024b376","FCFP4_1024b616","FCFP4_1024b461","FCFP4_1024b160","FCFP4_1024b710","FCFP4_1024b33","FCFP4_1024b963","FCFP4_1024b925","FCFP4_1024b942","FCFP4_1024b669","FCFP4_1024b390","FCFP4_1024b818","FCFP4_1024b490","FCFP4_1024b79","FCFP4_1024b115","FCFP4_1024b528","FCFP4_1024b464","pXC50"
{20 1,46 1,52 1,53 1,54 1,65 1,66 1,76 1,77 1,78 1,91 1,93 1,103 4.301}
{0 CHEMBL100102,20 1,21 1,32 1,36 1,40 1,51 1,54 1,57 1,69 1,75 1,83 1,88 1,93 1,94 1,103 4.301}
{0 CHEMBL101253,1 1,5 1,11 1,22 1,32 1,44 1,46 1,52 1,53 1,65 1,69 1,76 1,78 1,83 1,88 1,91 1,94 1,103 5}
{0 CHEMBL101683,17 1,22 1,32 1,46 1,52 1,53 1,58 1,65 1,76 1,78 1,80 1,83 1,84 1,88 1,91 1,93 1,103 5}
{0 CHEMBL102301,14 1,18 1,19 1,28 1,30 1,36 1,61 1,65 1,69 1,82 1,83 1,86 1,90 1,93 1,94 1,95 1,103 4.523}
{0 CHEMBL102346,14 1,18 1,19 1,22 1,28 1,30 1,32 1,61 1,65 1,69 1,80 1,82 1,83 1,84 1,86 1,88 1,90 1,93 1,94 1,95 1,103 4.523}
{0 CHEMBL102888,34 1,36 1,38 1,39 1,42 1,45 1,50 1,57 1,58 1,59 1,69 1,82 1,83 1,88 1,93 1,94 1,103 5.699}
{0 CHEMBL102953,41 1,44 1,66 1,73 1,88 1,91 1,93 1,103 4}
{0 CHEMBL103009,18 1,41 1,44 1,66 1,73 1,82 1,86 1,91 1,93 1,94 1,103 4}
{0 CHEMBL103054,2 1,18 1,20 1,32 1,34 1,36 1,38 1,39 1,42 1,50 1,54 1,55 1,57 1,58 1,59 1,69 1,75 1,82 1,83 1,88 1,93 1,94 1,103 5.699}
{0 CHEMBL103055,15 1,33 1,36 1,39 1,40 1,46 1,51 1,53 1,61 1,62 1,69 1,83 1,85 1,88 1,93 1,94 1,95 1,103 4.839}
{0 CHEMBL103334,2 1,18 1,20 1,32 1,34 1,36 1,38 1,39 1,42 1,50 1,54 1,55 1,57 1,58 1,59 1,69 1,75 1,82 1,83 1,86 1,88 1,93 1,94 1,103 5.699}
{0 CHEMBL103667,5 1,19 1,22 1,32 1,33 1,41 1,61 1,67 1,69 1,82 1,83 1,84 1,85 1,86 1,88 1,90 1,93 1,94 1,95 1,97 1,103 4.699}
{0 CHEMBL103674,15 1,20 1,32 1,36 1,39 1,40 1,44 1,46 1,51 1,52 1,53 1,54 1,60 1,69 1,75 1,76 1,78 1,82 1,83 1,88 1,91 1,93 1,94 1,103 4.699}
{0 CHEMBL104067,14 1,18 1,19 1,22 1,28 1,30 1,32 1,61 1,65 1,69 1,80 1,82 1,83 1,84 1,86 1,90 1,93 1,94 1,95 1,103 4.523}
{0 CHEMBL104264,8 1,36 1,46 1,52 1,53 1,65 1,69 1,71 1,76 1,78 1,79 1,83 1,88 1,91 1,93 1,94 1,96 1,97 1,103 5.921}
{0 CHEMBL104408,34 1,36 1,38 1,39 1,42 1,45 1,50 1,57 1,58 1,59 1,69 1,83 1,88 1,93 1,94 1,103 5.699}
{0 CHEMBL104941,2 1,18 1,20 1,32 1,34 1,36 1,38 1,39 1,42 1,50 1,52 1,54 1,55 1,57 1,58 1,59 1,69 1,75 1,76 1,78 1,82 1,83 1,88 1,91 1,93 1,94 1,103 5.699}
{0 CHEMBL106112,2 1,18 1,20 1,32 1,34 1,36 1,38 1,39 1,42 1,50 1,52 1,54 1,55 1,57 1,58 1,59 1,69 1,75 1,76 1,78 1,82 1,83 1,88 1,91 1,93 1,94 1,103 5.699}
{0 CHEMBL106439,2 1,18 1,20 1,32 1,34 1,36 1,38 1,39 1,42 1,50 1,54 1,55 1,57 1,58 1,59 1,69 1,75 1,83 1,88 1,93 1,94 1,103 5.699}
{0 CHEMBL106966,14 1,18 1,19 1,22 1,28 1,30 1,32 1,33 1,61 1,65 1,69 1,80 1,82 1,83 1,84 1,86 1,90 1,93 1,94 1,95 1,103 4.523}
{0 CHEMBL115531,5 1,40 1,66 1,77 1,83 1,84 1,88 1,93 1,95 1,103 4}
{0 CHEMBL1161622,5 1,12 1,19 1,20 1,28 1,29 1,30 1,36 1,39 1,40 1,57 1,62 1,65 1,82 1,83 1,93 1,95 1,103 5.42}
{0 CHEMBL116963,5 1,40 1,66 1,77 1,83 1,84 1,88 1,93 1,95 1,103 4}
{0 CHEMBL117443,5 1,40 1,77 1,83 1,84 1,88 1,93 1,95 1,103 4}
{0 CHEMBL120077,7 1,11 1,18 1,22 1,32 1,35 1,44 1,52 1,54 1,70 1,76 1,77 1,78 1,82 1,83 1,86 1,87 1,88 1,91 1,94 1,103 4}
{0 CHEMBL1202927,15 1,18 1,33 1,36 1,39 1,40 1,43 1,46 1,49 1,51 1,53 1,61 1,62 1,69 1,82 1,83 1,85 1,88 1,89 1,93 1,94 1,103 5.229}
{0 CHEMBL1233654,8 1,33 1,36 1,46 1,53 1,54 1,61 1,65 1,69 1,71 1,83 1,85 1,88 1,93 1,94 1,96 1,97 1,103 5.523}
{0 CHEMBL123777,15 1,20 1,32 1,36 1,39 1,40 1,46 1,51 1,53 1,54 1,60 1,62 1,69 1,75 1,79 1,83 1,88 1,93 1,94 1,103 5.453}
{0 CHEMBL124072,2 1,18 1,20 1,32 1,33 1,34 1,36 1,38 1,39 1,42 1,50 1,54 1,55 1,58 1,59 1,61 1,62 1,69 1,75 1,83 1,85 1,88 1,93 1,94 1,103 5.658}
{0 CHEMBL124620,15 1,20 1,32 1,36 1,39 1,40 1,43 1,46 1,49 1,51 1,52 1,53 1,54 1,60 1,62 1,69 1,75 1,76 1,78 1,83 1,88 1,91 1,93 1,94 1,103 4.79}
{0 CHEMBL126087,2 1,18 1,20 1,32 1,34 1,36 1,38 1,39 1,42 1,50 1,54 1,55 1,57 1,58 1,59 1,62 1,69 1,75 1,83 1,88 1,93 1,94 1,103 5.699}
{0 CHEMBL126922,15 1,20 1,32 1,36 1,39 1,40 1,46 1,51 1,53 1,54 1,57 1,60 1,62 1,69 1,75 1,83 1,88 1,93 1,94 1,103 4.834}
{0 CHEMBL127277,2 1,18 1,20 1,32 1,34 1,36 1,42 1,54 1,55 1,57 1,58 1,69 1,75 1,83 1,88 1,93 1,94 1,103 4.469}
{0 CHEMBL127852,2 1,18 1,20 1,32 1,34 1,36 1,38 1,42 1,54 1,55 1,58 1,69 1,75 1,82 1,83 1,86 1,93 1,94 1,103 5.699}
{0 CHEMBL127929,40 1,53 1,65 1,82 1,83 1,84 1,87 1,93 1,95 1,103 4.301}
{0 CHEMBL129946,33 1,34 1,36 1,39 1,42 1,50 1,54 1,58 1,59 1,61 1,62 1,69 1,79 1,83 1,85 1,88 1,93 1,94 1,98 1,99 1,100 1,101 1,103 5.796}
{0 CHEMBL130049,34 1,36 1,39 1,42 1,50 1,53 1,58 1,59 1,62 1,69 1,79 1,83 1,88 1,93 1,94 1,98 1,99 1,100 1,101 1,103 6.319}
{0 CHEMBL130163,34 1,36 1,39 1,42 1,50 1,58 1,59 1,62 1,69 1,79 1,83 1,88 1,93 1,94 1,98 1,99 1,100 1,101 1,103 5.824}
{0 CHEMBL130181,29 1,34 1,36 1,39 1,42 1,50 1,57 1,58 1,59 1,62 1,64 1,69 1,83 1,88 1,93 1,94 1,98 1,99 1,100 1,101 1,103 5.481}
{0 CHEMBL130208,34 1,36 1,39 1,42 1,50 1,58 1,59 1,62 1,69 1,79 1,83 1,88 1,93 1,94 1,98 1,99 1,100 1,101 1,103 5.602}
{0 CHEMBL131020,33 1,34 1,36 1,39 1,42 1,50 1,54 1,58 1,59 1,61 1,62 1,69 1,79 1,83 1,88 1,93 1,94 1,98 1,99 1,100 1,101 1,103 6}
{0 CHEMBL131193,6 1,9 1,33 1,34 1,36 1,39 1,42 1,50 1,54 1,58 1,59 1,61 1,62 1,69 1,79 1,83 1,88 1,93 1,94 1,98 1,99 1,100 1,101 1,103 6.319}
{0 CHEMBL131426,33 1,34 1,36 1,39 1,42 1,50 1,54 1,58 1,59 1,61 1,62 1,69 1,79 1,83 1,85 1,88 1,93 1,94 1,98 1,99 1,100 1,101 1,103 5.854}
{0 CHEMBL131456,39 1,50 1,59 1,62 1,69 1,88 1,93 1,94 1,95 1,98 1,99 1,100 1,101 1,103 4}
{0 CHEMBL131590,34 1,36 1,39 1,42 1,50 1,52 1,58 1,59 1,62 1,69 1,76 1,78 1,79 1,83 1,88 1,91 1,93 1,94 1,98 1,99 1,100 1,101 1,103 5.824}
{0 CHEMBL131715,34 1,36 1,39 1,42 1,50 1,52 1,58 1,59 1,62 1,69 1,76 1,78 1,79 1,83 1,88 1,91 1,93 1,94 1,98 1,99 1,100 1,101 1,103 5.585}
{0 CHEMBL132169,18 1,34 1,36 1,39 1,42 1,50 1,58 1,59 1,62 1,69 1,79 1,82 1,83 1,86 1,88 1,93 1,94 1,98 1,99 1,100 1,101 1,103 5.824}
{0 CHEMBL132170,34 1,36 1,39 1,42 1,50 1,58 1,59 1,62 1,69 1,76 1,79 1,83 1,88 1,93 1,94 1,98 1,99 1,100 1,101 1,103 4}
{0 CHEMBL132348,33 1,34 1,36 1,39 1,42 1,50 1,54 1,58 1,59 1,61 1,62 1,69 1,79 1,83 1,85 1,88 1,93 1,94 1,98 1,99 1,100 1,101 1,103 6.854}
{0 CHEMBL139517,2 1,18 1,20 1,32 1,34 1,36 1,38 1,42 1,52 1,54 1,55 1,58 1,69 1,76 1,78 1,83 1,88 1,91 1,93 1,94 1,103 4}
{0 CHEMBL140045,41 1,44 1,53 1,65 1,66 1,76 1,91 1,93 1,103 4}
{0 CHEMBL140061,41 1,44 1,52 1,66 1,73 1,76 1,78 1,91 1,93 1,103 4}
{0 CHEMBL141190,41 1,44 1,53 1,65 1,66 1,73 1,91 1,93 1,103 4}
{0 CHEMBL141247,5 1,22 1,32 1,53 1,65 1,83 1,84 1,88 1,93 1,95 1,98 1,103 4.699}
{0 CHEMBL142425,5 1,20 1,29 1,31 1,32 1,52 1,53 1,54 1,57 1,65 1,76 1,77 1,78 1,83 1,84 1,91 1,103 5}
{0 CHEMBL142711,41 1,44 1,52 1,65 1,66 1,76 1,91 1,93 1,103 4}
{0 CHEMBL142764,41 1,44 1,53 1,65 1,66 1,76 1,91 1,93 1,103 4}
{0 CHEMBL142824,41 1,44 1,66 1,73 1,91 1,93 1,103 4}
{0 CHEMBL142826,41 1,44 1,52 1,66 1,73 1,76 1,78 1,91 1,93 1,103 4}
{0 CHEMBL143090,41 1,44 1,52 1,66 1,73 1,76 1,78 1,91 1,93 1,103 4}
{0 CHEMBL143273,41 1,44 1,52 1,65 1,66 1,73 1,76 1,91 1,93 1,103 4}
{0 CHEMBL143419,41 1,44 1,53 1,65 1,66 1,73 1,91 1,93 1,103 4}
{0 CHEMBL146847,17 1,21 1,23 1,29 1,36 1,46 1,79 1,83 1,88 1,93 1,94 1,95 1,98 1,103 6.032}
{0 CHEMBL149313,21 1,46 1,71 1,88 1,93 1,94 1,95 1,98 1,103 5.886}
{0 CHEMBL151546,7 1,22 1,32 1,53 1,54 1,57 1,59 1,62 1,65 1,70 1,76 1,77 1,83 1,84 1,86 1,87 1,88 1,91 1,93 1,103 4.237}
{0 CHEMBL162,29 1,34 1,36 1,39 1,42 1,50 1,58 1,59 1,62 1,64 1,69 1,79 1,83 1,88 1,93 1,94 1,98 1,99 1,100 1,101 1,103 7.759}
{0 CHEMBL16958,2 1,18 1,20 1,32 1,34 1,36 1,42 1,54 1,55 1,58 1,69 1,75 1,79 1,83 1,88 1,93 1,94 1,103 4.59}
{0 CHEMBL173379,5 1,12 1,28 1,29 1,30 1,38 1,39 1,57 1,65 1,83 1,89 1,93 1,95 1,98 1,103 5}
{0 CHEMBL173384,5 1,12 1,28 1,29 1,30 1,38 1,39 1,52 1,57 1,65 1,76 1,78 1,83 1,86 1,89 1,91 1,93 1,95 1,98 1,103 6.824}
{0 CHEMBL177308,36 1,42 1,58 1,83 1,88 1,93 1,98 1,103 4.301}
{0 CHEMBL177635,29 1,36 1,42 1,58 1,71 1,79 1,83 1,88 1,93 1,95 1,98 1,102 1,103 7.155}
{0 CHEMBL177688,1 1,5 1,11 1,22 1,32 1,46 1,52 1,53 1,57 1,62 1,65 1,76 1,77 1,78 1,83 1,84 1,88 1,91 1,93 1,103 5}
{0 CHEMBL193697,29 1,36 1,42 1,58 1,71 1,83 1,88 1,93 1,95 1,98 1,102 1,103 8.409}
{0 CHEMBL197603,5 1,12 1,18 1,22 1,28 1,30 1,32 1,33 1,35 1,39 1,43 1,49 1,54 1,56 1,58 1,61 1,62 1,65 1,69 1,71 1,77 1,82 1,83 1,84 1,85 1,86 1,88 1,93 1,94 1,95 1,103 4.602}
{0 CHEMBL201307,3 1,4 1,5 1,11 1,12 1,14 1,18 1,19 1,22 1,28 1,30 1,32 1,33 1,40 1,44 1,52 1,53 1,57 1,61 1,65 1,67 1,69 1,76 1,78 1,80 1,82 1,83 1,84 1,85 1,86 1,88 1,91 1,93 1,94 1,95 1,103 4}
{0 CHEMBL20252,11 1,22 1,24 1,32 1,46 1,53 1,58 1,62 1,65 1,69 1,77 1,80 1,83 1,84 1,88 1,93 1,94 1,103 4}
{0 CHEMBL204420,1 1,3 1,4 1,5 1,6 1,7 1,9 1,10 1,11 1,12 1,14 1,15 1,17 1,18 1,19 1,22 1,24 1,27 1,28 1,30 1,32 1,33 1,37 1,40 1,52 1,54 1,56 1,57 1,61 1,65 1,69 1,76 1,78 1,82 1,83 1,85 1,86 1,88 1,91 1,93 1,94 1,103 5}
{0 CHEMBL206783,1 1,3 1,4 1,5 1,6 1,7 1,9 1,10 1,11 1,12 1,14 1,15 1,17 1,18 1,19 1,22 1,24 1,27 1,28 1,30 1,32 1,33 1,37 1,40 1,52 1,54 1,56 1,57 1,61 1,65 1,69 1,76 1,78 1,82 1,83 1,85 1,86 1,88 1,91 1,93 1,94 1,103 5}
{0 CHEMBL206955,1 1,3 1,4 1,5 1,6 1,9 1,10 1,11 1,12 1,14 1,15 1,18 1,19 1,22 1,24 1,27 1,28 1,30 1,32 1,33 1,37 1,40 1,52 1,54 1,56 1,57 1,61 1,65 1,69 1,76 1,78 1,82 1,83 1,85 1,86 1,91 1,93 1,94 1,103 5}
{0 CHEMBL207037,1 1,3 1,4 1,5 1,6 1,7 1,9 1,10 1,11 1,12 1,14 1,15 1,17 1,18 1,19 1,22 1,24 1,27 1,28 1,30 1,32 1,33 1,40 1,52 1,57 1,61 1,65 1,69 1,76 1,78 1,82 1,83 1,85 1,86 1,88 1,91 1,93 1,94 1,103 5}
{0 CHEMBL207130,1 1,3 1,4 1,5 1,6 1,7 1,9 1,10 1,11 1,12 1,14 1,15 1,17 1,18 1,19 1,22 1,24 1,27 1,28 1,30 1,32 1,33 1,40 1,52 1,57 1,61 1,65 1,69 1,76 1,78 1,82 1,83 1,85 1,86 1,88 1,91 1,93 1,94 1,103 5}
{0 CHEMBL207235,1 1,3 1,4 1,5 1,6 1,7 1,9 1,10 1,11 1,12 1,14 1,15 1,17 1,18 1,19 1,22 1,24 1,27 1,28 1,30 1,32 1,33 1,37 1,40 1,52 1,54 1,56 1,57 1,61 1,65 1,69 1,76 1,78 1,82 1,83 1,85 1,86 1,88 1,91 1,93 1,94 1,103 5}
{0 CHEMBL207246,1 1,3 1,4 1,5 1,6 1,7 1,9 1,10 1,11 1,12 1,14 1,15 1,17 1,18 1,19 1,22 1,24 1,27 1,28 1,30 1,32 1,33 1,37 1,40 1,52 1,54 1,56 1,57 1,61 1,65 1,69 1,76 1,78 1,82 1,83 1,85 1,86 1,88 1,91 1,93 1,94 1,103 5}
{0 CHEMBL207445,1 1,3 1,4 1,5 1,6 1,7 1,9 1,10 1,11 1,12 1,14 1,15 1,17 1,18 1,19 1,22 1,24 1,27 1,28 1,30 1,32 1,33 1,37 1,40 1,52 1,54 1,57 1,61 1,65 1,69 1,71 1,76 1,78 1,82 1,83 1,86 1,88 1,91 1,93 1,94 1,95 1,103 5}
{0 CHEMBL207544,8 1,20 1,23 1,25 1,26 1,29 1,31 1,32 1,35 1,46 1,51 1,53 1,54 1,57 1,60 1,65 1,67 1,69 1,74 1,75 1,77 1,82 1,83 1,86 1,88 1,94 1,95 1,96 1,97 1,103 9}
{0 CHEMBL207584,1 1,3 1,4 1,5 1,6 1,7 1,9 1,10 1,11 1,12 1,14 1,15 1,17 1,18 1,19 1,22 1,24 1,27 1,28 1,30 1,32 1,33 1,37 1,40 1,52 1,54 1,56 1,57 1,61 1,65 1,69 1,76 1,78 1,82 1,83 1,85 1,86 1,88 1,91 1,93 1,94 1,103 5}
{0 CHEMBL207674,1 1,3 1,4 1,5 1,6 1,7 1,9 1,10 1,11 1,12 1,14 1,15 1,17 1,18 1,19 1,22 1,24 1,27 1,28 1,30 1,32 1,33 1,37 1,40 1,52 1,54 1,56 1,57 1,61 1,65 1,69 1,76 1,78 1,82 1,83 1,85 1,86 1,88 1,91 1,93 1,94 1,95 1,103 5}
{0 CHEMBL207687,1 1,3 1,4 1,5 1,6 1,7 1,9 1,10 1,11 1,12 1,14 1,15 1,17 1,18 1,19 1,22 1,24 1,27 1,28 1,30 1,32 1,33 1,37 1,40 1,52 1,54 1,57 1,61 1,65 1,69 1,76 1,78 1,82 1,83 1,86 1,88 1,91 1,93 1,94 1,103 5}
{0 CHEMBL207718,1 1,3 1,4 1,5 1,6 1,7 1,9 1,10 1,11 1,12 1,14 1,15 1,17 1,18 1,19 1,22 1,24 1,27 1,28 1,30 1,32 1,33 1,40 1,52 1,57 1,61 1,65 1,69 1,76 1,78 1,82 1,83 1,85 1,86 1,88 1,91 1,93 1,94 1,103 5}
{0 CHEMBL207815,1 1,3 1,4 1,5 1,6 1,7 1,9 1,10 1,11 1,12 1,14 1,15 1,17 1,18 1,19 1,22 1,24 1,27 1,28 1,30 1,32 1,33 1,40 1,52 1,57 1,61 1,65 1,69 1,76 1,78 1,82 1,83 1,85 1,86 1,88 1,91 1,93 1,94 1,95 1,103 5}
{0 CHEMBL208048,1 1,3 1,4 1,5 1,6 1,7 1,9 1,10 1,11 1,12 1,14 1,15 1,17 1,18 1,19 1,22 1,24 1,27 1,28 1,30 1,32 1,33 1,37 1,40 1,52 1,54 1,57 1,61 1,65 1,69 1,76 1,78 1,82 1,83 1,86 1,88 1,91 1,93 1,94 1,103 5}
{0 CHEMBL208118,1 1,3 1,4 1,5 1,6 1,7 1,9 1,10 1,11 1,12 1,14 1,15 1,17 1,18 1,19 1,22 1,24 1,27 1,28 1,30 1,32 1,33 1,37 1,40 1,52 1,54 1,57 1,61 1,65 1,69 1,76 1,78 1,82 1,83 1,86 1,88 1,91 1,93 1,94 1,103 5}
{0 CHEMBL208286,1 1,3 1,4 1,5 1,6 1,7 1,9 1,10 1,11 1,12 1,14 1,15 1,17 1,18 1,19 1,22 1,24 1,27 1,28 1,30 1,32 1,33 1,37 1,40 1,52 1,54 1,57 1,61 1,65 1,69 1,76 1,78 1,82 1,83 1,86 1,88 1,91 1,93 1,94 1,103 5}
{0 CHEMBL208292,1 1,3 1,4 1,5 1,6 1,7 1,9 1,10 1,11 1,12 1,14 1,15 1,17 1,18 1,19 1,22 1,24 1,27 1,28 1,30 1,32 1,33 1,37 1,40 1,52 1,54 1,56 1,57 1,61 1,65 1,69 1,76 1,78 1,82 1,83 1,85 1,86 1,88 1,91 1,93 1,94 1,103 5}
{0 CHEMBL208637,5 1,7 1,32 1,33 1,40 1,65 1,82 1,83 1,84 1,93 1,95 1,103 5.125}
{0 CHEMBL20867,11 1,22 1,32 1,46 1,53 1,58 1,62 1,65 1,77 1,80 1,83 1,84 1,93 1,103 4}
{0 CHEMBL209148,15 1,18 1,29 1,36 1,53 1,58 1,65 1,82 1,83 1,84 1,86 1,87 1,93 1,94 1,95 1,98 1,103 4.301}
{0 CHEMBL210032,5 1,7 1,32 1,33 1,40 1,65 1,77 1,83 1,84 1,88 1,93 1,103 5.125}
{0 CHEMBL210246,20 1,23 1,25 1,26 1,29 1,31 1,32 1,35 1,46 1,51 1,53 1,54 1,57 1,60 1,62 1,65 1,67 1,69 1,72 1,74 1,75 1,76 1,77 1,82 1,83 1,86 1,88 1,91 1,94 1,95 1,96 1,97 1,103 7.319}
{0 CHEMBL210390,5 1,20 1,23 1,25 1,26 1,29 1,31 1,32 1,35 1,46 1,51 1,53 1,54 1,57 1,60 1,62 1,65 1,67 1,69 1,72 1,74 1,75 1,77 1,82 1,83 1,86 1,88 1,94 1,95 1,96 1,97 1,103 8.097}
{0 CHEMBL210618,5 1,7 1,15 1,18 1,32 1,33 1,40 1,65 1,82 1,83 1,84 1,86 1,93 1,94 1,95 1,103 5.125}
{0 CHEMBL210928,5 1,15 1,18 1,32 1,40 1,52 1,65 1,76 1,82 1,83 1,84 1,86 1,91 1,93 1,94 1,95 1,103 5.125}
{0 CHEMBL210963,5 1,7 1,15 1,18 1,32 1,33 1,40 1,65 1,82 1,83 1,84 1,86 1,93 1,94 1,95 1,103 5.125}
{0 CHEMBL211003,1 1,3 1,4 1,5 1,6 1,7 1,9 1,10 1,11 1,12 1,14 1,15 1,17 1,18 1,19 1,22 1,24 1,27 1,28 1,30 1,32 1,33 1,36 1,40 1,52 1,54 1,57 1,61 1,65 1,69 1,76 1,78 1,82 1,83 1,86 1,88 1,91 1,93 1,94 1,103 5}
{0 CHEMBL21162,11 1,22 1,32 1,46 1,52 1,53 1,58 1,62 1,65 1,76 1,77 1,78 1,80 1,83 1,84 1,91 1,93 1,103 4}
{0 CHEMBL213618,23 1,29 1,36 1,49 1,52 1,53 1,57 1,58 1,65 1,76 1,78 1,83 1,84 1,87 1,91 1,93 1,102 1,103 10}
{0 CHEMBL215152,3 1,4 1,5 1,11 1,12 1,14 1,19 1,22 1,28 1,30 1,32 1,33 1,40 1,52 1,54 1,57 1,61 1,65 1,67 1,69 1,70 1,76 1,78 1,80 1,82 1,83 1,84 1,85 1,86 1,87 1,88 1,91 1,93 1,94 1,95 1,103 5}
{0 CHEMBL215803,20 1,33 1,39 1,54 1,61 1,65 1,69 1,77 1,82 1,85 1,86 1,88 1,94 1,97 1,103 6}
{0 CHEMBL217090,1 1,4 1,5 1,11 1,12 1,14 1,19 1,28 1,30 1,32 1,33 1,52 1,61 1,65 1,67 1,69 1,71 1,76 1,78 1,82 1,83 1,85 1,86 1,91 1,93 1,95 1,103 5}
{0 CHEMBL217092,1 1,4 1,5 1,11 1,12 1,14 1,19 1,28 1,30 1,32 1,33 1,52 1,61 1,65 1,67 1,69 1,71 1,76 1,78 1,82 1,83 1,85 1,86 1,91 1,93 1,95 1,103 5}
{0 CHEMBL223367,5 1,32 1,33 1,52 1,53 1,56 1,57 1,65 1,67 1,76 1,82 1,83 1,84 1,86 1,91 1,93 1,95 1,103 5}
{0 CHEMBL223460,5 1,32 1,33 1,52 1,53 1,56 1,65 1,67 1,76 1,82 1,83 1,84 1,86 1,91 1,93 1,95 1,103 5}
{0 CHEMBL225088,6 1,11 1,32 1,33 1,58 1,61 1,65 1,83 1,85 1,93 1,94 1,95 1,103 5}
{0 CHEMBL225789,20 1,23 1,25 1,26 1,29 1,31 1,32 1,35 1,40 1,46 1,51 1,53 1,54 1,57 1,60 1,62 1,63 1,65 1,67 1,69 1,70 1,72 1,74 1,75 1,76 1,77 1,82 1,83 1,86 1,87 1,88 1,91 1,94 1,95 1,103 7.237}
{0 CHEMBL226148,20 1,23 1,25 1,26 1,29 1,31 1,32 1,35 1,46 1,51 1,53 1,54 1,57 1,60 1,62 1,65 1,67 1,69 1,70 1,72 1,74 1,75 1,76 1,77 1,82 1,83 1,86 1,87 1,88 1,91 1,94 1,95 1,103 8.167}
{0 CHEMBL226330,20 1,22 1,23 1,25 1,26 1,29 1,31 1,32 1,35 1,46 1,51 1,53 1,54 1,57 1,60 1,62 1,63 1,65 1,67 1,69 1,70 1,75 1,77 1,81 1,82 1,83 1,86 1,87 1,88 1,89 1,92 1,94 1,95 1,103 6.959}
{0 CHEMBL226332,23 1,25 1,26 1,29 1,31 1,35 1,40 1,46 1,51 1,53 1,54 1,57 1,60 1,62 1,63 1,65 1,67 1,69 1,70 1,76 1,77 1,81 1,82 1,83 1,86 1,87 1,88 1,89 1,91 1,92 1,95 1,103 7.337}
{0 CHEMBL226382,23 1,25 1,26 1,29 1,31 1,35 1,46 1,51 1,53 1,54 1,57 1,60 1,62 1,63 1,65 1,67 1,69 1,70 1,77 1,81 1,82 1,83 1,86 1,87 1,88 1,89 1,92 1,95 1,103 7.495}
{0 CHEMBL226383,23 1,25 1,26 1,29 1,31 1,35 1,46 1,51 1,53 1,54 1,57 1,59 1,60 1,62 1,63 1,65 1,67 1,69 1,70 1,77 1,81 1,82 1,83 1,86 1,87 1,88 1,89 1,91 1,92 1,95 1,103 6.431}
{0 CHEMBL226625,23 1,25 1,26 1,29 1,31 1,35 1,46 1,51 1,53 1,54 1,57 1,62 1,63 1,65 1,67 1,69 1,70 1,72 1,74 1,77 1,82 1,83 1,86 1,87 1,88 1,91 1,95 1,103 8.301}
{0 CHEMBL226850,22 1,23 1,25 1,26 1,29 1,31 1,35 1,46 1,51 1,53 1,54 1,57 1,60 1,62 1,63 1,65 1,67 1,69 1,70 1,77 1,81 1,82 1,83 1,86 1,87 1,88 1,89 1,91 1,92 1,95 1,103 7.108}
{0 CHEMBL226898,23 1,25 1,26 1,29 1,31 1,35 1,46 1,51 1,53 1,54 1,57 1,60 1,62 1,63 1,65 1,67 1,69 1,70 1,77 1,81 1,82 1,83 1,86 1,87 1,88 1,89 1,91 1,92 1,95 1,103 7.886}
{0 CHEMBL227381,8 1,36 1,46 1,52 1,53 1,65 1,69 1,71 1,76 1,78 1,79 1,83 1,88 1,91 1,93 1,94 1,95 1,96 1,97 1,103 6.77}
{0 CHEMBL227605,18 1,20 1,28 1,30 1,32 1,51 1,54 1,57 1,65 1,77 1,82 1,83 1,88 1,103 6.215}
{0 CHEMBL228042,18 1,20 1,28 1,30 1,32 1,36 1,51 1,52 1,54 1,65 1,76 1,77 1,78 1,82 1,83 1,91 1,103 7.824}
{0 CHEMBL228133,18 1,20 1,28 1,30 1,32 1,36 1,51 1,52 1,54 1,65 1,71 1,76 1,77 1,78 1,82 1,83 1,91 1,103 7.481}
{0 CHEMBL230232,11 1,17 1,22 1,27 1,32 1,33 1,52 1,53 1,54 1,60 1,65 1,69 1,70 1,76 1,78 1,80 1,83 1,84 1,88 1,91 1,103 4}
{0 CHEMBL230654,11 1,17 1,20 1,22 1,27 1,32 1,33 1,52 1,53 1,54 1,65 1,69 1,76 1,78 1,80 1,83 1,84 1,88 1,91 1,103 4.119}
{0 CHEMBL230761,11 1,17 1,22 1,27 1,28 1,32 1,33 1,39 1,49 1,52 1,53 1,65 1,69 1,76 1,78 1,80 1,83 1,84 1,88 1,91 1,103 4}
{0 CHEMBL23254,1 1,5 1,11 1,19 1,22 1,28 1,29 1,32 1,39 1,52 1,57 1,65 1,76 1,82 1,83 1,84 1,87 1,91 1,93 1,103 5.42}
{0 CHEMBL23327,1 1,5 1,11 1,19 1,22 1,28 1,29 1,32 1,39 1,52 1,57 1,65 1,76 1,78 1,82 1,83 1,84 1,87 1,88 1,91 1,103 5.046}
{0 CHEMBL242753,7 1,36 1,42 1,44 1,46 1,53 1,54 1,58 1,59 1,65 1,70 1,77 1,83 1,87 1,91 1,93 1,103 4.301}
{0 CHEMBL245212,11 1,17 1,20 1,22 1,27 1,32 1,33 1,52 1,53 1,54 1,60 1,65 1,69 1,76 1,78 1,80 1,83 1,84 1,88 1,91 1,103 4.987}
{0 CHEMBL263188,29 1,36 1,40 1,57 1,69 1,79 1,83 1,85 1,86 1,88 1,90 1,93 1,94 1,95 1,102 1,103 4.125}
{0 CHEMBL265876,8 1,29 1,36 1,40 1,46 1,53 1,57 1,65 1,69 1,79 1,83 1,88 1,93 1,94 1,95 1,96 1,97 1,102 1,103 5.921}
{0 CHEMBL266487,20 1,32 1,36 1,40 1,51 1,54 1,60 1,69 1,75 1,83 1,88 1,93 1,94 1,103 5.699}
{0 CHEMBL268368,2 1,18 1,20 1,32 1,34 1,36 1,38 1,42 1,54 1,55 1,58 1,69 1,75 1,83 1,88 1,93 1,94 1,103 4.222}
{0 CHEMBL275224,2 1,8 1,13 1,18 1,20 1,21 1,32 1,46 1,53 1,54 1,65 1,69 1,75 1,88 1,94 1,103 4.602}
{0 CHEMBL278819,5 1,31 1,33 1,61 1,77 1,83 1,84 1,85 1,88 1,93 1,95 1,103 4}
{0 CHEMBL279405,41 1,53 1,54 1,65 1,67 1,69 1,70 1,82 1,86 1,87 1,88 1,93 1,95 1,103 4.301}
{0 CHEMBL281957,11 1,32 1,33 1,39 1,49 1,52 1,61 1,65 1,69 1,76 1,78 1,83 1,85 1,88 1,91 1,94 1,99 1,103 4}
{0 CHEMBL291126,34 1,36 1,38 1,39 1,42 1,50 1,57 1,58 1,59 1,62 1,69 1,82 1,83 1,88 1,93 1,94 1,99 1,100 1,101 1,103 7.733}
{0 CHEMBL291402,2 1,18 1,20 1,32 1,34 1,36 1,38 1,42 1,52 1,54 1,55 1,58 1,69 1,75 1,76 1,78 1,83 1,88 1,91 1,93 1,94 1,103 5.699}
{0 CHEMBL292021,2 1,18 1,20 1,32 1,34 1,36 1,38 1,42 1,54 1,55 1,58 1,69 1,75 1,83 1,88 1,93 1,94 1,103 5.699}
{0 CHEMBL293157,2 1,18 1,20 1,32 1,34 1,36 1,38 1,42 1,52 1,54 1,55 1,58 1,69 1,75 1,76 1,78 1,83 1,88 1,91 1,93 1,94 1,103 5.699}
{0 CHEMBL293898,2 1,18 1,20 1,32 1,34 1,36 1,38 1,39 1,42 1,49 1,50 1,52 1,54 1,55 1,58 1,59 1,62 1,69 1,75 1,76 1,78 1,83 1,88 1,91 1,93 1,94 1,103 5.699}
{0 CHEMBL293991,8 1,11 1,22 1,32 1,39 1,53 1,57 1,62 1,64 1,65 1,69 1,77 1,82 1,83 1,86 1,88 1,91 1,103 5.699}
{0 CHEMBL296271,16 1,20 1,27 1,32 1,52 1,53 1,54 1,60 1,65 1,69 1,75 1,76 1,77 1,79 1,83 1,91 1,103 5.495}
{0 CHEMBL296682,20 1,32 1,52 1,53 1,54 1,60 1,65 1,69 1,76 1,77 1,78 1,83 1,91 1,103 7.046}
{0 CHEMBL298445,11 1,22 1,32 1,44 1,53 1,65 1,83 1,88 1,103 6}
{0 CHEMBL301515,15 1,36 1,39 1,40 1,43 1,46 1,49 1,51 1,53 1,62 1,69 1,83 1,88 1,93 1,94 1,103 4.699}
{0 CHEMBL302234,2 1,18 1,20 1,32 1,34 1,36 1,38 1,39 1,42 1,49 1,50 1,54 1,55 1,58 1,59 1,62 1,69 1,75 1,83 1,88 1,93 1,94 1,103 4.699}
{0 CHEMBL302472,42 1,66 1,77 1,86 1,88 1,93 1,98 1,103 4.292}
{0 CHEMBL302483,14 1,50 1,65 1,69 1,92 1,94 1,103 4.036}
{0 CHEMBL302854,2 1,18 1,20 1,32 1,34 1,36 1,38 1,42 1,52 1,54 1,55 1,58 1,69 1,75 1,76 1,78 1,82 1,83 1,86 1,91 1,93 1,94 1,103 5.699}
{0 CHEMBL302981,4 1,39 1,50 1,52 1,62 1,69 1,76 1,91 1,93 1,103 5.398}
{0 CHEMBL303144,5 1,36 1,39 1,49 1,53 1,65 1,71 1,77 1,83 1,84 1,88 1,91 1,103 5.824}
{0 CHEMBL304361,24 1,39 1,50 1,62 1,69 1,88 1,93 1,94 1,103 6}
{0 CHEMBL304362,39 1,50 1,62 1,69 1,77 1,88 1,93 1,94 1,103 5.495}
{0 CHEMBL304808,4 1,33 1,39 1,50 1,52 1,62 1,69 1,76 1,91 1,103 5.18}
{0 CHEMBL305178,36 1,39 1,49 1,53 1,65 1,71 1,77 1,83 1,84 1,87 1,88 1,91 1,103 4.62}
{0 CHEMBL305223,39 1,50 1,62 1,69 1,93 1,94 1,103 4.398}
{0 CHEMBL305234,66 1,77 1,86 1,93 1,98 1,103 5.076}
{0 CHEMBL305667,29 1,36 1,42 1,58 1,82 1,83 1,88 1,93 1,98 1,102 1,103 4.301}
{0 CHEMBL306034,8 1,18 1,33 1,34 1,36 1,38 1,39 1,42 1,43 1,45 1,49 1,50 1,53 1,58 1,59 1,61 1,62 1,64 1,69 1,71 1,82 1,83 1,85 1,86 1,93 1,94 1,95 1,103 4.699}
{0 CHEMBL306047,2 1,8 1,18 1,20 1,32 1,33 1,34 1,36 1,38 1,39 1,42 1,43 1,45 1,49 1,53 1,54 1,55 1,58 1,59 1,61 1,64 1,68 1,69 1,71 1,83 1,85 1,88 1,93 1,94 1,95 1,103 4.699}
{0 CHEMBL306082,8 1,24 1,34 1,36 1,38 1,39 1,42 1,43 1,45 1,49 1,50 1,53 1,57 1,58 1,59 1,62 1,64 1,69 1,71 1,83 1,88 1,93 1,94 1,103 4.932}
{0 CHEMBL306114,2 1,8 1,18 1,20 1,32 1,34 1,36 1,38 1,39 1,42 1,43 1,45 1,49 1,53 1,54 1,55 1,58 1,59 1,64 1,68 1,69 1,71 1,75 1,83 1,93 1,94 1,103 4.699}
{0 CHEMBL306170,29 1,36 1,42 1,58 1,82 1,83 1,88 1,93 1,98 1,102 1,103 4.585}
{0 CHEMBL306367,8 1,24 1,34 1,36 1,38 1,39 1,42 1,43 1,45 1,49 1,50 1,53 1,58 1,59 1,62 1,64 1,69 1,71 1,83 1,88 1,93 1,94 1,103 5.409}
{0 CHEMBL306501,8 1,18 1,33 1,34 1,36 1,38 1,39 1,40 1,42 1,43 1,45 1,49 1,50 1,53 1,57 1,58 1,59 1,61 1,62 1,64 1,69 1,71 1,82 1,83 1,85 1,86 1,93 1,94 1,103 5.471}
{0 CHEMBL306527,2 1,8 1,18 1,20 1,32 1,34 1,36 1,38 1,39 1,42 1,43 1,45 1,49 1,53 1,54 1,55 1,58 1,59 1,64 1,68 1,69 1,71 1,75 1,82 1,83 1,86 1,93 1,94 1,103 4.699}
{0 CHEMBL306611,2 1,8 1,18 1,20 1,32 1,34 1,36 1,38 1,39 1,42 1,43 1,45 1,49 1,53 1,54 1,55 1,58 1,59 1,64 1,68 1,69 1,71 1,75 1,82 1,83 1,86 1,93 1,94 1,103 4.699}
{0 CHEMBL306748,20 1,32 1,34 1,36 1,38 1,39 1,42 1,45 1,50 1,54 1,55 1,57 1,58 1,59 1,60 1,62 1,68 1,69 1,83 1,88 1,93 1,94 1,103 4.699}
{0 CHEMBL306856,8 1,18 1,29 1,33 1,34 1,36 1,38 1,39 1,42 1,43 1,45 1,49 1,50 1,53 1,57 1,58 1,59 1,61 1,62 1,64 1,69 1,71 1,82 1,83 1,85 1,86 1,93 1,94 1,103 5.551}
{0 CHEMBL306883,29 1,33 1,36 1,42 1,54 1,58 1,61 1,83 1,88 1,93 1,98 1,102 1,103 4.301}
{0 CHEMBL306884,29 1,30 1,33 1,36 1,42 1,58 1,61 1,82 1,83 1,85 1,88 1,93 1,98 1,102 1,103 4.301}
{0 CHEMBL307007,2 1,8 1,18 1,20 1,32 1,34 1,36 1,38 1,39 1,42 1,45 1,53 1,54 1,55 1,58 1,59 1,64 1,68 1,69 1,71 1,75 1,83 1,88 1,93 1,94 1,103 5.699}
{0 CHEMBL307150,2 1,8 1,18 1,20 1,24 1,32 1,34 1,36 1,38 1,39 1,42 1,43 1,45 1,49 1,53 1,54 1,55 1,58 1,59 1,64 1,68 1,69 1,71 1,75 1,83 1,88 1,93 1,94 1,103 4.699}
{0 CHEMBL307152,2 1,8 1,18 1,20 1,29 1,32 1,34 1,36 1,38 1,39 1,42 1,43 1,45 1,49 1,53 1,54 1,55 1,57 1,58 1,59 1,64 1,68 1,69 1,71 1,83 1,88 1,93 1,94 1,103 5.533}
{0 CHEMBL307219,2 1,8 1,18 1,20 1,32 1,34 1,36 1,38 1,39 1,42 1,43 1,45 1,49 1,53 1,54 1,55 1,58 1,59 1,64 1,68 1,69 1,71 1,82 1,83 1,86 1,88 1,93 1,94 1,103 4.699}
{0 CHEMBL307630,2 1,8 1,18 1,20 1,32 1,33 1,34 1,36 1,38 1,39 1,42 1,43 1,45 1,49 1,53 1,54 1,55 1,58 1,59 1,61 1,64 1,68 1,69 1,71 1,83 1,85 1,88 1,93 1,94 1,103 5.039}
{0 CHEMBL308099,2 1,8 1,18 1,20 1,32 1,34 1,36 1,38 1,39 1,42 1,43 1,45 1,49 1,53 1,54 1,55 1,58 1,59 1,64 1,68 1,69 1,71 1,75 1,83 1,93 1,94 1,103 5.629}
{0 CHEMBL308112,39 1,50 1,62 1,69 1,93 1,94 1,103 4.301}
{0 CHEMBL308116,2 1,8 1,18 1,20 1,32 1,34 1,36 1,38 1,39 1,42 1,43 1,45 1,49 1,53 1,54 1,55 1,58 1,59 1,64 1,68 1,69 1,71 1,75 1,83 1,88 1,93 1,94 1,103 5.699}
{0 CHEMBL308175,39 1,50 1,52 1,62 1,69 1,76 1,78 1,91 1,93 1,94 1,103 5.377}
{0 CHEMBL308252,2 1,18 1,20 1,32 1,34 1,36 1,38 1,42 1,54 1,55 1,58 1,60 1,68 1,69 1,75 1,82 1,83 1,86 1,93 1,94 1,103 4.943}
{0 CHEMBL308479,2 1,8 1,18 1,20 1,32 1,34 1,36 1,38 1,39 1,42 1,43 1,45 1,49 1,53 1,54 1,55 1,58 1,59 1,64 1,68 1,69 1,71 1,75 1,83 1,93 1,94 1,103 4.699}
{0 CHEMBL308541,2 1,8 1,18 1,20 1,24 1,32 1,34 1,36 1,38 1,39 1,42 1,43 1,45 1,49 1,52 1,53 1,54 1,55 1,58 1,59 1,64 1,68 1,69 1,71 1,75 1,76 1,78 1,83 1,91 1,93 1,94 1,103 4.699}
{0 CHEMBL308594,2 1,8 1,18 1,20 1,32 1,34 1,36 1,38 1,39 1,42 1,43 1,45 1,49 1,53 1,54 1,55 1,57 1,58 1,59 1,64 1,68 1,69 1,71 1,83 1,88 1,93 1,94 1,103 5.699}
{0 CHEMBL308979,2 1,8 1,18 1,20 1,32 1,33 1,34 1,36 1,38 1,39 1,42 1,43 1,45 1,49 1,53 1,54 1,55 1,57 1,58 1,59 1,61 1,64 1,68 1,69 1,71 1,83 1,85 1,88 1,93 1,94 1,103 5.339}
{0 CHEMBL308994,2 1,8 1,16 1,18 1,20 1,32 1,34 1,36 1,38 1,39 1,42 1,43 1,45 1,49 1,52 1,53 1,54 1,55 1,58 1,59 1,64 1,68 1,69 1,71 1,75 1,76 1,78 1,83 1,91 1,93 1,94 1,103 4.699}
{0 CHEMBL309265,2 1,8 1,13 1,16 1,17 1,18 1,20 1,21 1,32 1,46 1,47 1,48 1,52 1,53 1,54 1,65 1,69 1,76 1,79 1,83 1,84 1,88 1,91 1,93 1,103 4.602}
{0 CHEMBL309953,2 1,8 1,13 1,16 1,18 1,20 1,21 1,32 1,44 1,46 1,52 1,53 1,54 1,65 1,69 1,76 1,91 1,103 4.602}
{0 CHEMBL310179,2 1,8 1,13 1,16 1,18 1,20 1,21 1,32 1,46 1,47 1,48 1,52 1,53 1,54 1,58 1,65 1,69 1,76 1,82 1,83 1,84 1,86 1,88 1,91 1,93 1,94 1,103 4.602}
{0 CHEMBL310260,8 1,18 1,34 1,36 1,38 1,39 1,42 1,43 1,45 1,49 1,50 1,53 1,57 1,58 1,59 1,62 1,64 1,69 1,71 1,82 1,83 1,86 1,93 1,94 1,103 5.79}
{0 CHEMBL310491,2 1,8 1,18 1,20 1,32 1,33 1,34 1,36 1,38 1,39 1,42 1,43 1,45 1,49 1,53 1,54 1,55 1,58 1,59 1,61 1,64 1,68 1,69 1,71 1,83 1,85 1,88 1,93 1,94 1,95 1,103 4.699}
{0 CHEMBL311201,2 1,8 1,13 1,16 1,18 1,20 1,21 1,32 1,46 1,52 1,53 1,54 1,65 1,69 1,75 1,76 1,78 1,91 1,103 4.602}
{0 CHEMBL311306,2 1,8 1,13 1,16 1,18 1,20 1,21 1,32 1,46 1,47 1,48 1,52 1,53 1,54 1,65 1,69 1,76 1,83 1,84 1,90 1,91 1,93 1,95 1,103 4.602}
{0 CHEMBL311399,29 1,36 1,42 1,58 1,71 1,83 1,88 1,93 1,95 1,98 1,102 1,103 7.16}
{0 CHEMBL311851,8 1,18 1,29 1,34 1,36 1,38 1,39 1,42 1,43 1,45 1,49 1,50 1,53 1,57 1,58 1,59 1,62 1,64 1,69 1,71 1,82 1,83 1,86 1,93 1,94 1,103 4.745}
{0 CHEMBL312170,2 1,8 1,13 1,16 1,18 1,20 1,21 1,32 1,46 1,52 1,53 1,54 1,65 1,66 1,67 1,69 1,76 1,82 1,86 1,91 1,95 1,103 4.602}
{0 CHEMBL312292,2 1,8 1,18 1,20 1,32 1,33 1,34 1,36 1,38 1,39 1,40 1,42 1,43 1,45 1,49 1,53 1,54 1,55 1,57 1,58 1,59 1,61 1,64 1,68 1,69 1,71 1,82 1,83 1,85 1,88 1,93 1,94 1,103 5.23}
{0 CHEMBL312648,2 1,8 1,13 1,15 1,16 1,18 1,20 1,21 1,32 1,46 1,47 1,48 1,52 1,53 1,54 1,58 1,65 1,69 1,76 1,82 1,83 1,84 1,86 1,88 1,91 1,93 1,94 1,103 4.602}
{0 CHEMBL312651,2 1,8 1,13 1,16 1,18 1,20 1,21 1,32 1,46 1,52 1,53 1,54 1,65 1,66 1,69 1,76 1,82 1,86 1,91 1,94 1,103 4.602}
{0 CHEMBL312676,2 1,8 1,13 1,16 1,18 1,20 1,21 1,32 1,46 1,47 1,48 1,52 1,53 1,54 1,65 1,69 1,76 1,83 1,84 1,91 1,93 1,103 4.602}
{0 CHEMBL312698,2 1,8 1,13 1,16 1,18 1,20 1,21 1,32 1,46 1,47 1,48 1,52 1,53 1,54 1,65 1,69 1,76 1,83 1,84 1,91 1,93 1,94 1,103 4.602}
{0 CHEMBL318076,2 1,18 1,20 1,32 1,34 1,36 1,38 1,39 1,42 1,50 1,52 1,54 1,55 1,57 1,58 1,59 1,69 1,75 1,76 1,78 1,83 1,88 1,91 1,93 1,94 1,95 1,103 5.52}
{0 CHEMBL319894,14 1,18 1,19 1,28 1,30 1,36 1,61 1,65 1,69 1,82 1,83 1,86 1,88 1,90 1,93 1,94 1,95 1,103 4.523}
{0 CHEMBL320229,2 1,18 1,20 1,32 1,34 1,36 1,38 1,39 1,42 1,50 1,54 1,55 1,57 1,58 1,59 1,69 1,75 1,82 1,83 1,88 1,91 1,93 1,94 1,103 5.699}
{0 CHEMBL321063,34 1,36 1,38 1,39 1,42 1,45 1,50 1,57 1,58 1,59 1,69 1,83 1,88 1,93 1,94 1,95 1,103 5.699}
{0 CHEMBL322172,2 1,18 1,20 1,32 1,34 1,36 1,38 1,39 1,42 1,50 1,54 1,55 1,57 1,58 1,59 1,69 1,75 1,83 1,88 1,93 1,94 1,95 1,103 6.067}
{0 CHEMBL323336,14 1,18 1,19 1,22 1,28 1,30 1,32 1,52 1,61 1,65 1,69 1,76 1,78 1,80 1,82 1,83 1,84 1,86 1,90 1,91 1,93 1,94 1,95 1,103 4.523}
{0 CHEMBL325023,22 1,32 1,33 1,54 1,59 1,61 1,65 1,70 1,77 1,83 1,84 1,85 1,86 1,87 1,88 1,93 1,95 1,103 4.377}
{0 CHEMBL327300,14 1,18 1,53 1,65 1,69 1,82 1,86 1,94 1,103 5}
{0 CHEMBL329274,8 1,36 1,39 1,40 1,53 1,57 1,62 1,64 1,69 1,71 1,83 1,88 1,93 1,94 1,103 5.699}
{0 CHEMBL332575,2 1,18 1,20 1,32 1,34 1,36 1,38 1,42 1,54 1,55 1,58 1,68 1,69 1,75 1,83 1,88 1,93 1,94 1,103 4.699}
{0 CHEMBL335012,34 1,36 1,39 1,42 1,46 1,50 1,53 1,58 1,59 1,62 1,65 1,69 1,79 1,83 1,88 1,93 1,94 1,98 1,99 1,100 1,101 1,103 6.42}
{0 CHEMBL335020,34 1,36 1,38 1,39 1,42 1,50 1,58 1,59 1,62 1,69 1,83 1,88 1,93 1,94 1,98 1,99 1,100 1,101 1,103 6.125}
{0 CHEMBL335648,34 1,36 1,39 1,42 1,50 1,58 1,59 1,62 1,69 1,72 1,79 1,83 1,88 1,93 1,94 1,98 1,99 1,100 1,101 1,103 7.167}
{0 CHEMBL335718,29 1,30 1,33 1,34 1,36 1,39 1,42 1,50 1,54 1,57 1,58 1,59 1,61 1,62 1,69 1,79 1,83 1,85 1,88 1,93 1,94 1,98 1,99 1,100 1,101 1,103 6.444}
{0 CHEMBL335931,34 1,36 1,38 1,39 1,42 1,50 1,56 1,58 1,59 1,62 1,69 1,79 1,83 1,88 1,93 1,94 1,98 1,99 1,100 1,101 1,103 5.648}
{0 CHEMBL335932,20 1,34 1,36 1,39 1,42 1,50 1,58 1,59 1,62 1,69 1,79 1,83 1,88 1,91 1,93 1,94 1,98 1,99 1,100 1,101 1,103 4.77}
{0 CHEMBL336192,34 1,36 1,39 1,42 1,46 1,50 1,58 1,59 1,62 1,69 1,79 1,83 1,88 1,93 1,94 1,98 1,99 1,100 1,101 1,103 5.435}
{0 CHEMBL337026,29 1,34 1,36 1,38 1,39 1,42 1,50 1,58 1,59 1,62 1,64 1,69 1,83 1,88 1,93 1,94 1,98 1,99 1,100 1,101 1,103 7.585}
{0 CHEMBL337027,34 1,35 1,36 1,39 1,42 1,50 1,58 1,59 1,62 1,69 1,79 1,83 1,88 1,93 1,94 1,98 1,99 1,100 1,101 1,103 6.155}
{0 CHEMBL337035,34 1,36 1,39 1,42 1,50 1,58 1,59 1,62 1,69 1,79 1,83 1,88 1,93 1,94 1,98 1,99 1,100 1,101 1,103 5.796}
{0 CHEMBL337297,24 1,31 1,34 1,36 1,39 1,42 1,46 1,50 1,53 1,58 1,59 1,62 1,65 1,69 1,79 1,83 1,88 1,93 1,94 1,98 1,99 1,100 1,101 1,103 6.125}
{0 CHEMBL338049,29 1,34 1,36 1,39 1,42 1,50 1,57 1,58 1,59 1,62 1,64 1,69 1,83 1,88 1,93 1,94 1,98 1,99 1,100 1,101 1,103 5.939}
{0 CHEMBL338155,29 1,34 1,36 1,39 1,42 1,50 1,57 1,58 1,59 1,62 1,64 1,69 1,83 1,88 1,93 1,94 1,98 1,99 1,100 1,101 1,103 5.648}
{0 CHEMBL338448,34 1,36 1,39 1,42 1,50 1,58 1,59 1,62 1,69 1,79 1,83 1,88 1,93 1,94 1,98 1,99 1,100 1,101 1,103 5.62}
{0 CHEMBL338449,34 1,36 1,39 1,42 1,50 1,53 1,58 1,59 1,62 1,69 1,79 1,83 1,88 1,93 1,94 1,98 1,99 1,100 1,101 1,103 4.553}
{0 CHEMBL338935,34 1,36 1,39 1,42 1,50 1,57 1,58 1,59 1,62 1,69 1,79 1,83 1,88 1,93 1,94 1,98 1,99 1,100 1,101 1,103 6.444}
{0 CHEMBL338944,34 1,36 1,39 1,42 1,50 1,52 1,58 1,59 1,62 1,69 1,76 1,78 1,79 1,83 1,88 1,91 1,93 1,94 1,98 1,99 1,100 1,101 1,103 5.167}
{0 CHEMBL338956,34 1,36 1,39 1,42 1,50 1,57 1,58 1,59 1,62 1,69 1,83 1,88 1,93 1,94 1,98 1,99 1,100 1,101 1,103 6.523}
{0 CHEMBL339364,34 1,36 1,39 1,42 1,50 1,58 1,59 1,62 1,69 1,79 1,82 1,83 1,88 1,93 1,94 1,98 1,99 1,100 1,101 1,103 5.804}
{0 CHEMBL339799,29 1,34 1,36 1,39 1,42 1,50 1,57 1,58 1,59 1,62 1,64 1,69 1,83 1,88 1,93 1,94 1,98 1,99 1,100 1,101 1,103 5.733}
{0 CHEMBL339948,5 1,29 1,34 1,36 1,38 1,39 1,42 1,49 1,50 1,57 1,58 1,59 1,62 1,69 1,83 1,88 1,93 1,94 1,99 1,103 6.092}
{0 CHEMBL340611,34 1,36 1,39 1,42 1,50 1,58 1,59 1,62 1,69 1,72 1,79 1,83 1,88 1,93 1,94 1,98 1,99 1,100 1,101 1,103 6.569}
{0 CHEMBL341110,5 1,15 1,29 1,36 1,39 1,40 1,43 1,46 1,49 1,51 1,53 1,57 1,62 1,69 1,83 1,88 1,93 1,94 1,103 4.699}
{0 CHEMBL341655,41 1,44 1,53 1,65 1,66 1,91 1,93 1,103 4}
{0 CHEMBL343821,41 1,44 1,46 1,52 1,53 1,65 1,66 1,73 1,76 1,91 1,93 1,103 4}
{0 CHEMBL344314,8 1,36 1,46 1,53 1,57 1,65 1,69 1,79 1,83 1,88 1,93 1,94 1,96 1,97 1,103 5.699}
{0 CHEMBL351282,8 1,36 1,46 1,53 1,65 1,69 1,71 1,79 1,83 1,88 1,93 1,94 1,96 1,97 1,103 5.699}
{0 CHEMBL356459,41 1,44 1,65 1,66 1,73 1,76 1,91 1,93 1,103 4}
{0 CHEMBL357136,41 1,44 1,52 1,53 1,65 1,66 1,68 1,76 1,91 1,93 1,103 4}
{0 CHEMBL358264,17 1,21 1,23 1,29 1,36 1,79 1,83 1,88 1,93 1,95 1,98 1,103 5}
{0 CHEMBL365598,29 1,36 1,42 1,58 1,71 1,83 1,88 1,93 1,95 1,98 1,102 1,103 8.469}
{0 CHEMBL367127,36 1,42 1,58 1,83 1,88 1,93 1,98 1,103 4.301}
{0 CHEMBL367457,36 1,42 1,58 1,83 1,88 1,93 1,98 1,103 4}
{0 CHEMBL367488,29 1,36 1,42 1,58 1,71 1,83 1,88 1,93 1,95 1,98 1,102 1,103 5.284}
{0 CHEMBL373598,5 1,32 1,33 1,52 1,53 1,56 1,57 1,65 1,67 1,76 1,82 1,83 1,84 1,86 1,91 1,93 1,95 1,103 5}
{0 CHEMBL374805,20 1,23 1,25 1,26 1,29 1,31 1,32 1,35 1,46 1,51 1,53 1,54 1,57 1,60 1,62 1,65 1,67 1,69 1,70 1,72 1,74 1,75 1,77 1,82 1,83 1,86 1,87 1,88 1,94 1,95 1,103 7.745}
{0 CHEMBL374808,20 1,23 1,25 1,26 1,29 1,31 1,32 1,35 1,46 1,51 1,53 1,54 1,57 1,60 1,62 1,65 1,67 1,69 1,70 1,72 1,74 1,75 1,77 1,82 1,83 1,86 1,87 1,88 1,91 1,94 1,95 1,103 7.796}
{0 CHEMBL375485,23 1,25 1,26 1,29 1,31 1,32 1,35 1,46 1,51 1,53 1,54 1,57 1,59 1,60 1,62 1,63 1,65 1,67 1,69 1,70 1,77 1,81 1,82 1,83 1,86 1,87 1,88 1,89 1,92 1,95 1,103 6.562}
{0 CHEMBL375509,18 1,20 1,28 1,30 1,32 1,36 1,51 1,54 1,65 1,77 1,82 1,83 1,88 1,103 5.26}
{0 CHEMBL376388,18 1,20 1,28 1,30 1,32 1,36 1,51 1,54 1,65 1,77 1,82 1,83 1,103 5.284}
{0 CHEMBL376569,20 1,23 1,25 1,26 1,29 1,31 1,32 1,35 1,46 1,51 1,53 1,54 1,57 1,60 1,62 1,63 1,65 1,67 1,69 1,70 1,75 1,77 1,81 1,82 1,83 1,86 1,87 1,88 1,89 1,92 1,94 1,95 1,103 7.824}
{0 CHEMBL376570,23 1,25 1,26 1,29 1,31 1,35 1,46 1,51 1,53 1,54 1,57 1,60 1,62 1,63 1,65 1,67 1,69 1,70 1,77 1,81 1,82 1,83 1,86 1,87 1,88 1,89 1,92 1,95 1,103 7.495}
{0 CHEMBL376726,8 1,46 1,53 1,57 1,65 1,69 1,79 1,83 1,88 1,93 1,94 1,96 1,97 1,103 7.137}
{0 CHEMBL376967,1 1,3 1,4 1,5 1,6 1,7 1,9 1,10 1,11 1,12 1,14 1,15 1,17 1,18 1,19 1,22 1,24 1,27 1,28 1,30 1,32 1,33 1,37 1,40 1,52 1,54 1,56 1,57 1,61 1,65 1,69 1,76 1,78 1,82 1,83 1,85 1,86 1,88 1,91 1,93 1,94 1,103 5}
{0 CHEMBL377085,32 1,57 1,58 1,65 1,69 1,83 1,93 1,103 4.569}
{0 CHEMBL377383,32 1,36 1,52 1,58 1,65 1,76 1,82 1,83 1,91 1,92 1,93 1,95 1,103 5.125}
{0 CHEMBL377772,1 1,3 1,4 1,5 1,6 1,7 1,9 1,10 1,11 1,12 1,14 1,15 1,17 1,18 1,19 1,22 1,24 1,27 1,28 1,30 1,32 1,33 1,40 1,52 1,54 1,56 1,57 1,61 1,65 1,69 1,76 1,78 1,82 1,83 1,85 1,86 1,88 1,91 1,93 1,94 1,103 5}
{0 CHEMBL378370,1 1,3 1,4 1,5 1,6 1,7 1,9 1,10 1,11 1,12 1,14 1,15 1,17 1,18 1,19 1,22 1,24 1,27 1,28 1,30 1,32 1,33 1,36 1,40 1,52 1,54 1,61 1,65 1,69 1,76 1,78 1,82 1,83 1,86 1,88 1,91 1,93 1,94 1,103 5}
{0 CHEMBL378627,5 1,7 1,15 1,18 1,32 1,33 1,40 1,65 1,82 1,83 1,84 1,86 1,93 1,94 1,103 5.125}
{0 CHEMBL378963,8 1,20 1,23 1,25 1,26 1,29 1,31 1,32 1,35 1,46 1,51 1,53 1,54 1,57 1,60 1,65 1,67 1,69 1,74 1,75 1,76 1,77 1,82 1,83 1,86 1,88 1,91 1,94 1,95 1,96 1,97 1,103 8.301}
{0 CHEMBL379218,23 1,25 1,26 1,29 1,31 1,35 1,46 1,51 1,53 1,54 1,57 1,62 1,63 1,65 1,67 1,69 1,70 1,72 1,74 1,77 1,82 1,83 1,86 1,87 1,88 1,95 1,103 7.796}
{0 CHEMBL379601,1 1,3 1,4 1,5 1,6 1,7 1,9 1,10 1,11 1,12 1,14 1,15 1,17 1,18 1,19 1,22 1,24 1,27 1,28 1,30 1,32 1,33 1,40 1,52 1,57 1,61 1,65 1,69 1,76 1,78 1,82 1,83 1,85 1,86 1,88 1,91 1,93 1,94 1,103 5}
{0 CHEMBL379905,1 1,3 1,4 1,5 1,6 1,7 1,9 1,10 1,11 1,12 1,14 1,15 1,17 1,18 1,19 1,22 1,24 1,27 1,28 1,30 1,32 1,33 1,37 1,40 1,52 1,54 1,57 1,61 1,65 1,69 1,76 1,78 1,82 1,83 1,86 1,88 1,91 1,93 1,94 1,95 1,103 5}
{0 CHEMBL380006,1 1,3 1,4 1,5 1,6 1,7 1,9 1,10 1,11 1,12 1,14 1,15 1,17 1,18 1,19 1,22 1,24 1,27 1,28 1,30 1,32 1,33 1,50 1,52 1,54 1,61 1,65 1,69 1,76 1,78 1,82 1,83 1,86 1,88 1,91 1,93 1,94 1,103 5}
{0 CHEMBL380386,1 1,3 1,4 1,5 1,7 1,11 1,12 1,14 1,15 1,17 1,18 1,19 1,22 1,24 1,27 1,28 1,29 1,30 1,32 1,36 1,40 1,52 1,57 1,65 1,69 1,76 1,78 1,82 1,83 1,86 1,88 1,91 1,93 1,94 1,103 5}
{0 CHEMBL380454,1 1,3 1,4 1,5 1,6 1,7 1,9 1,10 1,11 1,12 1,14 1,15 1,17 1,18 1,19 1,22 1,24 1,27 1,28 1,30 1,32 1,33 1,40 1,52 1,57 1,61 1,65 1,69 1,76 1,78 1,82 1,83 1,85 1,86 1,88 1,91 1,93 1,94 1,103 5}
{0 CHEMBL380889,1 1,3 1,4 1,5 1,6 1,7 1,9 1,10 1,11 1,12 1,14 1,15 1,17 1,18 1,19 1,22 1,24 1,27 1,28 1,30 1,32 1,33 1,37 1,40 1,52 1,54 1,57 1,61 1,65 1,69 1,76 1,78 1,82 1,83 1,85 1,86 1,88 1,91 1,93 1,94 1,103 5}
{0 CHEMBL382638,1 1,3 1,4 1,5 1,6 1,9 1,10 1,11 1,12 1,14 1,15 1,18 1,19 1,22 1,24 1,27 1,28 1,30 1,32 1,33 1,37 1,40 1,52 1,54 1,56 1,57 1,61 1,65 1,69 1,76 1,78 1,82 1,83 1,85 1,86 1,91 1,93 1,94 1,103 5}
{0 CHEMBL382822,1 1,3 1,4 1,5 1,6 1,7 1,9 1,10 1,11 1,12 1,14 1,15 1,17 1,18 1,19 1,22 1,24 1,27 1,28 1,30 1,32 1,33 1,50 1,52 1,54 1,56 1,61 1,65 1,69 1,76 1,78 1,82 1,83 1,85 1,86 1,88 1,91 1,93 1,94 1,103 5}
{0 CHEMBL382823,1 1,3 1,4 1,5 1,6 1,7 1,9 1,10 1,11 1,12 1,14 1,15 1,17 1,18 1,19 1,22 1,24 1,27 1,28 1,30 1,32 1,33 1,37 1,40 1,52 1,54 1,56 1,57 1,61 1,65 1,69 1,76 1,78 1,82 1,83 1,85 1,86 1,88 1,91 1,93 1,94 1,95 1,103 5}
{0 CHEMBL383172,1 1,5 1,11 1,12 1,28 1,29 1,30 1,32 1,33 1,53 1,58 1,65 1,68 1,83 1,84 1,93 1,103 4.301}
{0 CHEMBL383246,1 1,3 1,4 1,5 1,6 1,7 1,9 1,10 1,11 1,12 1,14 1,15 1,17 1,18 1,19 1,22 1,24 1,27 1,28 1,30 1,32 1,33 1,40 1,52 1,54 1,57 1,61 1,65 1,69 1,76 1,78 1,82 1,83 1,85 1,86 1,88 1,91 1,93 1,94 1,103 5}
{0 CHEMBL383264,8 1,20 1,23 1,25 1,26 1,29 1,31 1,32 1,35 1,46 1,51 1,53 1,54 1,57 1,60 1,62 1,65 1,67 1,69 1,72 1,74 1,75 1,77 1,82 1,83 1,86 1,88 1,94 1,95 1,96 1,97 1,103 8.678}
{0 CHEMBL383541,20 1,23 1,25 1,26 1,29 1,31 1,32 1,46 1,51 1,53 1,54 1,57 1,60 1,65 1,67 1,69 1,75 1,82 1,83 1,86 1,88 1,94 1,95 1,103 7.42}
{0 CHEMBL383760,1 1,3 1,4 1,5 1,6 1,7 1,9 1,10 1,11 1,12 1,14 1,15 1,17 1,18 1,19 1,22 1,24 1,27 1,28 1,30 1,32 1,33 1,36 1,40 1,52 1,54 1,56 1,61 1,65 1,69 1,76 1,78 1,82 1,83 1,85 1,86 1,88 1,91 1,93 1,94 1,103 5}
{0 CHEMBL38380,8 1,33 1,36 1,46 1,53 1,61 1,65 1,69 1,71 1,83 1,85 1,88 1,93 1,94 1,96 1,97 1,103 6.337}
{0 CHEMBL384304,5 1,15 1,18 1,27 1,29 1,33 1,52 1,53 1,61 1,65 1,76 1,78 1,82 1,83 1,84 1,85 1,86 1,87 1,91 1,93 1,94 1,103 5.301}
{0 CHEMBL387385,20 1,27 1,32 1,36 1,52 1,53 1,54 1,57 1,58 1,59 1,60 1,70 1,76 1,77 1,78 1,83 1,87 1,88 1,91 1,92 1,93 1,103 6.409}
{0 CHEMBL388312,23 1,25 1,26 1,29 1,31 1,35 1,40 1,46 1,51 1,53 1,54 1,57 1,60 1,62 1,63 1,65 1,67 1,69 1,70 1,76 1,77 1,81 1,82 1,83 1,86 1,87 1,88 1,89 1,91 1,92 1,95 1,103 7.824}
{0 CHEMBL389745,11 1,17 1,18 1,22 1,32 1,35 1,40 1,56 1,58 1,77 1,80 1,82 1,83 1,84 1,86 1,93 1,94 1,95 1,103 5}
{0 CHEMBL395080,11 1,17 1,18 1,22 1,32 1,35 1,40 1,56 1,58 1,77 1,80 1,82 1,83 1,84 1,86 1,93 1,94 1,95 1,103 4.301}
{0 CHEMBL395573,11 1,17 1,22 1,27 1,32 1,33 1,44 1,52 1,53 1,65 1,69 1,76 1,78 1,80 1,83 1,84 1,88 1,91 1,103 4.398}
{0 CHEMBL406821,33 1,36 1,46 1,53 1,54 1,61 1,65 1,69 1,71 1,83 1,85 1,88 1,93 1,94 1,96 1,97 1,103 6.469}
{0 CHEMBL407100,8 1,29 1,36 1,40 1,46 1,53 1,57 1,65 1,69 1,79 1,83 1,88 1,93 1,94 1,95 1,96 1,97 1,102 1,103 5.921}
{0 CHEMBL410778,29 1,36 1,40 1,57 1,69 1,79 1,83 1,85 1,86 1,88 1,90 1,93 1,94 1,95 1,102 1,103 4.125}
{0 CHEMBL413032,41 1,44 1,66 1,73 1,77 1,88 1,91 1,93 1,103 4}
{0 CHEMBL415233,39 1,50 1,59 1,62 1,69 1,88 1,93 1,94 1,98 1,99 1,100 1,101 1,103 4}
{0 CHEMBL415414,8 1,29 1,36 1,40 1,46 1,53 1,57 1,65 1,69 1,79 1,83 1,88 1,93 1,94 1,95 1,96 1,97 1,102 1,103 6.647}
{0 CHEMBL421565,15 1,18 1,36 1,39 1,40 1,43 1,46 1,49 1,51 1,53 1,57 1,62 1,69 1,82 1,83 1,88 1,93 1,94 1,103 5.921}
{0 CHEMBL421872,2 1,39 1,50 1,62 1,69 1,88 1,93 1,94 1,103 4.108}
{0 CHEMBL422056,29 1,36 1,42 1,58 1,71 1,79 1,83 1,88 1,93 1,95 1,98 1,102 1,103 7.155}
{0 CHEMBL422771,39 1,50 1,62 1,69 1,91 1,93 1,94 1,103 5}
{0 CHEMBL425601,1 1,3 1,4 1,5 1,6 1,7 1,9 1,10 1,11 1,12 1,14 1,15 1,17 1,18 1,19 1,22 1,24 1,27 1,28 1,30 1,32 1,33 1,40 1,52 1,54 1,57 1,61 1,65 1,69 1,76 1,78 1,82 1,83 1,85 1,86 1,88 1,91 1,93 1,94 1,103 5}
{0 CHEMBL425834,11 1,17 1,22 1,27 1,32 1,33 1,38 1,52 1,53 1,61 1,65 1,69 1,76 1,78 1,80 1,83 1,84 1,85 1,88 1,90 1,91 1,103 4.398}
{0 CHEMBL427118,29 1,36 1,42 1,58 1,83 1,88 1,93 1,98 1,102 1,103 7.523}
{0 CHEMBL427422,23 1,25 1,26 1,27 1,29 1,31 1,35 1,46 1,51 1,52 1,53 1,54 1,57 1,60 1,62 1,63 1,65 1,67 1,69 1,70 1,76 1,77 1,78 1,81 1,82 1,83 1,86 1,87 1,88 1,89 1,91 1,92 1,95 1,103 8.155}
{0 CHEMBL428690,29 1,30 1,33 1,52 1,57 1,61 1,66 1,76 1,78 1,82 1,83 1,85 1,86 1,88 1,91 1,93 1,103 4.301}
{0 CHEMBL428973,8 1,29 1,36 1,40 1,46 1,53 1,57 1,65 1,69 1,79 1,83 1,88 1,93 1,94 1,95 1,96 1,97 1,102 1,103 5.921}
{0 CHEMBL430606,2 1,8 1,18 1,20 1,32 1,33 1,34 1,36 1,38 1,39 1,42 1,43 1,45 1,49 1,53 1,54 1,55 1,58 1,59 1,61 1,64 1,68 1,69 1,71 1,83 1,85 1,88 1,93 1,94 1,103 4.889}
{0 CHEMBL431181,2 1,8 1,18 1,20 1,32 1,34 1,36 1,38 1,39 1,42 1,43 1,45 1,49 1,53 1,54 1,55 1,57 1,58 1,59 1,64 1,68 1,69 1,71 1,75 1,83 1,88 1,93 1,94 1,103 4.699}
{0 CHEMBL432715,2 1,18 1,20 1,32 1,34 1,36 1,38 1,42 1,52 1,54 1,55 1,58 1,69 1,75 1,76 1,78 1,83 1,88 1,91 1,93 1,94 1,103 4.699}
{0 CHEMBL434037,33 1,34 1,36 1,38 1,39 1,42 1,50 1,54 1,58 1,59 1,62 1,63 1,69 1,83 1,88 1,93 1,94 1,98 1,99 1,100 1,101 1,103 4}
{0 CHEMBL434415,34 1,36 1,39 1,42 1,50 1,58 1,59 1,62 1,69 1,79 1,83 1,86 1,88 1,93 1,94 1,98 1,99 1,100 1,101 1,103 7.26}
{0 CHEMBL435809,34 1,36 1,39 1,42 1,50 1,58 1,59 1,62 1,69 1,79 1,83 1,88 1,93 1,94 1,98 1,99 1,100 1,101 1,103 5}
{0 CHEMBL436718,8 1,29 1,36 1,40 1,46 1,53 1,57 1,65 1,69 1,71 1,79 1,83 1,88 1,93 1,94 1,96 1,97 1,102 1,103 8.461}
{0 CHEMBL436817,11 1,17 1,20 1,22 1,27 1,32 1,33 1,52 1,53 1,54 1,60 1,65 1,69 1,76 1,78 1,80 1,83 1,84 1,88 1,91 1,103 4.397}
{0 CHEMBL437640,29 1,36 1,40 1,57 1,69 1,79 1,83 1,85 1,86 1,88 1,90 1,93 1,94 1,95 1,102 1,103 4.125}
{0 CHEMBL437885,1 1,3 1,4 1,5 1,6 1,7 1,9 1,10 1,11 1,12 1,14 1,15 1,17 1,18 1,19 1,22 1,24 1,27 1,28 1,30 1,32 1,33 1,52 1,61 1,65 1,69 1,76 1,78 1,82 1,83 1,85 1,86 1,88 1,91 1,94 1,103 5}
{0 CHEMBL438483,23 1,25 1,26 1,27 1,29 1,31 1,35 1,46 1,51 1,52 1,53 1,54 1,57 1,62 1,63 1,65 1,67 1,69 1,70 1,72 1,74 1,76 1,77 1,78 1,82 1,83 1,86 1,87 1,88 1,91 1,95 1,103 8.046}
{0 CHEMBL438485,7 1,29 1,36 1,42 1,44 1,54 1,57 1,58 1,59 1,70 1,77 1,83 1,86 1,87 1,93 1,102 1,103 4.301}
{0 CHEMBL441258,2 1,8 1,18 1,20 1,32 1,34 1,36 1,38 1,39 1,42 1,43 1,45 1,49 1,53 1,54 1,55 1,58 1,59 1,64 1,67 1,68 1,69 1,71 1,75 1,82 1,83 1,86 1,93 1,94 1,95 1,103 4.699}
{0 CHEMBL444337,33 1,34 1,36 1,39 1,42 1,44 1,50 1,54 1,58 1,59 1,61 1,62 1,69 1,79 1,83 1,85 1,88 1,93 1,94 1,98 1,99 1,100 1,101 1,103 5.495}
{0 CHEMBL44541,16 1,20 1,32 1,52 1,53 1,54 1,60 1,65 1,69 1,75 1,76 1,77 1,78 1,79 1,83 1,91 1,103 6.155}
{0 CHEMBL44545,4 1,20 1,32 1,52 1,53 1,54 1,60 1,65 1,69 1,75 1,76 1,77 1,83 1,91 1,103 6.678}
{0 CHEMBL46440,20 1,32 1,52 1,53 1,54 1,60 1,65 1,69 1,75 1,76 1,77 1,78 1,79 1,83 1,91 1,94 1,103 6}
{0 CHEMBL48546,36 1,46 1,71 1,82 1,83 1,85 1,88 1,93 1,94 1,98 1,103 5.367}
{0 CHEMBL48665,46 1,82 1,88 1,93 1,94 1,98 1,103 6.585}
{0 CHEMBL48988,82 1,86 1,88 1,93 1,98 1,103 5}
{0 CHEMBL49354,29 1,36 1,42 1,58 1,71 1,83 1,88 1,93 1,95 1,98 1,102 1,103 6.102}
{0 CHEMBL50498,20 1,32 1,53 1,54 1,60 1,65 1,69 1,75 1,77 1,83 1,88 1,103 4.959}
{0 CHEMBL538270,15 1,20 1,32 1,36 1,39 1,40 1,46 1,51 1,52 1,53 1,54 1,60 1,69 1,75 1,76 1,78 1,79 1,82 1,83 1,88 1,91 1,93 1,94 1,103 6.417}
{0 CHEMBL538346,53 1,62 1,65 1,69 1,77 1,88 1,93 1,94 1,95 1,103 4}
{0 CHEMBL53856,15 1,20 1,32 1,36 1,39 1,40 1,43 1,46 1,49 1,51 1,53 1,54 1,60 1,62 1,69 1,75 1,83 1,88 1,93 1,94 1,103 4.933}
{0 CHEMBL538718,15 1,33 1,36 1,39 1,40 1,43 1,46 1,49 1,51 1,53 1,61 1,62 1,69 1,82 1,83 1,85 1,88 1,93 1,94 1,103 5.407}
{0 CHEMBL540848,8 1,33 1,36 1,46 1,53 1,54 1,61 1,65 1,69 1,71 1,83 1,85 1,88 1,93 1,94 1,96 1,97 1,103 5.49}
{0 CHEMBL541643,53 1,62 1,65 1,77 1,88 1,93 1,95 1,103 5.469}
{0 CHEMBL545295,2 1,18 1,20 1,32 1,34 1,36 1,38 1,39 1,42 1,50 1,54 1,55 1,58 1,59 1,62 1,69 1,75 1,79 1,83 1,88 1,93 1,94 1,103 6.921}
{0 CHEMBL55379,11 1,20 1,22 1,32 1,53 1,54 1,60 1,65 1,69 1,75 1,77 1,79 1,82 1,83 1,86 1,88 1,91 1,94 1,103 4.137}
{0 CHEMBL553824,14 1,18 1,19 1,28 1,30 1,32 1,46 1,53 1,61 1,65 1,69 1,82 1,83 1,84 1,86 1,90 1,93 1,94 1,95 1,103 4.523}
{0 CHEMBL559147,29 1,32 1,40 1,46 1,53 1,57 1,65 1,80 1,82 1,83 1,84 1,93 1,103 5.301}
{0 CHEMBL574507,33 1,36 1,42 1,58 1,61 1,71 1,83 1,85 1,88 1,93 1,94 1,103 5.658}
{0 CHEMBL574737,29 1,34 1,36 1,39 1,42 1,50 1,57 1,58 1,59 1,62 1,64 1,69 1,83 1,88 1,93 1,94 1,98 1,99 1,100 1,101 1,103 6.602}
{0 CHEMBL57553,11 1,22 1,32 1,46 1,53 1,62 1,65 1,77 1,83 1,88 1,103 5.222}
{0 CHEMBL59785,2 1,18 1,20 1,32 1,34 1,36 1,38 1,42 1,52 1,54 1,55 1,58 1,69 1,75 1,76 1,78 1,83 1,88 1,91 1,93 1,94 1,103 6.987}
{0 CHEMBL60254,29 1,36 1,42 1,58 1,71 1,83 1,88 1,93 1,95 1,98 1,102 1,103 8.328}
{0 CHEMBL60564,2 1,16 1,18 1,20 1,32 1,34 1,36 1,38 1,42 1,52 1,54 1,55 1,58 1,69 1,75 1,76 1,78 1,83 1,88 1,91 1,93 1,94 1,103 4.699}
{0 CHEMBL606964,11 1,18 1,22 1,29 1,32 1,52 1,53 1,57 1,65 1,76 1,78 1,82 1,83 1,86 1,91 1,93 1,94 1,103 5.045}
{0 CHEMBL61790,2 1,18 1,20 1,32 1,34 1,36 1,38 1,42 1,54 1,55 1,58 1,69 1,75 1,83 1,88 1,91 1,93 1,94 1,103 5.699}
{0 CHEMBL62253,2 1,18 1,20 1,32 1,34 1,36 1,38 1,39 1,42 1,49 1,50 1,52 1,54 1,55 1,58 1,59 1,62 1,69 1,75 1,76 1,78 1,83 1,88 1,91 1,93 1,94 1,103 5.699}
{0 CHEMBL6246,10 1,71 1,77 1,82 1,86 1,93 1,98 1,103 5.456}
{0 CHEMBL64742,2 1,18 1,20 1,32 1,34 1,36 1,38 1,42 1,54 1,55 1,58 1,69 1,75 1,82 1,83 1,86 1,88 1,93 1,94 1,103 5.699}
{0 CHEMBL64758,2 1,18 1,20 1,32 1,34 1,36 1,38 1,42 1,52 1,54 1,55 1,58 1,69 1,75 1,76 1,78 1,83 1,88 1,91 1,93 1,94 1,103 4.699}
{0 CHEMBL69174,39 1,50 1,62 1,69 1,88 1,93 1,94 1,103 5.824}
{0 CHEMBL69237,27 1,52 1,66 1,76 1,77 1,78 1,86 1,91 1,93 1,98 1,103 4.699}
{0 CHEMBL69240,2 1,18 1,20 1,32 1,54 1,69 1,75 1,94 1,103 4.328}
{0 CHEMBL70346,2 1,4 1,18 1,20 1,32 1,52 1,54 1,69 1,75 1,76 1,91 1,103 4.77}
{0 CHEMBL70659,2 1,18 1,20 1,32 1,54 1,69 1,75 1,103 4.237}
{0 CHEMBL71002,4 1,39 1,50 1,52 1,62 1,69 1,76 1,91 1,93 1,103 5.155}
{0 CHEMBL71144,39 1,50 1,62 1,69 1,88 1,94 1,103 6.301}
{0 CHEMBL71331,29 1,36 1,42 1,58 1,83 1,88 1,93 1,98 1,102 1,103 7.523}
{0 CHEMBL72035,39 1,50 1,62 1,69 1,91 1,94 1,103 4.301}
{0 CHEMBL72069,2 1,8 1,18 1,20 1,32 1,34 1,36 1,38 1,39 1,42 1,43 1,45 1,49 1,53 1,54 1,55 1,58 1,59 1,64 1,68 1,69 1,75 1,82 1,83 1,86 1,88 1,93 1,94 1,103 4.879}
{0 CHEMBL72076,2 1,8 1,18 1,20 1,32 1,33 1,34 1,36 1,38 1,39 1,42 1,43 1,45 1,49 1,53 1,54 1,55 1,58 1,59 1,61 1,64 1,68 1,69 1,71 1,83 1,85 1,88 1,93 1,94 1,103 4.851}
{0 CHEMBL72077,8 1,18 1,33 1,34 1,36 1,38 1,39 1,42 1,43 1,45 1,49 1,50 1,53 1,58 1,59 1,61 1,62 1,64 1,69 1,71 1,82 1,83 1,85 1,86 1,93 1,94 1,95 1,103 4.699}
{0 CHEMBL72338,39 1,50 1,62 1,69 1,88 1,93 1,94 1,103 5.638}
{0 CHEMBL72480,29 1,36 1,42 1,58 1,82 1,83 1,88 1,93 1,98 1,102 1,103 4.398}
{0 CHEMBL72607,2 1,8 1,16 1,18 1,20 1,32 1,34 1,36 1,38 1,39 1,42 1,43 1,45 1,49 1,52 1,53 1,54 1,55 1,58 1,59 1,64 1,68 1,69 1,71 1,75 1,76 1,83 1,88 1,91 1,93 1,94 1,103 4.699}
{0 CHEMBL72754,8 1,34 1,36 1,38 1,39 1,42 1,43 1,45 1,49 1,50 1,53 1,57 1,58 1,59 1,62 1,64 1,69 1,71 1,83 1,88 1,93 1,94 1,103 5.699}
{0 CHEMBL72808,2 1,8 1,18 1,20 1,32 1,33 1,34 1,36 1,38 1,39 1,42 1,43 1,45 1,49 1,53 1,54 1,55 1,58 1,59 1,61 1,64 1,68 1,69 1,71 1,82 1,83 1,85 1,88 1,93 1,94 1,103 4.699}
{0 CHEMBL73080,2 1,8 1,18 1,20 1,32 1,34 1,36 1,38 1,39 1,42 1,43 1,45 1,49 1,52 1,53 1,54 1,55 1,58 1,59 1,64 1,68 1,69 1,71 1,75 1,76 1,78 1,83 1,88 1,91 1,93 1,94 1,103 4.699}
{0 CHEMBL73343,8 1,18 1,34 1,36 1,38 1,39 1,42 1,43 1,45 1,49 1,50 1,53 1,57 1,58 1,59 1,62 1,64 1,69 1,71 1,82 1,83 1,86 1,93 1,94 1,103 5.983}
{0 CHEMBL73413,2 1,8 1,18 1,20 1,32 1,34 1,36 1,38 1,39 1,42 1,43 1,45 1,49 1,53 1,54 1,55 1,57 1,58 1,59 1,64 1,68 1,69 1,71 1,83 1,88 1,93 1,94 1,103 4.699}
{0 CHEMBL73485,2 1,8 1,18 1,20 1,24 1,32 1,34 1,36 1,38 1,39 1,42 1,43 1,45 1,49 1,53 1,54 1,55 1,58 1,59 1,64 1,68 1,69 1,71 1,75 1,82 1,83 1,86 1,93 1,94 1,103 4.699}
{0 CHEMBL73499,2 1,8 1,18 1,20 1,32 1,34 1,36 1,38 1,39 1,42 1,43 1,45 1,49 1,52 1,53 1,54 1,55 1,58 1,59 1,64 1,68 1,69 1,71 1,75 1,76 1,78 1,83 1,88 1,91 1,93 1,94 1,103 4.699}
{0 CHEMBL73718,8 1,18 1,34 1,36 1,38 1,39 1,42 1,43 1,45 1,49 1,50 1,53 1,57 1,58 1,59 1,62 1,64 1,69 1,71 1,82 1,83 1,86 1,93 1,94 1,103 5.427}
{0 CHEMBL73721,4 1,39 1,50 1,52 1,62 1,69 1,76 1,91 1,93 1,103 4.398}
{0 CHEMBL73742,8 1,34 1,36 1,38 1,39 1,42 1,45 1,50 1,53 1,57 1,58 1,59 1,62 1,64 1,69 1,71 1,83 1,88 1,93 1,94 1,103 5.275}
{0 CHEMBL73751,2 1,18 1,20 1,32 1,34 1,36 1,38 1,42 1,54 1,55 1,58 1,60 1,68 1,69 1,75 1,83 1,88 1,93 1,94 1,103 5.699}
{0 CHEMBL73764,2 1,8 1,18 1,20 1,29 1,32 1,34 1,36 1,38 1,39 1,42 1,43 1,45 1,49 1,53 1,54 1,55 1,57 1,58 1,59 1,64 1,68 1,69 1,71 1,83 1,88 1,93 1,94 1,103 5.008}
{0 CHEMBL73772,2 1,8 1,18 1,20 1,32 1,33 1,34 1,36 1,38 1,39 1,42 1,43 1,45 1,49 1,53 1,54 1,55 1,58 1,59 1,61 1,64 1,68 1,69 1,71 1,83 1,85 1,88 1,93 1,94 1,95 1,103 4.699}
{0 CHEMBL73781,8 1,18 1,34 1,36 1,38 1,39 1,42 1,43 1,45 1,49 1,50 1,53 1,57 1,58 1,59 1,62 1,64 1,69 1,71 1,82 1,83 1,86 1,93 1,94 1,103 5.502}
{0 CHEMBL73794,2 1,8 1,18 1,20 1,32 1,33 1,34 1,36 1,38 1,39 1,42 1,43 1,45 1,49 1,53 1,54 1,55 1,58 1,59 1,61 1,64 1,68 1,69 1,71 1,83 1,85 1,88 1,93 1,94 1,103 4.78}
{0 CHEMBL73832,2 1,8 1,18 1,20 1,32 1,34 1,36 1,38 1,39 1,42 1,43 1,45 1,49 1,52 1,53 1,54 1,55 1,58 1,59 1,64 1,68 1,69 1,71 1,75 1,76 1,78 1,83 1,91 1,93 1,94 1,103 4.699}
{0 CHEMBL73937,39 1,50 1,62 1,69 1,88 1,94 1,103 4.638}
{0 CHEMBL74289,2 1,8 1,18 1,20 1,32 1,34 1,36 1,38 1,39 1,42 1,43 1,45 1,49 1,52 1,53 1,54 1,55 1,58 1,59 1,64 1,68 1,69 1,71 1,75 1,76 1,78 1,83 1,91 1,93 1,94 1,103 4.699}
{0 CHEMBL7463,15 1,20 1,32 1,33 1,36 1,38 1,39 1,40 1,46 1,51 1,53 1,54 1,60 1,61 1,62 1,69 1,75 1,83 1,85 1,88 1,93 1,94 1,103 4.699}
{0 CHEMBL74637,2 1,18 1,20 1,32 1,34 1,36 1,38 1,42 1,54 1,55 1,58 1,60 1,68 1,69 1,75 1,83 1,93 1,94 1,103 6.023}
{0 CHEMBL75368,2 1,8 1,18 1,20 1,29 1,32 1,33 1,34 1,36 1,38 1,39 1,42 1,43 1,45 1,49 1,53 1,54 1,55 1,57 1,58 1,59 1,61 1,64 1,68 1,69 1,71 1,83 1,85 1,88 1,93 1,94 1,103 5.524}
{0 CHEMBL75610,8 1,18 1,33 1,34 1,36 1,38 1,39 1,42 1,43 1,45 1,49 1,50 1,53 1,58 1,59 1,61 1,62 1,64 1,69 1,71 1,82 1,83 1,85 1,86 1,93 1,94 1,103 4.699}
{0 CHEMBL75773,8 1,33 1,36 1,46 1,53 1,61 1,65 1,69 1,71 1,83 1,85 1,88 1,93 1,94 1,96 1,97 1,103 5.222}
{0 CHEMBL75952,8 1,18 1,33 1,34 1,36 1,38 1,39 1,42 1,43 1,45 1,49 1,50 1,53 1,54 1,57 1,58 1,59 1,61 1,62 1,64 1,69 1,71 1,82 1,83 1,85 1,86 1,93 1,94 1,103 4.699}
{0 CHEMBL75953,2 1,8 1,18 1,20 1,32 1,34 1,36 1,38 1,39 1,42 1,43 1,45 1,49 1,53 1,54 1,55 1,58 1,59 1,64 1,68 1,69 1,71 1,75 1,82 1,83 1,86 1,88 1,93 1,94 1,103 5.483}
{0 CHEMBL75984,2 1,8 1,18 1,20 1,24 1,32 1,34 1,36 1,38 1,39 1,42 1,43 1,45 1,49 1,53 1,54 1,55 1,58 1,59 1,64 1,68 1,69 1,71 1,75 1,83 1,93 1,94 1,103 5.391}
{0 CHEMBL76326,2 1,8 1,18 1,20 1,32 1,34 1,36 1,38 1,39 1,42 1,43 1,45 1,49 1,53 1,54 1,55 1,57 1,58 1,59 1,64 1,68 1,69 1,71 1,83 1,88 1,93 1,94 1,103 5.213}
{0 CHEMBL76332,2 1,8 1,18 1,20 1,24 1,32 1,34 1,36 1,38 1,39 1,42 1,43 1,45 1,49 1,53 1,54 1,55 1,58 1,59 1,64 1,68 1,69 1,71 1,75 1,83 1,91 1,93 1,94 1,103 4.699}
{0 CHEMBL76337,2 1,8 1,18 1,20 1,32 1,34 1,36 1,38 1,39 1,42 1,43 1,45 1,49 1,53 1,54 1,55 1,57 1,58 1,59 1,64 1,68 1,69 1,71 1,83 1,88 1,93 1,94 1,103 5.08}
{0 CHEMBL76390,2 1,8 1,18 1,20 1,32 1,33 1,34 1,36 1,38 1,39 1,42 1,43 1,45 1,49 1,53 1,54 1,55 1,58 1,59 1,64 1,68 1,69 1,71 1,75 1,83 1,93 1,94 1,103 4.699}
{0 CHEMBL76464,8 1,18 1,33 1,34 1,36 1,38 1,39 1,42 1,43 1,45 1,49 1,50 1,53 1,58 1,59 1,61 1,62 1,64 1,69 1,71 1,82 1,83 1,85 1,86 1,93 1,94 1,103 5.533}
{0 CHEMBL76499,2 1,8 1,18 1,20 1,32 1,34 1,36 1,38 1,39 1,42 1,43 1,45 1,49 1,53 1,54 1,55 1,58 1,59 1,64 1,68 1,69 1,71 1,75 1,83 1,91 1,93 1,94 1,103 4.699}
{0 CHEMBL77155,5 1,19 1,28 1,31 1,39 1,65 1,83 1,84 1,103 4.301}
{0 CHEMBL78464,2 1,8 1,13 1,16 1,18 1,20 1,21 1,32 1,46 1,52 1,53 1,54 1,65 1,69 1,76 1,91 1,103 4.602}
{0 CHEMBL78618,2 1,8 1,13 1,18 1,20 1,21 1,24 1,32 1,46 1,53 1,54 1,65 1,69 1,75 1,91 1,103 4.602}
{0 CHEMBL78862,2 1,8 1,13 1,16 1,18 1,20 1,21 1,32 1,46 1,47 1,48 1,52 1,53 1,54 1,58 1,65 1,69 1,76 1,83 1,84 1,88 1,91 1,93 1,103 4.602}
{0 CHEMBL78885,2 1,8 1,13 1,16 1,18 1,20 1,21 1,32 1,46 1,47 1,48 1,52 1,53 1,54 1,58 1,65 1,69 1,76 1,82 1,83 1,84 1,86 1,91 1,93 1,94 1,103 4.602}
{0 CHEMBL78917,2 1,8 1,13 1,16 1,18 1,20 1,21 1,32 1,46 1,47 1,48 1,52 1,53 1,54 1,58 1,65 1,69 1,76 1,83 1,84 1,88 1,91 1,93 1,103 4.602}
{0 CHEMBL79004,2 1,8 1,13 1,16 1,18 1,20 1,21 1,32 1,46 1,47 1,48 1,52 1,53 1,54 1,58 1,65 1,69 1,76 1,83 1,84 1,91 1,93 1,103 4.602}
{0 CHEMBL80121,2 1,8 1,13 1,16 1,18 1,20 1,21 1,32 1,40 1,46 1,47 1,48 1,52 1,53 1,54 1,65 1,69 1,76 1,83 1,84 1,91 1,93 1,103 4.602}
{0 CHEMBL80619,2 1,8 1,13 1,18 1,20 1,21 1,32 1,46 1,53 1,54 1,65 1,69 1,75 1,82 1,86 1,94 1,103 4.602}
{0 CHEMBL80793,2 1,8 1,13 1,16 1,18 1,20 1,21 1,32 1,46 1,47 1,48 1,52 1,53 1,54 1,65 1,69 1,76 1,83 1,84 1,88 1,91 1,103 4.602}
{0 CHEMBL80843,2 1,8 1,13 1,16 1,18 1,20 1,21 1,32 1,46 1,47 1,48 1,52 1,53 1,54 1,58 1,65 1,69 1,76 1,83 1,84 1,91 1,93 1,103 4.602}
{0 CHEMBL81169,2 1,8 1,13 1,16 1,18 1,20 1,21 1,32 1,46 1,52 1,53 1,54 1,65 1,69 1,75 1,76 1,78 1,91 1,103 4.602}
{0 CHEMBL81170,2 1,8 1,13 1,16 1,18 1,20 1,21 1,32 1,46 1,52 1,53 1,54 1,65 1,69 1,75 1,76 1,78 1,91 1,103 4.602}
{0 CHEMBL81214,2 1,8 1,13 1,18 1,20 1,21 1,24 1,32 1,33 1,46 1,53 1,54 1,65 1,69 1,75 1,103 4.602}
{0 CHEMBL81229,2 1,8 1,13 1,16 1,18 1,20 1,21 1,32 1,46 1,52 1,53 1,54 1,65 1,66 1,67 1,69 1,76 1,82 1,86 1,91 1,95 1,103 4.602}
{0 CHEMBL81315,2 1,8 1,13 1,16 1,18 1,20 1,21 1,32 1,36 1,46 1,47 1,48 1,52 1,53 1,54 1,65 1,69 1,76 1,83 1,84 1,91 1,93 1,103 4.602}
{0 CHEMBL81603,2 1,8 1,13 1,16 1,18 1,20 1,21 1,32 1,46 1,52 1,53 1,54 1,65 1,66 1,67 1,69 1,76 1,82 1,86 1,91 1,95 1,103 4.602}
{0 CHEMBL81809,2 1,8 1,13 1,16 1,18 1,20 1,21 1,32 1,46 1,52 1,53 1,54 1,65 1,66 1,69 1,76 1,82 1,86 1,91 1,93 1,95 1,103 4.602}
{0 CHEMBL81838,2 1,8 1,13 1,16 1,18 1,20 1,21 1,32 1,46 1,52 1,53 1,54 1,65 1,69 1,76 1,91 1,103 4.602}
{0 CHEMBL82136,2 1,8 1,13 1,16 1,18 1,20 1,21 1,32 1,40 1,46 1,47 1,48 1,52 1,53 1,54 1,65 1,69 1,76 1,83 1,84 1,88 1,91 1,93 1,103 4.602}
{0 CHEMBL82137,2 1,8 1,13 1,16 1,18 1,20 1,21 1,32 1,40 1,46 1,47 1,48 1,52 1,53 1,54 1,57 1,65 1,69 1,76 1,83 1,84 1,91 1,93 1,103 4.602}
{0 CHEMBL82560,18 1,52 1,66 1,76 1,82 1,86 1,91 1,93 1,94 1,103 5}
{0 CHEMBL84645,5 1,12 1,28 1,29 1,30 1,39 1,52 1,57 1,62 1,65 1,76 1,78 1,83 1,86 1,91 1,93 1,95 1,103 4.699}
{0 CHEMBL84807,22 1,32 1,52 1,66 1,76 1,83 1,91 1,93 1,103 5.097}
{0 CHEMBL84808,22 1,32 1,52 1,66 1,76 1,83 1,91 1,93 1,103 5.301}
{0 CHEMBL92361,5 1,58 1,68 1,69 1,83 1,84 1,88 1,93 1,94 1,103 4.796}
{0 CHEMBL97026,20 1,21 1,32 1,36 1,40 1,51 1,54 1,57 1,69 1,75 1,83 1,88 1,93 1,94 1,103 4}
{0 CHEMBL99743,14 1,18 1,19 1,22 1,28 1,30 1,32 1,61 1,65 1,69 1,80 1,82 1,83 1,84 1,86 1,90 1,93 1,94 1,95 1,103 4.523}
