"molecule_id","AMW","C.","H.","Me","Mi","Mp","Mv","MW","N.","nAB","nAT","nB","nBM","nBO","nBR","nBT","nC","nCL","nCsp","nCsp2","nCsp3","nDB","nF","nH","nHet","nHM","nI","nN","nO","nP","nS","nSK","nTB","nX","O.","RBF","RBN","SCBO","Se","Si","Sp","Sv","X.","pXC50"
{1 7.493,2 41.4,3 48.3,4 1.006,5 1.129,6 0.66,7 0.621,8 434.59,10 11,11 58,13 14,14 31,16 59,17 24,20 15,21 9,22 3,23 2,24 28,25 6,26 1,29 3,31 1,32 30,34 2,35 5.2,36 0.136,37 8,38 39.5,39 58.338,40 65.456,41 38.307,42 36,43 3.4,44 7.81}
{0 CHEMBL129976,1 6.467,2 41.4,3 52.9,4 0.99,5 1.127,6 0.64,7 0.593,8 452.66,10 12,11 70,13 15,14 34,16 71,17 29,20 17,21 12,22 3,23 1,24 37,25 4,29 3,32 33,34 1,35 4.3,36 0.127,37 9,38 43,39 69.283,40 78.857,41 44.768,42 41.537,43 1.4,44 7.507}
{0 CHEMBL130230,1 7.026,2 42.6,3 49.2,4 1.002,5 1.13,6 0.646,7 0.612,8 428.56,10 12,11 61,13 15,14 32,16 62,17 26,20 17,21 9,22 3,23 2,24 30,25 5,29 3,32 31,34 2,35 4.9,36 0.129,37 8,38 41,39 61.145,40 68.951,41 39.421,42 37.34,43 3.3,44 7.313}
{0 CHEMBL130577,1 7.459,2 41.7,3 46.7,4 1.015,5 1.14,6 0.643,7 0.62,8 447.54,9 1.7,10 12,11 60,13 15,14 33,16 61,17 25,20 16,21 9,22 3,23 3,24 28,25 7,28 1,29 3,32 32,34 3,35 5,36 0.131,37 8,38 42,39 60.876,40 68.374,41 38.603,42 37.218,43 5,44 6.567}
{0 CHEMBL131561,1 7.06,2 41,3 50.8,4 0.995,5 1.123,6 0.658,7 0.609,8 430.63,10 11,11 61,13 14,14 31,16 62,17 25,20 15,21 10,22 3,23 1,24 31,25 5,26 1,29 3,31 1,32 30,34 1,35 4.9,36 0.145,37 9,38 39.5,39 60.709,40 68.531,41 40.131,42 37.144,43 1.6,44 8.318}
{0 CHEMBL132488,1 7.803,2 41.4,3 46.6,4 1.015,5 1.134,6 0.659,7 0.627,8 452.58,10 11,11 58,13 14,14 32,16 59,17 24,20 15,21 9,22 3,23 3,24 27,25 7,26 1,29 3,31 1,32 31,34 3,35 5.2,36 0.136,37 8,38 40.5,39 58.85,40 65.795,41 38.245,42 36.383,43 5.2,44 7.983}
{0 CHEMBL133176,1 6.102,2 40,3 55.4,4 0.983,5 1.125,6 0.632,7 0.579,8 396.62,10 6,11 65,13 10,14 30,16 66,17 26,20 13,21 13,22 4,24 36,25 3,29 3,32 29,35 4.6,36 0.136,37 9,38 37,39 63.887,40 73.102,41 41.069,42 37.627,44 8.534}
{0 CHEMBL288436,1 6.492,2 42.9,3 51.8,4 0.984,5 1.12,6 0.653,7 0.604,8 363.54,9 1.8,10 12,11 56,13 13,14 30,16 59,17 24,20 12,21 12,22 1,24 29,25 3,28 1,29 2,32 27,35 3.6,36 0.051,37 3,38 37,39 55.127,40 62.73,41 36.574,42 33.826,44 7.852}
{0 CHEMBL335751,1 6.796,2 41,3 50.8,4 0.999,5 1.128,6 0.638,7 0.601,8 414.56,10 11,11 61,13 14,14 31,16 62,17 25,20 15,21 10,22 3,23 1,24 31,25 5,29 4,32 30,34 1,35 6.6,36 0.145,37 9,38 39.5,39 60.96,40 68.821,41 38.938,42 36.671,43 1.6,44 7.936}
{0 CHEMBL335762,1 7.115,2 40.3,3 50.7,4 1,5 1.13,6 0.651,7 0.606,8 476.68,10 11,11 67,13 14,14 34,16 68,17 27,20 15,21 12,22 3,23 2,24 34,25 6,26 1,29 3,31 1,32 33,34 2,35 4.5,36 0.132,37 9,38 42.5,39 66.989,40 75.701,41 43.591,42 40.58,43 3,44 8.391}
{0 CHEMBL336086,1 6.379,2 40,3 53.8,4 0.991,5 1.13,6 0.631,7 0.585,8 414.61,10 6,11 65,13 10,14 31,16 66,17 26,20 13,21 13,22 4,23 1,24 35,25 4,29 3,32 30,34 1,35 4.6,36 0.136,37 9,38 38,39 64.399,40 73.442,41 41.006,42 38.01,43 1.5,44 8.601}
{0 CHEMBL337719,1 7.041,2 40.3,3 50,4 1.009,5 1.14,6 0.631,7 0.601,8 436.56,10 6,11 62,13 10,14 32,16 63,17 25,20 13,21 12,22 4,23 3,24 31,25 6,29 3,32 31,34 3,35 4.8,36 0.127,37 8,38 39,39 62.541,40 70.706,41 39.12,42 37.25,43 4.8,44 8.638}
{0 CHEMBL339298,1 7.06,2 41,3 50.8,4 0.995,5 1.123,6 0.658,7 0.609,8 430.63,10 11,11 61,13 14,14 31,16 62,17 25,20 15,21 10,22 3,23 1,24 31,25 5,26 1,29 3,31 1,32 30,34 1,35 4.9,36 0.145,37 9,38 39.5,39 60.709,40 68.531,41 40.131,42 37.144,43 1.6,44 7.987}
{0 CHEMBL340074,1 6.751,2 40.3,3 51.6,4 1,5 1.135,6 0.632,7 0.595,8 418.57,10 6,11 62,13 10,14 31,16 63,17 25,20 13,21 12,22 4,23 2,24 32,25 5,29 3,32 30,34 2,35 4.8,36 0.127,37 8,38 38,39 62.029,40 70.366,41 39.182,42 36.867,43 3.2,44 8.292}
{0 CHEMBL340555,1 7.493,2 41.4,3 48.3,4 1.006,5 1.129,6 0.66,7 0.621,8 434.59,10 11,11 58,13 14,14 31,16 59,17 24,20 15,21 9,22 3,23 2,24 28,25 6,26 1,29 3,31 1,32 30,34 2,35 5.2,36 0.136,37 8,38 39.5,39 58.338,40 65.456,41 38.307,42 36,43 3.4,44 7.943}
{0 CHEMBL42314,1 6.572,2 39.1,3 53.1,4 0.999,5 1.137,6 0.624,7 0.584,8 420.59,10 6,11 64,13 10,14 30,16 64,17 25,20 13,21 12,22 4,23 2,24 34,25 5,29 3,32 30,34 2,35 4.7,36 0.125,37 8,38 37,39 63.912,40 72.781,41 39.944,42 37.393,43 3.1,44 8.31}
{0 CHEMBL445634,1 6.634,2 42.2,3 51.6,4 0.992,5 1.125,6 0.644,7 0.601,8 424.6,10 12,11 64,13 15,14 32,16 65,17 27,20 17,21 10,22 3,23 1,24 33,25 4,29 3,32 31,34 1,35 4.7,36 0.138,37 9,38 41,39 63.516,40 72.026,41 41.245,42 38.483,43 1.6,44 7.562}
