"molecule_id","FCFP4_1024b951","FCFP4_1024b715","FCFP4_1024b752","FCFP4_1024b621","FCFP4_1024b151","FCFP4_1024b375","FCFP4_1024b447","FCFP4_1024b114","FCFP4_1024b180","FCFP4_1024b246","FCFP4_1024b612","FCFP4_1024b185","FCFP4_1024b265","FCFP4_1024b300","FCFP4_1024b660","FCFP4_1024b89","FCFP4_1024b374","FCFP4_1024b692","FCFP4_1024b899","FCFP4_1024b635","FCFP4_1024b380","FCFP4_1024b549","FCFP4_1024b600","FCFP4_1024b2","FCFP4_1024b640","FCFP4_1024b680","FCFP4_1024b933","FCFP4_1024b731","FCFP4_1024b200","FCFP4_1024b123","FCFP4_1024b65","FCFP4_1024b619","FCFP4_1024b714","FCFP4_1024b438","FCFP4_1024b606","FCFP4_1024b490","FCFP4_1024b385","FCFP4_1024b25","FCFP4_1024b459","FCFP4_1024b449","FCFP4_1024b908","FCFP4_1024b937","FCFP4_1024b109","FCFP4_1024b69","FCFP4_1024b464","FCFP4_1024b80","FCFP4_1024b508","FCFP4_1024b415","FCFP4_1024b977","FCFP4_1024b540","FCFP4_1024b1","FCFP4_1024b10","FCFP4_1024b100","FCFP4_1024b1000","FCFP4_1024b1001","FCFP4_1024b1002","FCFP4_1024b1003","FCFP4_1024b1004","FCFP4_1024b1005","FCFP4_1024b1006","FCFP4_1024b1007","FCFP4_1024b1008","FCFP4_1024b1009","FCFP4_1024b101","FCFP4_1024b1010","FCFP4_1024b1011","FCFP4_1024b1012","FCFP4_1024b1013","FCFP4_1024b1014","FCFP4_1024b1015","FCFP4_1024b1016","FCFP4_1024b1017","FCFP4_1024b1018","FCFP4_1024b1019","FCFP4_1024b102","FCFP4_1024b1020","FCFP4_1024b1021","FCFP4_1024b1022","FCFP4_1024b1023","FCFP4_1024b1024","FCFP4_1024b103","FCFP4_1024b104","FCFP4_1024b105","FCFP4_1024b106","FCFP4_1024b107","FCFP4_1024b108","FCFP4_1024b11","FCFP4_1024b110","FCFP4_1024b111","FCFP4_1024b112","FCFP4_1024b113","FCFP4_1024b115","FCFP4_1024b116","FCFP4_1024b117","FCFP4_1024b118","FCFP4_1024b119","FCFP4_1024b12","FCFP4_1024b120","FCFP4_1024b121","FCFP4_1024b122","FCFP4_1024b124","FCFP4_1024b125","FCFP4_1024b126","FCFP4_1024b127","FCFP4_1024b128","FCFP4_1024b129","FCFP4_1024b13","FCFP4_1024b130","FCFP4_1024b131","FCFP4_1024b132","FCFP4_1024b133","FCFP4_1024b134","FCFP4_1024b135","FCFP4_1024b136","FCFP4_1024b137","FCFP4_1024b138","FCFP4_1024b139","FCFP4_1024b14","FCFP4_1024b140","FCFP4_1024b141","FCFP4_1024b142","FCFP4_1024b143","FCFP4_1024b144","FCFP4_1024b145","FCFP4_1024b146","FCFP4_1024b147","FCFP4_1024b148","FCFP4_1024b149","FCFP4_1024b15","FCFP4_1024b150","FCFP4_1024b152","FCFP4_1024b153","FCFP4_1024b154","FCFP4_1024b155","FCFP4_1024b156","FCFP4_1024b157","FCFP4_1024b158","FCFP4_1024b159","FCFP4_1024b16","FCFP4_1024b160","FCFP4_1024b161","FCFP4_1024b162","FCFP4_1024b163","FCFP4_1024b164","FCFP4_1024b165","FCFP4_1024b166","FCFP4_1024b167","FCFP4_1024b168","FCFP4_1024b169","FCFP4_1024b17","FCFP4_1024b170","FCFP4_1024b171","FCFP4_1024b172","FCFP4_1024b173","FCFP4_1024b174","FCFP4_1024b175","FCFP4_1024b176","FCFP4_1024b177","FCFP4_1024b178","FCFP4_1024b179","FCFP4_1024b18","FCFP4_1024b181","FCFP4_1024b182","FCFP4_1024b183","FCFP4_1024b184","FCFP4_1024b186","FCFP4_1024b187","FCFP4_1024b188","FCFP4_1024b189","FCFP4_1024b19","FCFP4_1024b190","FCFP4_1024b191","FCFP4_1024b192","FCFP4_1024b193","FCFP4_1024b194","FCFP4_1024b195","FCFP4_1024b196","FCFP4_1024b197","FCFP4_1024b198","FCFP4_1024b199","FCFP4_1024b20","FCFP4_1024b201","FCFP4_1024b202","FCFP4_1024b203","FCFP4_1024b204","FCFP4_1024b205","FCFP4_1024b206","FCFP4_1024b207","FCFP4_1024b208","FCFP4_1024b209","FCFP4_1024b21","FCFP4_1024b210","FCFP4_1024b211","FCFP4_1024b212","FCFP4_1024b213","FCFP4_1024b214","FCFP4_1024b215","FCFP4_1024b216","FCFP4_1024b217","FCFP4_1024b218","FCFP4_1024b219","FCFP4_1024b22","FCFP4_1024b220","FCFP4_1024b221","FCFP4_1024b222","pXC50"
{1 1,2 1,4 1,6 1,12 1,20 1,24 1,27 1,31 1,32 1,34 1,40 1,42 1,51 1,52 1,117 1,150 1,151 1,163 1,206 6}
{0 CHEMBL100199,1 1,2 1,4 1,6 1,12 1,20 1,24 1,27 1,31 1,34 1,42 1,51 1,52 1,75 1,150 1,151 1,206 6}
{0 CHEMBL100313,1 1,2 1,4 1,6 1,12 1,20 1,24 1,27 1,31 1,34 1,42 1,51 1,52 1,150 1,151 1,163 1,205 1,206 6}
{0 CHEMBL100317,1 1,2 1,4 1,6 1,12 1,20 1,24 1,27 1,31 1,32 1,34 1,40 1,42 1,51 1,52 1,150 1,151 1,206 6}
{0 CHEMBL104985,24 1,38 1,51 1,52 1,61 1,150 1,151 1,161 1,163 1,201 1,203 1,205 1,206 8.959}
{0 CHEMBL105812,23 1,24 1,26 1,30 1,31 1,33 1,38 1,39 1,45 1,47 1,48 1,51 1,52 1,81 1,84 1,117 1,150 1,151 1,161 1,180 1,181 1,206 7.636}
{0 CHEMBL105926,23 1,24 1,26 1,30 1,31 1,33 1,38 1,39 1,45 1,47 1,48 1,51 1,52 1,81 1,84 1,105 1,117 1,150 1,151 1,161 1,180 1,181 1,206 6}
{0 CHEMBL108026,2 1,19 1,23 1,24 1,26 1,30 1,31 1,33 1,38 1,39 1,45 1,47 1,48 1,51 1,52 1,81 1,84 1,117 1,150 1,151 1,161 1,180 1,181 1,206 7.207}
{0 CHEMBL109555,22 1,24 1,27 1,33 1,38 1,50 1,51 1,52 1,131 1,132 1,150 1,151 1,161 1,163 1,181 1,205 1,206 8.194}
{0 CHEMBL109813,14 1,23 1,24 1,26 1,33 1,37 1,38 1,45 1,51 1,52 1,132 1,150 1,151 1,161 1,163 1,181 1,206 7.377}
{0 CHEMBL109955,23 1,24 1,26 1,33 1,37 1,38 1,45 1,51 1,52 1,76 1,150 1,151 1,161 1,163 1,181 1,206 7}
{0 CHEMBL110216,2 1,19 1,23 1,24 1,26 1,30 1,31 1,33 1,38 1,39 1,45 1,47 1,48 1,51 1,52 1,81 1,84 1,117 1,150 1,151 1,161 1,180 1,181 1,206 7.565}
{0 CHEMBL110229,23 1,24 1,26 1,30 1,31 1,33 1,38 1,39 1,45 1,47 1,48 1,51 1,52 1,81 1,84 1,97 1,117 1,150 1,151 1,161 1,180 1,181 1,206 7.622}
{0 CHEMBL110495,2 1,19 1,23 1,24 1,26 1,30 1,31 1,33 1,38 1,39 1,45 1,47 1,48 1,51 1,52 1,81 1,84 1,105 1,117 1,150 1,151 1,161 1,180 1,181 1,206 7.987}
{0 CHEMBL110549,2 1,19 1,23 1,24 1,26 1,30 1,31 1,33 1,38 1,39 1,45 1,47 1,48 1,51 1,52 1,81 1,84 1,117 1,150 1,151 1,161 1,180 1,181 1,206 7.609}
{0 CHEMBL110877,2 1,19 1,23 1,24 1,26 1,30 1,31 1,33 1,38 1,39 1,45 1,47 1,48 1,51 1,52 1,81 1,84 1,117 1,150 1,151 1,161 1,180 1,181 1,206 7.821}
{0 CHEMBL111059,14 1,24 1,36 1,37 1,38 1,51 1,52 1,132 1,150 1,151 1,161 1,163 1,181 1,206 9.409}
{0 CHEMBL111184,19 1,24 1,31 1,35 1,38 1,51 1,52 1,57 1,105 1,150 1,151 1,163 1,191 1,206 5.301}
{0 CHEMBL111448,24 1,31 1,38 1,40 1,51 1,52 1,55 1,105 1,121 1,137 1,150 1,151 1,152 1,163 1,181 1,206 10.495}
{0 CHEMBL111882,12 1,24 1,31 1,39 1,41 1,48 1,51 1,52 1,150 1,151 1,159 1,206 8}
{0 CHEMBL112161,12 1,24 1,31 1,41 1,51 1,52 1,116 1,150 1,151 1,161 1,163 1,181 1,206 6.721}
{0 CHEMBL112224,24 1,31 1,38 1,51 1,52 1,55 1,105 1,137 1,150 1,151 1,152 1,161 1,163 1,181 1,205 1,206 8.959}
{0 CHEMBL112237,24 1,31 1,38 1,51 1,52 1,55 1,105 1,137 1,150 1,151 1,152 1,163 1,181 1,205 1,206 9.167}
{0 CHEMBL112941,14 1,24 1,36 1,37 1,38 1,51 1,52 1,132 1,150 1,151 1,161 1,163 1,181 1,206 9.237}
{0 CHEMBL112942,24 1,31 1,33 1,38 1,51 1,52 1,131 1,137 1,150 1,151 1,163 1,181 1,206 7.201}
{0 CHEMBL113045,23 1,24 1,26 1,31 1,33 1,37 1,38 1,45 1,51 1,52 1,76 1,150 1,151 1,161 1,163 1,181 1,206 8.143}
{0 CHEMBL113118,24 1,31 1,33 1,38 1,51 1,52 1,55 1,131 1,137 1,150 1,151 1,163 1,181 1,205 1,206 7.174}
{0 CHEMBL113204,24 1,31 1,38 1,51 1,52 1,55 1,105 1,137 1,150 1,151 1,152 1,161 1,163 1,181 1,205 1,206 9.018}
{0 CHEMBL113213,12 1,24 1,39 1,41 1,48 1,51 1,52 1,150 1,151 1,206 9}
{0 CHEMBL113238,19 1,24 1,31 1,35 1,38 1,51 1,52 1,57 1,105 1,150 1,151 1,163 1,191 1,206 5.783}
{0 CHEMBL113519,24 1,31 1,38 1,51 1,52 1,55 1,105 1,137 1,150 1,151 1,152 1,163 1,181 1,206 9.328}
{0 CHEMBL113742,14 1,24 1,36 1,37 1,38 1,50 1,51 1,52 1,132 1,150 1,151 1,161 1,163 1,181 1,206 9.357}
{0 CHEMBL114042,12 1,24 1,31 1,39 1,41 1,48 1,51 1,52 1,105 1,150 1,151 1,162 1,206 8.222}
{0 CHEMBL114080,14 1,23 1,24 1,26 1,33 1,37 1,38 1,45 1,51 1,52 1,132 1,150 1,151 1,161 1,163 1,181 1,206 7.721}
{0 CHEMBL114093,12 1,24 1,31 1,38 1,39 1,41 1,48 1,51 1,52 1,150 1,151 1,206 8.398}
{0 CHEMBL114100,12 1,24 1,31 1,39 1,41 1,48 1,51 1,52 1,117 1,150 1,151 1,206 8.699}
{0 CHEMBL114101,12 1,24 1,31 1,39 1,41 1,48 1,51 1,52 1,105 1,150 1,151 1,162 1,206 8.222}
{0 CHEMBL114387,12 1,24 1,31 1,39 1,41 1,48 1,51 1,52 1,150 1,151 1,206 8.097}
{0 CHEMBL114444,24 1,31 1,38 1,51 1,52 1,55 1,105 1,137 1,150 1,151 1,152 1,154 1,163 1,181 1,186 1,206 8.886}
{0 CHEMBL114569,12 1,24 1,31 1,39 1,41 1,48 1,51 1,52 1,117 1,150 1,151 1,206 6.678}
{0 CHEMBL114911,2 1,12 1,19 1,24 1,31 1,41 1,51 1,52 1,105 1,116 1,117 1,150 1,151 1,163 1,181 1,206 6.398}
{0 CHEMBL114921,12 1,24 1,31 1,38 1,39 1,41 1,48 1,51 1,52 1,97 1,150 1,151 1,206 7.009}
{0 CHEMBL115288,12 1,24 1,31 1,38 1,41 1,51 1,98 1,106 1,150 1,151 1,154 1,177 1,180 1,181 1,206 7.174}
{0 CHEMBL1160917,12 1,24 1,31 1,38 1,41 1,51 1,97 1,98 1,150 1,151 1,154 1,161 1,180 1,181 1,206 8.013}
{0 CHEMBL1160918,12 1,24 1,31 1,41 1,51 1,98 1,117 1,150 1,151 1,154 1,161 1,180 1,181 1,206 6.538}
{0 CHEMBL1160919,12 1,24 1,31 1,41 1,51 1,98 1,117 1,150 1,151 1,154 1,161 1,180 1,181 1,206 7.721}
{0 CHEMBL1160920,12 1,24 1,38 1,41 1,51 1,74 1,98 1,100 1,150 1,151 1,154 1,161 1,180 1,181 1,206 9.377}
{0 CHEMBL1160921,12 1,24 1,31 1,41 1,51 1,150 1,151 1,154 1,161 1,202 1,206 8.071}
{0 CHEMBL1160922,12 1,13 1,24 1,31 1,41 1,51 1,150 1,151 1,154 1,161 1,180 1,181 1,206 8.398}
{0 CHEMBL1160923,12 1,24 1,31 1,41 1,51 1,98 1,100 1,105 1,150 1,151 1,154 1,161 1,162 1,180 1,181 1,206 8.444}
{0 CHEMBL1160924,12 1,24 1,31 1,41 1,51 1,98 1,117 1,150 1,151 1,154 1,161 1,180 1,181 1,206 8.432}
{0 CHEMBL1160925,12 1,24 1,31 1,41 1,51 1,98 1,150 1,151 1,154 1,161 1,180 1,181 1,206 8.469}
{0 CHEMBL1160926,12 1,24 1,41 1,51 1,98 1,150 1,151 1,154 1,161 1,180 1,181 1,206 10.42}
{0 CHEMBL1160927,12 1,24 1,31 1,38 1,41 1,51 1,98 1,100 1,150 1,151 1,154 1,161 1,180 1,181 1,206 9.032}
{0 CHEMBL1160928,12 1,24 1,31 1,41 1,51 1,98 1,100 1,105 1,150 1,151 1,154 1,161 1,162 1,180 1,181 1,206 8.796}
{0 CHEMBL1160929,12 1,24 1,31 1,41 1,51 1,98 1,117 1,150 1,151 1,154 1,161 1,180 1,181 1,206 9.208}
{0 CHEMBL1160930,12 1,24 1,31 1,38 1,41 1,42 1,51 1,52 1,98 1,115 1,150 1,151 1,154 1,161 1,180 1,181 1,206 8.569}
{0 CHEMBL1160931,12 1,24 1,31 1,38 1,41 1,51 1,150 1,151 1,154 1,161 1,202 1,206 7.071}
{0 CHEMBL1160932,12 1,24 1,31 1,41 1,51 1,98 1,117 1,150 1,151 1,154 1,161 1,180 1,181 1,206 9.301}
{0 CHEMBL116913,23 1,24 1,26 1,33 1,38 1,45 1,51 1,52 1,58 1,76 1,150 1,151 1,167 1,206 7.274}
{0 CHEMBL117551,12 1,24 1,31 1,41 1,51 1,52 1,116 1,117 1,150 1,151 1,161 1,163 1,181 1,206 6.523}
{0 CHEMBL120215,24 1,34 1,51 1,52 1,59 1,117 1,132 1,150 1,151 1,157 1,161 1,163 1,206 8.022}
{0 CHEMBL120216,24 1,34 1,51 1,61 1,117 1,132 1,150 1,151 1,157 1,161 1,206 8.268}
{0 CHEMBL12028,2 1,12 1,19 1,24 1,31 1,35 1,36 1,38 1,51 1,52 1,105 1,132 1,149 1,150 1,151 1,161 1,206 6.097}
{0 CHEMBL121076,24 1,34 1,51 1,52 1,81 1,132 1,150 1,151 1,157 1,158 1,161 1,206 7.959}
{0 CHEMBL121155,24 1,34 1,51 1,52 1,61 1,81 1,117 1,132 1,150 1,151 1,157 1,158 1,161 1,206 7.658}
{0 CHEMBL121687,24 1,34 1,51 1,52 1,59 1,81 1,117 1,132 1,150 1,151 1,157 1,158 1,161 1,206 7.553}
{0 CHEMBL12177,12 1,24 1,27 1,31 1,35 1,36 1,38 1,51 1,52 1,132 1,149 1,150 1,151 1,161 1,203 1,206 7.699}
{0 CHEMBL122835,24 1,34 1,51 1,52 1,132 1,150 1,151 1,157 1,161 1,206 8.046}
{0 CHEMBL122903,14 1,24 1,38 1,51 1,98 1,150 1,151 1,161 1,180 1,181 1,206 9.553}
{0 CHEMBL122904,14 1,24 1,31 1,38 1,51 1,81 1,98 1,103 1,150 1,151 1,161 1,180 1,181 1,206 9.721}
{0 CHEMBL123010,14 1,17 1,24 1,27 1,28 1,31 1,38 1,51 1,81 1,103 1,111 1,150 1,151 1,161 1,206 8.886}
{0 CHEMBL123137,24 1,51 1,52 1,132 1,150 1,151 1,161 1,163 1,206 7.658}
{0 CHEMBL12314,11 1,24 1,33 1,38 1,51 1,52 1,150 1,151 1,161 1,163 1,181 1,206 8.672}
{0 CHEMBL123643,14 1,17 1,24 1,27 1,28 1,38 1,51 1,111 1,150 1,151 1,161 1,206 8.959}
{0 CHEMBL124886,24 1,34 1,51 1,52 1,59 1,117 1,132 1,150 1,151 1,157 1,161 1,163 1,206 9.357}
{0 CHEMBL126041,24 1,34 1,51 1,52 1,61 1,117 1,132 1,150 1,151 1,157 1,161 1,206 7.056}
{0 CHEMBL126350,24 1,27 1,47 1,51 1,52 1,132 1,150 1,151 1,161 1,163 1,187 1,206 7.091}
{0 CHEMBL128,3 1,5 1,7 1,8 1,9 1,11 1,13 1,17 1,18 1,24 1,30 1,38 1,51 1,52 1,86 1,111 1,150 1,151 1,163 1,180 1,181 1,206 5}
{0 CHEMBL134473,24 1,34 1,38 1,51 1,52 1,132 1,150 1,151 1,157 1,161 1,163 1,206 7.523}
{0 CHEMBL134970,24 1,34 1,51 1,52 1,111 1,132 1,150 1,151 1,157 1,161 1,163 1,206 5.714}
{0 CHEMBL136090,24 1,37 1,51 1,52 1,150 1,151 1,161 1,163 1,203 1,206 8.796}
{0 CHEMBL136108,4 1,24 1,34 1,51 1,52 1,59 1,117 1,132 1,150 1,151 1,157 1,161 1,206 8.093}
{0 CHEMBL136138,24 1,34 1,38 1,51 1,52 1,117 1,132 1,150 1,151 1,157 1,161 1,206 6.983}
{0 CHEMBL136266,24 1,27 1,31 1,34 1,38 1,51 1,52 1,132 1,150 1,151 1,152 1,154 1,157 1,161 1,163 1,206 6.648}
{0 CHEMBL136416,24 1,34 1,38 1,51 1,52 1,117 1,132 1,150 1,151 1,157 1,161 1,206 7.357}
{0 CHEMBL136449,4 1,24 1,34 1,51 1,52 1,61 1,117 1,132 1,150 1,151 1,157 1,161 1,206 8.585}
{0 CHEMBL136524,24 1,34 1,51 1,52 1,61 1,111 1,117 1,132 1,150 1,151 1,161 1,163 1,206 8.284}
{0 CHEMBL136525,24 1,34 1,51 1,52 1,111 1,132 1,150 1,151 1,161 1,163 1,206 8.42}
{0 CHEMBL136536,24 1,34 1,38 1,51 1,52 1,117 1,132 1,150 1,151 1,157 1,161 1,206 8.056}
{0 CHEMBL136666,24 1,34 1,51 1,52 1,59 1,117 1,130 1,132 1,150 1,151 1,157 1,161 1,206 6.036}
{0 CHEMBL136772,24 1,34 1,51 1,52 1,61 1,132 1,150 1,151 1,157 1,161 1,163 1,206 7.013}
{0 CHEMBL136978,24 1,34 1,38 1,51 1,52 1,132 1,150 1,151 1,157 1,161 1,163 1,206 9.102}
{0 CHEMBL136979,24 1,34 1,38 1,51 1,132 1,150 1,151 1,157 1,161 1,206 7.785}
{0 CHEMBL137564,24 1,27 1,34 1,51 1,52 1,61 1,115 1,117 1,132 1,150 1,151 1,157 1,161 1,206 7.921}
{0 CHEMBL137565,24 1,27 1,34 1,51 1,132 1,150 1,151 1,157 1,161 1,206 8.509}
{0 CHEMBL137621,24 1,27 1,34 1,38 1,51 1,52 1,117 1,132 1,150 1,151 1,157 1,161 1,206 8.679}
{0 CHEMBL138034,24 1,34 1,51 1,52 1,59 1,85 1,117 1,132 1,150 1,151 1,157 1,161 1,183 1,206 6.161}
{0 CHEMBL138849,24 1,27 1,34 1,51 1,52 1,115 1,117 1,132 1,150 1,151 1,157 1,161 1,206 7.658}
{0 CHEMBL139271,24 1,34 1,38 1,51 1,52 1,61 1,117 1,132 1,150 1,151 1,157 1,161 1,206 6.928}
{0 CHEMBL139327,24 1,34 1,51 1,52 1,132 1,150 1,151 1,157 1,161 1,163 1,167 1,206 9.174}
{0 CHEMBL139534,24 1,34 1,38 1,51 1,132 1,150 1,151 1,157 1,161 1,206 6.947}
{0 CHEMBL140295,4 1,24 1,27 1,34 1,51 1,52 1,111 1,132 1,150 1,151 1,161 1,206 7.42}
{0 CHEMBL144113,24 1,30 1,36 1,38 1,42 1,51 1,52 1,81 1,105 1,150 1,151 1,161 1,163 1,180 1,181 1,206 6}
{0 CHEMBL144560,24 1,31 1,38 1,51 1,52 1,55 1,74 1,105 1,137 1,150 1,151 1,152 1,163 1,181 1,205 1,206 7.357}
{0 CHEMBL146012,23 1,24 1,26 1,33 1,38 1,39 1,45 1,51 1,52 1,61 1,68 1,84 1,105 1,150 1,151 1,161 1,180 1,181 1,206 9.119}
{0 CHEMBL146068,22 1,23 1,24 1,26 1,33 1,38 1,39 1,45 1,51 1,52 1,68 1,76 1,84 1,105 1,150 1,151 1,161 1,180 1,181 1,206 8.62}
{0 CHEMBL146368,23 1,24 1,26 1,33 1,38 1,39 1,45 1,51 1,52 1,61 1,68 1,84 1,105 1,150 1,151 1,161 1,180 1,181 1,206 8.469}
{0 CHEMBL147262,14 1,24 1,27 1,36 1,37 1,38 1,51 1,52 1,150 1,151 1,161 1,163 1,181 1,206 8.149}
{0 CHEMBL147549,23 1,24 1,26 1,33 1,38 1,39 1,45 1,51 1,52 1,68 1,84 1,105 1,150 1,151 1,159 1,161 1,180 1,181 1,206 8.77}
{0 CHEMBL147725,23 1,24 1,26 1,33 1,38 1,45 1,51 1,52 1,81 1,105 1,150 1,151 1,161 1,163 1,180 1,181 1,206 7.78}
{0 CHEMBL147827,24 1,36 1,38 1,42 1,51 1,52 1,81 1,105 1,150 1,151 1,161 1,163 1,180 1,181 1,206 7.213}
{0 CHEMBL148072,23 1,24 1,26 1,33 1,38 1,39 1,45 1,51 1,52 1,68 1,84 1,105 1,150 1,151 1,159 1,161 1,180 1,181 1,206 8.284}
{0 CHEMBL148076,14 1,24 1,36 1,37 1,38 1,51 1,52 1,132 1,150 1,151 1,161 1,163 1,181 1,206 9.509}
{0 CHEMBL148080,23 1,24 1,26 1,33 1,38 1,39 1,45 1,51 1,52 1,61 1,68 1,84 1,105 1,150 1,151 1,161 1,180 1,181 1,206 9.553}
{0 CHEMBL148209,24 1,31 1,33 1,38 1,51 1,52 1,55 1,131 1,137 1,150 1,151 1,163 1,181 1,206 7}
{0 CHEMBL148398,14 1,24 1,36 1,37 1,38 1,51 1,52 1,150 1,151 1,161 1,163 1,181 1,206 8.357}
{0 CHEMBL148430,14 1,24 1,36 1,37 1,38 1,51 1,52 1,132 1,150 1,151 1,161 1,163 1,181 1,206 9.495}
{0 CHEMBL14923,21 1,23 1,24 1,26 1,33 1,38 1,45 1,51 1,52 1,76 1,105 1,150 1,151 1,167 1,181 1,206 7.436}
{0 CHEMBL149558,23 1,24 1,26 1,33 1,38 1,39 1,45 1,51 1,52 1,61 1,68 1,84 1,105 1,150 1,151 1,161 1,180 1,181 1,206 9.886}
{0 CHEMBL150155,23 1,24 1,26 1,30 1,33 1,38 1,45 1,51 1,52 1,81 1,105 1,150 1,151 1,161 1,163 1,180 1,181 1,206 6.928}
{0 CHEMBL150214,23 1,24 1,26 1,30 1,33 1,38 1,39 1,45 1,51 1,52 1,81 1,84 1,105 1,150 1,151 1,161 1,163 1,180 1,181 1,206 7.417}
{0 CHEMBL15456,2 1,12 1,19 1,24 1,29 1,31 1,38 1,42 1,43 1,51 1,52 1,117 1,150 1,151 1,206 4.523}
{0 CHEMBL154787,12 1,24 1,31 1,35 1,36 1,38 1,51 1,52 1,105 1,132 1,149 1,150 1,151 1,161 1,206 6.222}
{0 CHEMBL15499,2 1,7 1,12 1,18 1,19 1,24 1,29 1,31 1,33 1,38 1,43 1,51 1,52 1,150 1,151 1,206 5}
{0 CHEMBL155697,24 1,31 1,38 1,50 1,51 1,52 1,150 1,151 1,163 1,181 1,205 1,206 7}
{0 CHEMBL155819,23 1,24 1,26 1,33 1,38 1,45 1,51 1,52 1,71 1,150 1,151 1,161 1,163 1,181 1,206 7}
{0 CHEMBL155917,12 1,24 1,36 1,38 1,51 1,52 1,76 1,105 1,150 1,151 1,206 6}
{0 CHEMBL15601,2 1,7 1,12 1,18 1,19 1,24 1,29 1,31 1,38 1,42 1,43 1,51 1,52 1,117 1,150 1,151 1,206 5.523}
{0 CHEMBL156176,24 1,27 1,31 1,38 1,50 1,51 1,52 1,132 1,150 1,151 1,161 1,163 1,181 1,206 7}
{0 CHEMBL156188,23 1,24 1,26 1,33 1,38 1,42 1,45 1,51 1,52 1,85 1,86 1,105 1,150 1,151 1,163 1,167 1,206 8.319}
{0 CHEMBL156346,23 1,24 1,26 1,33 1,38 1,42 1,45 1,51 1,52 1,76 1,105 1,150 1,151 1,163 1,167 1,206 8.018}
{0 CHEMBL156349,12 1,24 1,36 1,38 1,51 1,52 1,76 1,105 1,150 1,151 1,206 6}
{0 CHEMBL15637,2 1,12 1,19 1,24 1,29 1,31 1,38 1,42 1,43 1,51 1,52 1,117 1,140 1,150 1,151 1,206 5.699}
{0 CHEMBL156743,23 1,24 1,26 1,33 1,37 1,38 1,45 1,51 1,52 1,76 1,150 1,151 1,161 1,163 1,181 1,206 7.523}
{0 CHEMBL156920,24 1,27 1,31 1,33 1,38 1,50 1,51 1,52 1,131 1,132 1,150 1,151 1,161 1,163 1,181 1,206 7.854}
{0 CHEMBL156977,7 1,23 1,24 1,26 1,33 1,38 1,45 1,51 1,76 1,105 1,127 1,150 1,151 1,158 1,167 1,206 6.9}
{0 CHEMBL157689,24 1,36 1,37 1,38 1,51 1,52 1,111 1,150 1,151 1,161 1,163 1,181 1,206 7.175}
{0 CHEMBL157784,23 1,24 1,26 1,33 1,38 1,42 1,45 1,51 1,52 1,85 1,105 1,150 1,151 1,163 1,167 1,206 8.721}
{0 CHEMBL157880,12 1,24 1,33 1,36 1,38 1,51 1,52 1,76 1,105 1,150 1,151 1,206 6}
{0 CHEMBL15809,2 1,7 1,12 1,18 1,19 1,24 1,29 1,31 1,38 1,39 1,43 1,51 1,52 1,113 1,150 1,151 1,206 5.699}
{0 CHEMBL158895,24 1,31 1,36 1,37 1,38 1,51 1,52 1,76 1,150 1,151 1,161 1,163 1,181 1,206 7.237}
{0 CHEMBL158947,23 1,24 1,26 1,33 1,37 1,38 1,45 1,51 1,52 1,150 1,151 1,161 1,163 1,181 1,206 7.071}
{0 CHEMBL159293,23 1,24 1,26 1,33 1,38 1,45 1,51 1,52 1,110 1,150 1,151 1,161 1,163 1,181 1,206 6.647}
{0 CHEMBL159305,23 1,24 1,26 1,31 1,33 1,38 1,39 1,45 1,51 1,52 1,84 1,105 1,150 1,151 1,167 1,206 7.658}
{0 CHEMBL159405,23 1,24 1,26 1,33 1,38 1,45 1,51 1,52 1,110 1,149 1,150 1,151 1,154 1,161 1,163 1,181 1,206 7.481}
{0 CHEMBL15941,2 1,12 1,19 1,24 1,29 1,31 1,38 1,42 1,43 1,51 1,52 1,117 1,150 1,151 1,206 5.097}
{0 CHEMBL15955,2 1,7 1,12 1,18 1,19 1,24 1,29 1,31 1,38 1,42 1,43 1,51 1,52 1,117 1,150 1,151 1,206 4.699}
{0 CHEMBL159552,10 1,24 1,36 1,38 1,39 1,41 1,48 1,51 1,52 1,80 1,84 1,117 1,123 1,150 1,151 1,206 7.854}
{0 CHEMBL159609,10 1,24 1,36 1,38 1,41 1,51 1,52 1,80 1,116 1,150 1,151 1,163 1,206 7.824}
{0 CHEMBL159821,23 1,24 1,26 1,33 1,38 1,39 1,45 1,51 1,52 1,76 1,110 1,150 1,151 1,161 1,206 6.907}
{0 CHEMBL159835,23 1,24 1,26 1,33 1,38 1,42 1,45 1,51 1,52 1,150 1,151 1,163 1,167 1,206 7.524}
{0 CHEMBL15986,2 1,12 1,19 1,24 1,29 1,31 1,38 1,43 1,51 1,52 1,150 1,151 1,206 5}
{0 CHEMBL159972,23 1,24 1,26 1,33 1,38 1,42 1,45 1,51 1,52 1,85 1,86 1,132 1,150 1,161 1,163 1,206 6.804}
{0 CHEMBL160087,6 1,10 1,24 1,36 1,38 1,39 1,41 1,48 1,51 1,52 1,85 1,117 1,150 1,151 1,206 7.523}
{0 CHEMBL160109,23 1,24 1,26 1,33 1,38 1,45 1,51 1,52 1,150 1,151 1,161 1,163 1,181 1,206 6.368}
{0 CHEMBL160147,23 1,24 1,26 1,33 1,37 1,38 1,45 1,51 1,52 1,76 1,150 1,151 1,161 1,163 1,181 1,206 7}
{0 CHEMBL160714,23 1,24 1,26 1,33 1,37 1,38 1,45 1,51 1,52 1,76 1,150 1,151 1,161 1,163 1,181 1,206 8.119}
{0 CHEMBL161069,10 1,24 1,36 1,38 1,39 1,41 1,48 1,51 1,52 1,76 1,80 1,150 1,151 1,206 9.301}
{0 CHEMBL161113,10 1,24 1,36 1,38 1,41 1,51 1,52 1,80 1,116 1,150 1,151 1,163 1,181 1,206 6.427}
{0 CHEMBL16123,2 1,12 1,19 1,24 1,29 1,31 1,38 1,39 1,43 1,51 1,52 1,113 1,150 1,151 1,206 5.699}
{0 CHEMBL161411,23 1,24 1,26 1,33 1,38 1,45 1,51 1,52 1,149 1,150 1,151 1,161 1,163 1,181 1,206 6.523}
{0 CHEMBL161922,10 1,24 1,36 1,38 1,39 1,41 1,48 1,51 1,52 1,80 1,150 1,151 1,206 9.046}
{0 CHEMBL162078,23 1,24 1,26 1,33 1,38 1,39 1,45 1,51 1,52 1,84 1,110 1,150 1,151 1,161 1,206 7.103}
{0 CHEMBL162123,10 1,24 1,36 1,38 1,39 1,41 1,48 1,51 1,52 1,69 1,80 1,150 1,151 1,154 1,206 8.638}
{0 CHEMBL162219,24 1,47 1,51 1,52 1,132 1,144 1,150 1,151 1,155 1,161 1,163 1,187 1,206 6.26}
{0 CHEMBL162390,14 1,22 1,24 1,37 1,38 1,51 1,52 1,117 1,132 1,150 1,151 1,161 1,206 7.959}
{0 CHEMBL162437,24 1,32 1,38 1,47 1,51 1,52 1,132 1,150 1,151 1,161 1,163 1,187 1,206 6.18}
{0 CHEMBL163279,22 1,24 1,38 1,51 1,52 1,132 1,150 1,161 1,163 1,206 6.96}
{0 CHEMBL163440,24 1,32 1,38 1,47 1,51 1,52 1,132 1,150 1,151 1,161 1,163 1,187 1,206 7.23}
{0 CHEMBL163519,23 1,24 1,26 1,33 1,38 1,42 1,45 1,51 1,52 1,76 1,105 1,117 1,150 1,151 1,163 1,167 1,206 8.684}
{0 CHEMBL163595,14 1,22 1,24 1,37 1,38 1,51 1,127 1,132 1,150 1,151 1,161 1,206 7.886}
{0 CHEMBL163800,23 1,24 1,26 1,33 1,34 1,38 1,42 1,45 1,51 1,52 1,111 1,150 1,151 1,155 1,161 1,163 1,206 6.83}
{0 CHEMBL163859,2 1,23 1,24 1,26 1,33 1,38 1,42 1,45 1,51 1,52 1,150 1,151 1,163 1,167 1,206 7.412}
{0 CHEMBL164000,10 1,23 1,24 1,26 1,33 1,38 1,42 1,45 1,46 1,49 1,51 1,52 1,85 1,86 1,132 1,150 1,151 1,161 1,206 9.161}
{0 CHEMBL164031,14 1,22 1,24 1,37 1,38 1,51 1,52 1,132 1,150 1,151 1,161 1,206 8.721}
{0 CHEMBL164169,19 1,23 1,24 1,26 1,33 1,38 1,45 1,51 1,52 1,76 1,105 1,150 1,151 1,167 1,181 1,206 6}
{0 CHEMBL164324,10 1,23 1,24 1,26 1,33 1,38 1,42 1,45 1,46 1,49 1,51 1,52 1,85 1,86 1,132 1,150 1,151 1,161 1,206 9.187}
{0 CHEMBL164360,10 1,14 1,23 1,24 1,26 1,33 1,38 1,42 1,45 1,46 1,49 1,51 1,52 1,85 1,86 1,132 1,150 1,151 1,161 1,163 1,206 9.26}
{0 CHEMBL164425,23 1,24 1,26 1,33 1,38 1,45 1,51 1,52 1,76 1,105 1,150 1,151 1,163 1,167 1,206 6.573}
{0 CHEMBL165721,24 1,38 1,47 1,51 1,52 1,132 1,150 1,151 1,161 1,163 1,187 1,206 6.081}
{0 CHEMBL165861,14 1,22 1,24 1,37 1,38 1,51 1,132 1,150 1,151 1,161 1,206 4.77}
{0 CHEMBL166214,24 1,38 1,47 1,51 1,52 1,61 1,132 1,150 1,151 1,161 1,163 1,187 1,206 6.26}
{0 CHEMBL169443,23 1,24 1,26 1,33 1,38 1,39 1,45 1,51 1,52 1,84 1,95 1,150 1,151 1,167 1,206 7.807}
{0 CHEMBL170146,23 1,24 1,26 1,33 1,38 1,39 1,45 1,51 1,52 1,84 1,150 1,151 1,167 1,206 7.86}
{0 CHEMBL170278,23 1,24 1,26 1,33 1,38 1,39 1,45 1,51 1,52 1,84 1,150 1,151 1,161 1,167 1,206 8.328}
{0 CHEMBL171070,23 1,24 1,26 1,31 1,33 1,38 1,39 1,45 1,51 1,52 1,84 1,105 1,117 1,150 1,151 1,167 1,206 7.33}
{0 CHEMBL171867,23 1,24 1,26 1,33 1,38 1,39 1,45 1,51 1,52 1,84 1,95 1,150 1,151 1,161 1,167 1,206 8.971}
{0 CHEMBL1720,10 1,24 1,36 1,38 1,39 1,41 1,48 1,50 1,51 1,52 1,150 1,151 1,206 10.4}
{0 CHEMBL1729,23 1,24 1,26 1,31 1,33 1,38 1,45 1,51 1,52 1,76 1,105 1,117 1,150 1,151 1,167 1,178 1,206 6.46}
{0 CHEMBL173597,23 1,24 1,26 1,33 1,38 1,45 1,51 1,52 1,76 1,150 1,151 1,158 1,167 1,206 7.201}
{0 CHEMBL1744066,23 1,24 1,26 1,33 1,38 1,42 1,45 1,51 1,52 1,76 1,150 1,151 1,163 1,167 1,206 8.432}
{0 CHEMBL1744067,23 1,24 1,26 1,33 1,38 1,42 1,45 1,49 1,51 1,52 1,85 1,86 1,132 1,150 1,151 1,161 1,163 1,206 7}
{0 CHEMBL1744070,10 1,24 1,36 1,38 1,41 1,48 1,51 1,64 1,76 1,80 1,127 1,150 1,151 1,206 6.484}
{0 CHEMBL1788260,23 1,24 1,26 1,33 1,38 1,42 1,45 1,51 1,52 1,76 1,105 1,150 1,151 1,163 1,167 1,206 7.921}
{0 CHEMBL1788261,23 1,24 1,26 1,33 1,38 1,42 1,45 1,51 1,52 1,85 1,86 1,105 1,150 1,151 1,163 1,167 1,206 8.824}
{0 CHEMBL1788262,23 1,24 1,26 1,33 1,38 1,45 1,51 1,52 1,85 1,86 1,105 1,150 1,151 1,161 1,167 1,206 7.013}
{0 CHEMBL1788263,23 1,24 1,26 1,33 1,38 1,45 1,51 1,52 1,76 1,105 1,150 1,151 1,161 1,167 1,206 6.873}
{0 CHEMBL1788271,23 1,24 1,26 1,33 1,38 1,45 1,51 1,76 1,84 1,105 1,127 1,150 1,151 1,167 1,180 1,206 7.83}
{0 CHEMBL1788272,10 1,24 1,36 1,38 1,41 1,48 1,51 1,64 1,76 1,80 1,127 1,150 1,151 1,206 9.456}
{0 CHEMBL18041,23 1,24 1,26 1,33 1,38 1,39 1,45 1,51 1,52 1,76 1,84 1,105 1,150 1,151 1,167 1,206 9.266}
{0 CHEMBL18274,23 1,24 1,26 1,30 1,33 1,38 1,39 1,45 1,51 1,52 1,81 1,84 1,105 1,150 1,151 1,161 1,180 1,181 1,206 8.432}
{0 CHEMBL18473,23 1,24 1,26 1,30 1,33 1,38 1,45 1,51 1,52 1,81 1,105 1,150 1,151 1,161 1,163 1,180 1,181 1,206 6.839}
{0 CHEMBL186909,23 1,24 1,26 1,33 1,38 1,45 1,51 1,52 1,76 1,105 1,150 1,151 1,167 1,206 6.474}
{0 CHEMBL18769,23 1,24 1,26 1,33 1,38 1,45 1,51 1,52 1,81 1,105 1,150 1,151 1,161 1,163 1,180 1,181 1,206 7.53}
{0 CHEMBL18772,24 1,37 1,47 1,51 1,132 1,150 1,151 1,161 1,187 1,206 8.63}
{0 CHEMBL19006,23 1,24 1,26 1,33 1,38 1,39 1,45 1,51 1,52 1,61 1,68 1,84 1,105 1,150 1,151 1,161 1,180 1,181 1,206 9.538}
{0 CHEMBL19022,23 1,24 1,26 1,33 1,38 1,45 1,51 1,52 1,81 1,105 1,150 1,151 1,161 1,163 1,180 1,181 1,206 6.812}
{0 CHEMBL19039,24 1,36 1,38 1,42 1,51 1,52 1,81 1,105 1,150 1,151 1,161 1,163 1,180 1,181 1,206 7.052}
{0 CHEMBL1907770,23 1,24 1,26 1,38 1,39 1,51 1,52 1,66 1,76 1,105 1,113 1,147 1,150 1,151 1,167 1,206 9.638}
{0 CHEMBL191035,10 1,14 1,22 1,24 1,36 1,37 1,38 1,41 1,51 1,52 1,132 1,150 1,151 1,161 1,163 1,206 9.959}
{0 CHEMBL191036,10 1,14 1,24 1,36 1,37 1,38 1,41 1,51 1,52 1,132 1,150 1,151 1,152 1,154 1,161 1,163 1,187 1,206 9.387}
{0 CHEMBL191084,10 1,14 1,22 1,24 1,36 1,37 1,38 1,41 1,51 1,52 1,132 1,150 1,151 1,152 1,154 1,161 1,163 1,206 9.26}
{0 CHEMBL191458,14 1,22 1,24 1,31 1,36 1,37 1,38 1,51 1,52 1,117 1,132 1,150 1,151 1,161 1,163 1,206 7.886}
{0 CHEMBL191649,10 1,14 1,22 1,24 1,36 1,37 1,38 1,41 1,51 1,52 1,132 1,150 1,151 1,154 1,161 1,163 1,206 8.678}
{0 CHEMBL191707,10 1,14 1,22 1,24 1,36 1,37 1,38 1,41 1,51 1,52 1,132 1,150 1,151 1,154 1,161 1,163 1,190 1,206 8.523}
{0 CHEMBL191763,10 1,14 1,22 1,24 1,36 1,37 1,38 1,41 1,51 1,52 1,132 1,150 1,151 1,161 1,163 1,206 6.726}
{0 CHEMBL191900,10 1,14 1,22 1,24 1,36 1,37 1,38 1,41 1,51 1,52 1,132 1,150 1,151 1,161 1,163 1,180 1,206 9.347}
{0 CHEMBL192220,10 1,14 1,22 1,24 1,36 1,37 1,38 1,41 1,51 1,52 1,132 1,150 1,151 1,161 1,163 1,206 9.108}
{0 CHEMBL192350,10 1,14 1,22 1,24 1,36 1,37 1,38 1,41 1,51 1,52 1,132 1,150 1,151 1,152 1,154 1,161 1,163 1,206 8.208}
{0 CHEMBL192611,10 1,14 1,22 1,24 1,36 1,37 1,38 1,41 1,51 1,52 1,132 1,150 1,151 1,161 1,163 1,206 8.658}
{0 CHEMBL192675,14 1,22 1,24 1,36 1,37 1,38 1,51 1,52 1,132 1,150 1,151 1,161 1,163 1,206 9.678}
{0 CHEMBL192794,14 1,22 1,24 1,37 1,38 1,51 1,52 1,132 1,150 1,151 1,161 1,163 1,206 9.076}
{0 CHEMBL192869,10 1,14 1,24 1,36 1,37 1,38 1,41 1,51 1,52 1,132 1,150 1,151 1,161 1,163 1,187 1,206 9.167}
{0 CHEMBL192930,14 1,24 1,36 1,37 1,38 1,51 1,52 1,132 1,150 1,151 1,161 1,163 1,187 1,206 9.071}
{0 CHEMBL193318,10 1,14 1,22 1,24 1,36 1,37 1,38 1,41 1,51 1,52 1,132 1,150 1,151 1,161 1,163 1,206 9.036}
{0 CHEMBL193460,10 1,14 1,22 1,24 1,36 1,37 1,38 1,41 1,51 1,52 1,132 1,150 1,151 1,161 1,163 1,206 8.796}
{0 CHEMBL194492,10 1,14 1,22 1,24 1,36 1,37 1,38 1,41 1,51 1,52 1,132 1,150 1,151 1,161 1,163 1,206 8.959}
{0 CHEMBL195056,10 1,14 1,22 1,24 1,36 1,37 1,38 1,41 1,51 1,52 1,132 1,150 1,151 1,161 1,163 1,206 8.921}
{0 CHEMBL195241,14 1,22 1,23 1,24 1,26 1,37 1,38 1,51 1,52 1,85 1,100 1,132 1,150 1,151 1,161 1,163 1,206 8.252}
{0 CHEMBL195490,14 1,22 1,24 1,36 1,37 1,38 1,51 1,52 1,94 1,132 1,150 1,151 1,154 1,161 1,163 1,206 8.62}
{0 CHEMBL195498,10 1,14 1,24 1,36 1,37 1,38 1,41 1,51 1,52 1,132 1,150 1,151 1,161 1,163 1,187 1,206 8.796}
{0 CHEMBL195881,14 1,22 1,24 1,36 1,37 1,38 1,51 1,52 1,132 1,150 1,151 1,161 1,163 1,206 9.77}
{0 CHEMBL195902,10 1,14 1,22 1,24 1,36 1,37 1,38 1,41 1,51 1,52 1,132 1,150 1,151 1,154 1,161 1,163 1,190 1,206 8.444}
{0 CHEMBL201019,21 1,23 1,24 1,25 1,26 1,38 1,39 1,51 1,52 1,71 1,76 1,150 1,151 1,167 1,181 1,183 1,206 7.602}
{0 CHEMBL201414,1 1,2 1,6 1,12 1,20 1,21 1,24 1,25 1,27 1,31 1,32 1,34 1,39 1,40 1,51 1,52 1,71 1,150 1,151 1,181 1,183 1,206 7.695}
{0 CHEMBL201621,12 1,21 1,24 1,36 1,38 1,39 1,51 1,52 1,71 1,76 1,105 1,150 1,151 1,181 1,206 7.292}
{0 CHEMBL201878,21 1,24 1,36 1,39 1,51 1,52 1,54 1,71 1,98 1,150 1,151 1,161 1,181 1,206 6.87}
{0 CHEMBL201946,5 1,8 1,11 1,13 1,17 1,21 1,24 1,30 1,36 1,38 1,39 1,51 1,52 1,71 1,150 1,151 1,180 1,181 1,206 8.301}
{0 CHEMBL202122,5 1,8 1,11 1,13 1,17 1,21 1,24 1,30 1,36 1,38 1,39 1,51 1,52 1,71 1,117 1,150 1,151 1,180 1,181 1,206 8}
{0 CHEMBL202434,21 1,23 1,24 1,25 1,26 1,34 1,38 1,39 1,51 1,52 1,71 1,111 1,150 1,151 1,155 1,161 1,181 1,183 1,206 6.587}
{0 CHEMBL20748,4 1,23 1,24 1,26 1,38 1,51 1,52 1,76 1,105 1,150 1,151 1,163 1,167 1,206 6}
{0 CHEMBL2093034,23 1,24 1,26 1,33 1,38 1,42 1,45 1,51 1,52 1,76 1,105 1,150 1,151 1,163 1,167 1,206 8.155}
{0 CHEMBL2093035,23 1,24 1,26 1,33 1,38 1,45 1,51 1,52 1,85 1,86 1,105 1,150 1,151 1,161 1,167 1,206 8.347}
{0 CHEMBL2093036,23 1,24 1,26 1,33 1,38 1,45 1,51 1,52 1,76 1,105 1,150 1,151 1,161 1,167 1,206 8}
{0 CHEMBL2093061,23 1,24 1,26 1,33 1,38 1,45 1,51 1,76 1,84 1,105 1,127 1,150 1,151 1,167 1,180 1,206 7.697}
{0 CHEMBL2093898,14 1,23 1,24 1,26 1,33 1,38 1,39 1,45 1,51 1,52 1,84 1,150 1,151 1,161 1,206 9.4}
{0 CHEMBL2107804,24 1,36 1,38 1,44 1,51 1,52 1,150 1,151 1,163 1,181 1,206 7.478}
{0 CHEMBL2114412,23 1,24 1,26 1,31 1,33 1,38 1,39 1,51 1,52 1,84 1,105 1,150 1,151 1,167 1,176 1,190 1,206 7.25}
{0 CHEMBL2130744,5 1,8 1,11 1,13 1,17 1,24 1,30 1,36 1,38 1,51 1,52 1,150 1,151 1,163 1,180 1,181 1,206 8.42}
{0 CHEMBL219916,4 1,6 1,19 1,24 1,31 1,51 1,52 1,85 1,117 1,150 1,151 1,205 1,206 6}
{0 CHEMBL24854,2 1,19 1,24 1,31 1,51 1,105 1,150 1,151 1,161 1,203 1,206 4}
{0 CHEMBL24895,24 1,31 1,51 1,117 1,150 1,151 1,161 1,203 1,206 4}
{0 CHEMBL24909,19 1,24 1,31 1,38 1,51 1,52 1,117 1,134 1,150 1,151 1,161 1,203 1,206 6.022}
{0 CHEMBL25396,2 1,19 1,24 1,31 1,51 1,105 1,150 1,151 1,161 1,203 1,206 4}
{0 CHEMBL261977,24 1,27 1,34 1,38 1,51 1,52 1,86 1,132 1,150 1,151 1,157 1,158 1,161 1,206 6.7}
{0 CHEMBL266591,11 1,17 1,30 1,38 1,51 1,98 1,150 1,151 1,167 1,180 1,181 1,195 1,206 6.404}
{0 CHEMBL266723,12 1,24 1,31 1,35 1,36 1,38 1,41 1,51 1,52 1,56 1,117 1,150 1,151 1,163 1,206 7.398}
{0 CHEMBL26700,19 1,24 1,31 1,38 1,51 1,52 1,117 1,134 1,150 1,151 1,161 1,203 1,206 4}
{0 CHEMBL269396,24 1,35 1,38 1,41 1,51 1,57 1,60 1,117 1,150 1,151 1,204 1,206 6}
{0 CHEMBL27054,24 1,31 1,51 1,150 1,151 1,161 1,203 1,206 4}
{0 CHEMBL27395,2 1,19 1,24 1,31 1,51 1,150 1,151 1,161 1,203 1,206 4}
{0 CHEMBL273999,22 1,24 1,27 1,38 1,50 1,51 1,52 1,132 1,150 1,151 1,161 1,163 1,181 1,205 1,206 7}
{0 CHEMBL27403,24 1,34 1,38 1,51 1,52 1,97 1,132 1,150 1,151 1,157 1,161 1,163 1,206 5.88}
{0 CHEMBL275356,24 1,30 1,36 1,38 1,39 1,42 1,48 1,51 1,52 1,81 1,105 1,150 1,151 1,161 1,180 1,181 1,206 6.733}
{0 CHEMBL275696,24 1,35 1,38 1,41 1,51 1,52 1,56 1,57 1,117 1,150 1,151 1,163 1,204 1,206 6.921}
{0 CHEMBL277543,24 1,30 1,36 1,38 1,42 1,51 1,52 1,81 1,105 1,150 1,151 1,161 1,163 1,180 1,181 1,206 6.529}
{0 CHEMBL27846,23 1,24 1,26 1,33 1,38 1,39 1,45 1,51 1,52 1,76 1,84 1,105 1,150 1,151 1,167 1,206 8.5}
{0 CHEMBL27896,24 1,38 1,51 1,52 1,117 1,150 1,151 1,161 1,203 1,206 4}
{0 CHEMBL27966,10 1,24 1,36 1,38 1,41 1,51 1,52 1,76 1,80 1,116 1,150 1,151 1,163 1,206 7.4}
{0 CHEMBL279823,24 1,30 1,36 1,38 1,42 1,51 1,52 1,81 1,105 1,150 1,151 1,161 1,163 1,180 1,181 1,206 6}
{0 CHEMBL279850,23 1,24 1,26 1,30 1,33 1,38 1,45 1,51 1,52 1,81 1,105 1,150 1,151 1,161 1,163 1,180 1,181 1,206 6.638}
{0 CHEMBL280063,2 1,7 1,12 1,18 1,19 1,24 1,29 1,31 1,38 1,42 1,43 1,51 1,52 1,117 1,140 1,150 1,151 1,206 4.699}
{0 CHEMBL280088,2 1,12 1,19 1,24 1,29 1,31 1,33 1,38 1,43 1,51 1,52 1,150 1,151 1,206 4}
{0 CHEMBL281123,24 1,31 1,51 1,150 1,151 1,161 1,203 1,206 4}
{0 CHEMBL282234,24 1,38 1,51 1,52 1,117 1,150 1,151 1,161 1,203 1,206 5.481}
{0 CHEMBL283483,10 1,24 1,36 1,38 1,39 1,41 1,48 1,51 1,52 1,76 1,80 1,150 1,151 1,206 9.1}
{0 CHEMBL28499,10 1,24 1,36 1,38 1,39 1,41 1,48 1,51 1,52 1,76 1,80 1,150 1,151 1,206 8}
{0 CHEMBL285999,6 1,24 1,31 1,33 1,34 1,38 1,51 1,52 1,67 1,150 1,151 1,163 1,181 1,206 9.585}
{0 CHEMBL286136,12 1,24 1,36 1,38 1,51 1,52 1,76 1,105 1,150 1,151 1,161 1,206 6.122}
{0 CHEMBL286676,6 1,23 1,24 1,26 1,38 1,51 1,52 1,150 1,151 1,163 1,206 6.9}
{0 CHEMBL287045,12 1,24 1,36 1,38 1,51 1,52 1,76 1,105 1,150 1,151 1,206 6.688}
{0 CHEMBL287237,21 1,23 1,24 1,26 1,33 1,38 1,45 1,51 1,52 1,150 1,151 1,181 1,206 6.699}
{0 CHEMBL287760,10 1,23 1,24 1,26 1,33 1,38 1,42 1,45 1,46 1,49 1,51 1,52 1,85 1,132 1,150 1,151 1,161 1,163 1,206 8.42}
{0 CHEMBL287987,14 1,22 1,24 1,37 1,38 1,51 1,52 1,113 1,132 1,150 1,151 1,161 1,163 1,206 9.081}
{0 CHEMBL288069,22 1,24 1,27 1,37 1,38 1,51 1,52 1,66 1,115 1,132 1,150 1,151 1,161 1,163 1,206 8.244}
{0 CHEMBL288199,12 1,24 1,36 1,38 1,39 1,48 1,51 1,52 1,76 1,105 1,150 1,151 1,206 9.155}
{0 CHEMBL288430,23 1,24 1,26 1,31 1,33 1,38 1,51 1,52 1,105 1,150 1,151 1,163 1,167 1,176 1,181 1,190 1,206 7.5}
{0 CHEMBL288435,13 1,28 1,35 1,51 1,87 1,150 1,151 1,161 1,180 1,181 1,206 6.646}
{0 CHEMBL288497,22 1,24 1,27 1,38 1,51 1,52 1,66 1,132 1,150 1,151 1,161 1,163 1,206 7.796}
{0 CHEMBL288591,24 1,37 1,47 1,51 1,52 1,132 1,150 1,151 1,161 1,163 1,187 1,206 8.522}
{0 CHEMBL288643,18 1,22 1,24 1,36 1,37 1,38 1,51 1,52 1,132 1,150 1,151 1,161 1,163 1,206 7.921}
{0 CHEMBL288821,3 1,5 1,8 1,11 1,13 1,15 1,16 1,17 1,28 1,30 1,35 1,38 1,44 1,51 1,115 1,150 1,151 1,161 1,180 1,181 1,206 5}
{0 CHEMBL289060,13 1,28 1,35 1,51 1,87 1,150 1,151 1,161 1,180 1,181 1,206 9.004}
{0 CHEMBL289115,23 1,24 1,26 1,31 1,33 1,38 1,50 1,51 1,52 1,150 1,151 1,163 1,167 1,176 1,181 1,190 1,206 8.9}
{0 CHEMBL289126,10 1,24 1,36 1,38 1,39 1,41 1,48 1,51 1,52 1,76 1,80 1,150 1,151 1,206 9.824}
{0 CHEMBL289148,23 1,24 1,26 1,31 1,33 1,38 1,39 1,45 1,51 1,52 1,84 1,150 1,151 1,167 1,206 7.951}
{0 CHEMBL289384,24 1,27 1,51 1,132 1,150 1,151 1,161 1,206 5.31}
{0 CHEMBL289469,24 1,26 1,33 1,45 1,51 1,52 1,150 1,151 1,161 1,163 1,181 1,193 1,203 1,206 8.7}
{0 CHEMBL289486,20 1,22 1,24 1,37 1,38 1,51 1,52 1,132 1,150 1,151 1,161 1,163 1,206 9.046}
{0 CHEMBL289489,3 1,5 1,8 1,11 1,13 1,15 1,16 1,17 1,24 1,28 1,30 1,35 1,38 1,44 1,51 1,85 1,115 1,131 1,150 1,151 1,161 1,180 1,181 1,206 5}
{0 CHEMBL289664,22 1,24 1,37 1,38 1,51 1,52 1,117 1,132 1,150 1,151 1,161 1,163 1,206 9.155}
{0 CHEMBL289732,18 1,22 1,24 1,37 1,38 1,51 1,52 1,132 1,140 1,150 1,151 1,154 1,161 1,163 1,206 8.444}
{0 CHEMBL289794,18 1,22 1,24 1,36 1,37 1,38 1,51 1,52 1,132 1,150 1,151 1,161 1,163 1,206 8.387}
{0 CHEMBL28992,23 1,24 1,26 1,33 1,38 1,39 1,45 1,51 1,52 1,76 1,84 1,105 1,150 1,151 1,167 1,206 9.65}
{0 CHEMBL290065,22 1,24 1,37 1,38 1,51 1,52 1,117 1,132 1,150 1,151 1,161 1,163 1,206 8.721}
{0 CHEMBL290087,22 1,24 1,31 1,38 1,51 1,52 1,132 1,140 1,150 1,151 1,154 1,161 1,163 1,195 1,206 5.569}
{0 CHEMBL290132,23 1,24 1,26 1,31 1,33 1,38 1,39 1,45 1,51 1,52 1,84 1,105 1,150 1,151 1,167 1,206 6.388}
{0 CHEMBL290266,8 1,11 1,13 1,24 1,28 1,30 1,51 1,87 1,111 1,112 1,150 1,151 1,161 1,180 1,181 1,206 6}
{0 CHEMBL290472,22 1,24 1,37 1,38 1,51 1,52 1,132 1,150 1,151 1,161 1,163 1,206 7.699}
{0 CHEMBL290587,3 1,5 1,7 1,8 1,9 1,11 1,13 1,17 1,18 1,28 1,30 1,38 1,44 1,51 1,52 1,76 1,111 1,150 1,151 1,161 1,163 1,180 1,181 1,206 5.2}
{0 CHEMBL290730,23 1,24 1,26 1,33 1,38 1,39 1,45 1,51 1,52 1,84 1,150 1,151 1,206 7.495}
{0 CHEMBL290866,23 1,24 1,26 1,31 1,33 1,38 1,39 1,45 1,51 1,52 1,84 1,150 1,151 1,167 1,206 7.724}
{0 CHEMBL290938,8 1,11 1,13 1,24 1,28 1,30 1,35 1,51 1,87 1,98 1,112 1,150 1,151 1,161 1,180 1,181 1,206 7.983}
{0 CHEMBL290959,10 1,23 1,24 1,26 1,33 1,38 1,42 1,45 1,49 1,51 1,52 1,69 1,76 1,132 1,150 1,151 1,161 1,163 1,206 8.292}
{0 CHEMBL291031,28 1,39 1,44 1,51 1,52 1,115 1,150 1,151 1,161 1,206 8.854}
{0 CHEMBL291296,10 1,23 1,24 1,26 1,33 1,38 1,41 1,42 1,45 1,51 1,52 1,132 1,150 1,151 1,161 1,163 1,206 8.004}
{0 CHEMBL291771,3 1,24 1,37 1,51 1,52 1,105 1,132 1,150 1,151 1,161 1,163 1,206 7.381}
{0 CHEMBL292066,24 1,30 1,51 1,81 1,150 1,151 1,161 1,180 1,181 1,206 7.5}
{0 CHEMBL292260,24 1,37 1,51 1,52 1,132 1,150 1,151 1,161 1,206 7.788}
{0 CHEMBL292293,24 1,27 1,34 1,51 1,132 1,150 1,151 1,157 1,161 1,206 4.68}
{0 CHEMBL292725,19 1,24 1,27 1,31 1,34 1,38 1,51 1,52 1,117 1,132 1,134 1,150 1,151 1,157 1,161 1,206 8.991}
{0 CHEMBL293218,3 1,24 1,37 1,51 1,52 1,105 1,132 1,150 1,151 1,161 1,206 6.654}
{0 CHEMBL293219,24 1,31 1,34 1,38 1,51 1,97 1,129 1,132 1,150 1,151 1,157 1,161 1,179 1,206 4}
{0 CHEMBL293239,1 1,2 1,6 1,12 1,20 1,24 1,31 1,33 1,34 1,43 1,51 1,52 1,150 1,151 1,163 1,181 1,206 8.77}
{0 CHEMBL293468,6 1,24 1,31 1,33 1,34 1,51 1,52 1,85 1,150 1,151 1,163 1,181 1,206 8.426}
{0 CHEMBL293703,22 1,24 1,31 1,37 1,38 1,51 1,52 1,132 1,150 1,151 1,161 1,195 1,206 7.841}
{0 CHEMBL293866,24 1,37 1,51 1,52 1,132 1,150 1,151 1,161 1,163 1,206 7.902}
{0 CHEMBL293879,24 1,27 1,34 1,35 1,51 1,52 1,132 1,150 1,151 1,157 1,161 1,206 5.39}
{0 CHEMBL294083,24 1,38 1,51 1,61 1,88 1,117 1,144 1,150 1,151 1,161 1,203 1,206 9.5}
{0 CHEMBL294109,24 1,31 1,38 1,51 1,105 1,144 1,150 1,151 1,161 1,203 1,206 9.4}
{0 CHEMBL294368,24 1,27 1,34 1,38 1,51 1,52 1,117 1,132 1,140 1,150 1,151 1,157 1,161 1,206 7.78}
{0 CHEMBL294522,24 1,38 1,51 1,88 1,144 1,150 1,151 1,161 1,203 1,206 8.8}
{0 CHEMBL294649,14 1,24 1,33 1,38 1,39 1,51 1,52 1,84 1,131 1,150 1,151 1,161 1,206 9.6}
{0 CHEMBL294894,12 1,24 1,36 1,38 1,51 1,52 1,76 1,105 1,150 1,151 1,163 1,181 1,206 7.952}
{0 CHEMBL297784,6 1,24 1,27 1,38 1,51 1,85 1,150 1,151 1,161 1,206 5}
{0 CHEMBL298544,3 1,5 1,7 1,8 1,9 1,11 1,13 1,15 1,16 1,17 1,18 1,28 1,30 1,35 1,38 1,51 1,52 1,111 1,150 1,151 1,161 1,163 1,166 1,180 1,181 1,184 1,206 5.6}
{0 CHEMBL298612,14 1,24 1,33 1,38 1,39 1,51 1,52 1,84 1,131 1,150 1,151 1,161 1,206 7.9}
{0 CHEMBL298842,4 1,12 1,24 1,36 1,38 1,51 1,52 1,76 1,105 1,150 1,151 1,163 1,181 1,206 6.717}
{0 CHEMBL299213,3 1,5 1,7 1,8 1,9 1,11 1,13 1,15 1,16 1,17 1,18 1,28 1,30 1,35 1,38 1,51 1,52 1,111 1,150 1,151 1,161 1,163 1,166 1,180 1,181 1,184 1,197 1,206 5.6}
{0 CHEMBL300209,3 1,5 1,7 1,8 1,9 1,11 1,13 1,15 1,16 1,17 1,18 1,28 1,30 1,35 1,38 1,51 1,52 1,111 1,141 1,150 1,151 1,161 1,163 1,180 1,181 1,206 5}
{0 CHEMBL301039,23 1,24 1,26 1,33 1,38 1,45 1,51 1,52 1,76 1,105 1,150 1,151 1,163 1,167 1,181 1,206 7.379}
{0 CHEMBL301765,24 1,27 1,34 1,51 1,132 1,150 1,151 1,157 1,161 1,206 7.92}
{0 CHEMBL302104,24 1,27 1,31 1,34 1,51 1,132 1,150 1,151 1,157 1,161 1,206 4}
{0 CHEMBL302225,24 1,27 1,34 1,51 1,52 1,132 1,150 1,151 1,157 1,161 1,163 1,206 6.62}
{0 CHEMBL302431,24 1,27 1,34 1,38 1,51 1,52 1,117 1,132 1,150 1,151 1,157 1,161 1,206 5.64}
{0 CHEMBL302447,18 1,24 1,34 1,38 1,51 1,52 1,117 1,132 1,150 1,151 1,157 1,161 1,206 5.17}
{0 CHEMBL303463,1 1,6 1,12 1,24 1,31 1,51 1,52 1,85 1,150 1,151 1,161 1,163 1,181 1,206 6}
{0 CHEMBL303986,24 1,27 1,34 1,35 1,41 1,51 1,52 1,132 1,150 1,151 1,157 1,161 1,166 1,206 5.83}
{0 CHEMBL303999,3 1,24 1,37 1,51 1,105 1,132 1,150 1,151 1,161 1,206 7.179}
{0 CHEMBL304016,9 1,14 1,24 1,31 1,37 1,38 1,51 1,52 1,132 1,150 1,151 1,161 1,163 1,195 1,206 7.339}
{0 CHEMBL304193,22 1,24 1,31 1,37 1,38 1,51 1,52 1,132 1,140 1,150 1,151 1,154 1,161 1,163 1,195 1,206 8.798}
{0 CHEMBL304382,1 1,6 1,12 1,24 1,31 1,38 1,51 1,52 1,85 1,150 1,151 1,163 1,181 1,206 6}
{0 CHEMBL305580,3 1,9 1,14 1,24 1,37 1,51 1,52 1,105 1,132 1,150 1,151 1,161 1,163 1,206 5}
{0 CHEMBL305930,6 1,22 1,24 1,31 1,33 1,34 1,38 1,51 1,52 1,67 1,150 1,151 1,163 1,181 1,206 9}
{0 CHEMBL306003,1 1,6 1,12 1,24 1,31 1,51 1,52 1,85 1,150 1,151 1,163 1,181 1,206 7.67}
{0 CHEMBL306133,21 1,38 1,42 1,51 1,52 1,150 1,151 1,161 1,181 1,206 6.155}
{0 CHEMBL306159,6 1,10 1,24 1,31 1,33 1,34 1,36 1,38 1,41 1,44 1,51 1,52 1,67 1,150 1,151 1,163 1,181 1,206 8}
{0 CHEMBL306365,21 1,24 1,25 1,31 1,38 1,42 1,51 1,52 1,105 1,150 1,151 1,161 1,165 1,181 1,206 6.155}
{0 CHEMBL306606,22 1,24 1,26 1,33 1,38 1,45 1,51 1,52 1,117 1,150 1,151 1,161 1,163 1,181 1,193 1,203 1,206 9.3}
{0 CHEMBL307194,6 1,22 1,24 1,31 1,33 1,34 1,38 1,51 1,52 1,67 1,150 1,151 1,163 1,181 1,206 8.6}
{0 CHEMBL307589,22 1,24 1,26 1,33 1,45 1,51 1,52 1,76 1,150 1,151 1,161 1,163 1,181 1,193 1,203 1,206 8.5}
{0 CHEMBL309064,21 1,24 1,31 1,38 1,42 1,51 1,52 1,76 1,105 1,150 1,151 1,161 1,165 1,181 1,206 6.155}
{0 CHEMBL310107,24 1,37 1,39 1,47 1,48 1,51 1,52 1,132 1,150 1,151 1,161 1,206 7.319}
{0 CHEMBL312033,22 1,24 1,26 1,33 1,45 1,51 1,52 1,150 1,151 1,161 1,163 1,181 1,193 1,203 1,206 8.8}
{0 CHEMBL312898,23 1,24 1,26 1,33 1,38 1,39 1,45 1,51 1,52 1,76 1,84 1,150 1,151 1,167 1,206 7.699}
{0 CHEMBL314198,23 1,24 1,26 1,33 1,38 1,45 1,51 1,76 1,84 1,127 1,150 1,151 1,167 1,180 1,206 8}
{0 CHEMBL315071,12 1,24 1,36 1,38 1,39 1,51 1,52 1,76 1,150 1,151 1,206 6.602}
{0 CHEMBL315443,12 1,24 1,36 1,38 1,39 1,48 1,51 1,52 1,76 1,150 1,151 1,206 9}
{0 CHEMBL315518,14 1,23 1,24 1,26 1,27 1,33 1,38 1,39 1,45 1,51 1,52 1,84 1,150 1,151 1,161 1,206 8.3}
{0 CHEMBL317146,1 1,2 1,4 1,6 1,12 1,20 1,24 1,27 1,31 1,32 1,34 1,38 1,40 1,42 1,51 1,52 1,150 1,151 1,163 1,206 7.131}
{0 CHEMBL317277,1 1,2 1,4 1,6 1,12 1,20 1,24 1,27 1,31 1,34 1,38 1,42 1,51 1,52 1,150 1,151 1,163 1,206 6}
{0 CHEMBL317377,1 1,2 1,6 1,12 1,20 1,24 1,31 1,32 1,40 1,51 1,52 1,149 1,150 1,151 1,163 1,206 6.697}
{0 CHEMBL318068,1 1,2 1,6 1,12 1,20 1,24 1,27 1,31 1,32 1,34 1,40 1,42 1,51 1,52 1,100 1,150 1,151 1,163 1,168 1,206 6}
{0 CHEMBL318764,1 1,2 1,4 1,6 1,12 1,20 1,24 1,27 1,31 1,34 1,42 1,51 1,52 1,75 1,150 1,151 1,206 6}
{0 CHEMBL319673,23 1,24 1,26 1,33 1,38 1,45 1,51 1,52 1,76 1,105 1,150 1,151 1,167 1,206 8.921}
{0 CHEMBL319886,1 1,2 1,4 1,6 1,12 1,20 1,24 1,27 1,31 1,32 1,34 1,40 1,42 1,51 1,52 1,150 1,151 1,206 6}
{0 CHEMBL320055,23 1,24 1,26 1,30 1,31 1,33 1,38 1,39 1,45 1,47 1,48 1,51 1,52 1,81 1,84 1,117 1,150 1,151 1,161 1,180 1,181 1,206 7.738}
{0 CHEMBL320346,19 1,23 1,24 1,26 1,30 1,31 1,33 1,38 1,39 1,45 1,47 1,48 1,51 1,52 1,81 1,84 1,117 1,134 1,150 1,151 1,161 1,162 1,180 1,181 1,206 7.62}
{0 CHEMBL320480,24 1,31 1,33 1,38 1,50 1,51 1,52 1,131 1,150 1,151 1,163 1,181 1,205 1,206 9.319}
{0 CHEMBL320994,12 1,24 1,31 1,38 1,39 1,41 1,42 1,48 1,51 1,52 1,115 1,150 1,151 1,206 7.523}
{0 CHEMBL321477,14 1,24 1,36 1,37 1,38 1,51 1,52 1,132 1,150 1,151 1,161 1,163 1,181 1,206 9.066}
{0 CHEMBL321661,23 1,24 1,26 1,30 1,31 1,33 1,38 1,39 1,45 1,47 1,48 1,51 1,52 1,81 1,84 1,117 1,150 1,151 1,161 1,180 1,181 1,206 7.488}
{0 CHEMBL321970,1 1,2 1,4 1,6 1,12 1,20 1,24 1,27 1,31 1,32 1,34 1,40 1,42 1,51 1,52 1,105 1,150 1,151 1,162 1,163 1,206 6}
{0 CHEMBL322751,24 1,31 1,38 1,51 1,52 1,55 1,75 1,105 1,137 1,150 1,151 1,152 1,163 1,181 1,206 8.959}
{0 CHEMBL323356,24 1,51 1,85 1,150 1,151 1,161 1,206 5}
{0 CHEMBL324243,24 1,31 1,33 1,38 1,51 1,52 1,55 1,131 1,137 1,150 1,151 1,163 1,181 1,205 1,206 7.222}
{0 CHEMBL324270,19 1,24 1,31 1,35 1,38 1,51 1,52 1,57 1,105 1,150 1,151 1,163 1,191 1,206 5.538}
{0 CHEMBL324719,12 1,24 1,31 1,41 1,51 1,52 1,116 1,117 1,150 1,151 1,163 1,181 1,206 5}
{0 CHEMBL324756,24 1,31 1,33 1,38 1,50 1,51 1,52 1,131 1,150 1,151 1,163 1,181 1,206 8.854}
{0 CHEMBL325109,23 1,24 1,26 1,33 1,38 1,45 1,51 1,52 1,76 1,105 1,117 1,150 1,151 1,167 1,206 6}
{0 CHEMBL325235,14 1,24 1,36 1,37 1,38 1,51 1,52 1,132 1,150 1,151 1,161 1,163 1,181 1,206 9.056}
{0 CHEMBL325283,2 1,12 1,19 1,24 1,31 1,41 1,51 1,52 1,105 1,116 1,117 1,150 1,151 1,161 1,163 1,181 1,206 5}
{0 CHEMBL325349,24 1,31 1,38 1,51 1,52 1,55 1,105 1,137 1,150 1,151 1,152 1,163 1,181 1,205 1,206 9.347}
{0 CHEMBL326150,2 1,12 1,19 1,24 1,31 1,39 1,41 1,48 1,51 1,52 1,105 1,117 1,150 1,151 1,206 7.398}
{0 CHEMBL326545,24 1,31 1,38 1,51 1,52 1,55 1,60 1,105 1,137 1,150 1,151 1,152 1,163 1,181 1,205 1,206 8.824}
{0 CHEMBL327197,24 1,34 1,51 1,52 1,132 1,150 1,151 1,157 1,161 1,163 1,206 9.432}
{0 CHEMBL327798,23 1,24 1,26 1,38 1,51 1,52 1,76 1,100 1,150 1,151 1,161 1,167 1,168 1,206 5}
{0 CHEMBL328246,24 1,26 1,38 1,41 1,50 1,51 1,52 1,56 1,117 1,150 1,151 1,163 1,204 1,206 7}
{0 CHEMBL328641,1 1,2 1,4 1,6 1,12 1,19 1,20 1,24 1,27 1,31 1,32 1,34 1,38 1,40 1,42 1,51 1,52 1,117 1,134 1,150 1,151 1,206 6}
{0 CHEMBL330471,24 1,42 1,51 1,52 1,132 1,150 1,151 1,161 1,206 7.398}
{0 CHEMBL331234,14 1,17 1,24 1,27 1,28 1,31 1,38 1,51 1,81 1,103 1,111 1,150 1,151 1,161 1,206 9.114}
{0 CHEMBL331304,24 1,34 1,51 1,59 1,117 1,132 1,150 1,151 1,157 1,161 1,206 8.409}
{0 CHEMBL332037,14 1,23 1,24 1,26 1,33 1,37 1,38 1,45 1,51 1,52 1,132 1,150 1,151 1,161 1,163 1,181 1,206 7.276}
{0 CHEMBL332242,14 1,17 1,24 1,27 1,28 1,38 1,51 1,111 1,150 1,151 1,161 1,206 9.602}
{0 CHEMBL332328,24 1,34 1,51 1,52 1,59 1,117 1,132 1,150 1,151 1,157 1,161 1,206 7.086}
{0 CHEMBL332767,14 1,17 1,24 1,27 1,28 1,38 1,51 1,111 1,150 1,151 1,161 1,206 9.125}
{0 CHEMBL333144,12 1,24 1,31 1,39 1,41 1,48 1,51 1,52 1,117 1,150 1,151 1,206 8.523}
{0 CHEMBL333371,24 1,31 1,38 1,51 1,52 1,105 1,137 1,150 1,151 1,152 1,163 1,181 1,206 9.292}
{0 CHEMBL333398,12 1,24 1,31 1,41 1,51 1,52 1,116 1,150 1,151 1,163 1,181 1,206 7.921}
{0 CHEMBL333466,14 1,17 1,24 1,27 1,28 1,38 1,51 1,111 1,150 1,151 1,161 1,206 9.638}
{0 CHEMBL333737,14 1,24 1,38 1,51 1,98 1,150 1,151 1,161 1,180 1,181 1,206 10.125}
{0 CHEMBL333834,12 1,24 1,31 1,38 1,41 1,51 1,98 1,106 1,150 1,151 1,154 1,177 1,180 1,181 1,206 7.26}
{0 CHEMBL334462,24 1,34 1,38 1,51 1,52 1,59 1,111 1,117 1,132 1,150 1,151 1,157 1,161 1,206 6.108}
{0 CHEMBL335803,24 1,27 1,34 1,51 1,52 1,111 1,132 1,150 1,151 1,161 1,163 1,206 8.18}
{0 CHEMBL336522,24 1,47 1,51 1,52 1,132 1,150 1,151 1,161 1,163 1,187 1,206 7.32}
{0 CHEMBL336699,24 1,34 1,51 1,52 1,59 1,117 1,132 1,150 1,151 1,157 1,161 1,206 5.42}
{0 CHEMBL33676,12 1,24 1,36 1,38 1,51 1,52 1,76 1,105 1,150 1,151 1,163 1,181 1,206 8.495}
{0 CHEMBL337101,24 1,27 1,34 1,51 1,52 1,115 1,117 1,132 1,150 1,151 1,157 1,161 1,206 8.444}
{0 CHEMBL337213,24 1,47 1,51 1,52 1,132 1,150 1,151 1,161 1,163 1,187 1,206 7.42}
{0 CHEMBL33732,12 1,24 1,36 1,38 1,51 1,52 1,76 1,105 1,150 1,151 1,206 6.928}
{0 CHEMBL337324,24 1,27 1,34 1,51 1,52 1,61 1,115 1,117 1,132 1,150 1,151 1,157 1,161 1,206 7.959}
{0 CHEMBL33884,4 1,14 1,24 1,36 1,38 1,39 1,51 1,52 1,150 1,151 1,161 1,206 6}
{0 CHEMBL341474,24 1,34 1,51 1,52 1,61 1,117 1,132 1,150 1,151 1,157 1,161 1,163 1,206 9.092}
{0 CHEMBL34224,12 1,24 1,36 1,38 1,51 1,52 1,76 1,105 1,150 1,151 1,163 1,206 7.143}
{0 CHEMBL342381,24 1,34 1,38 1,42 1,51 1,52 1,115 1,132 1,150 1,151 1,157 1,161 1,163 1,206 6.983}
{0 CHEMBL342447,24 1,34 1,38 1,51 1,52 1,61 1,117 1,132 1,150 1,151 1,157 1,161 1,206 7.886}
{0 CHEMBL342574,24 1,31 1,33 1,38 1,50 1,51 1,52 1,69 1,83 1,131 1,137 1,150 1,151 1,163 1,181 1,205 1,206 7}
{0 CHEMBL342690,24 1,34 1,38 1,51 1,132 1,150 1,151 1,157 1,161 1,206 8.947}
{0 CHEMBL34291,21 1,23 1,24 1,25 1,26 1,38 1,39 1,51 1,52 1,71 1,76 1,105 1,150 1,151 1,167 1,181 1,183 1,206 6.818}
{0 CHEMBL343836,14 1,23 1,24 1,26 1,33 1,37 1,38 1,45 1,51 1,52 1,150 1,151 1,161 1,163 1,181 1,206 7}
{0 CHEMBL343919,24 1,34 1,38 1,51 1,52 1,117 1,132 1,150 1,151 1,157 1,161 1,206 7.62}
{0 CHEMBL344345,23 1,24 1,26 1,33 1,38 1,39 1,45 1,51 1,52 1,68 1,84 1,105 1,150 1,151 1,159 1,161 1,180 1,181 1,206 8.056}
{0 CHEMBL345220,23 1,24 1,26 1,33 1,38 1,45 1,51 1,52 1,85 1,105 1,150 1,151 1,161 1,167 1,206 7.301}
{0 CHEMBL345592,23 1,24 1,26 1,33 1,38 1,42 1,45 1,51 1,52 1,76 1,105 1,150 1,151 1,163 1,167 1,206 7.62}
{0 CHEMBL346272,23 1,24 1,26 1,33 1,37 1,38 1,45 1,51 1,52 1,76 1,150 1,151 1,158 1,161 1,206 7.745}
{0 CHEMBL346555,10 1,24 1,36 1,38 1,39 1,41 1,48 1,51 1,52 1,80 1,150 1,151 1,159 1,206 7.509}
{0 CHEMBL346973,23 1,24 1,26 1,33 1,38 1,42 1,45 1,51 1,52 1,76 1,105 1,150 1,151 1,163 1,167 1,206 8.071}
{0 CHEMBL347029,23 1,24 1,26 1,33 1,37 1,38 1,45 1,51 1,52 1,111 1,150 1,151 1,161 1,163 1,181 1,206 7}
{0 CHEMBL347587,23 1,24 1,26 1,33 1,38 1,45 1,51 1,52 1,76 1,105 1,150 1,151 1,161 1,167 1,206 7.481}
{0 CHEMBL347902,23 1,24 1,26 1,33 1,38 1,45 1,51 1,52 1,76 1,105 1,150 1,151 1,161 1,163 1,167 1,206 7.444}
{0 CHEMBL348156,10 1,24 1,36 1,38 1,39 1,41 1,48 1,51 1,52 1,80 1,150 1,151 1,206 8.569}
{0 CHEMBL348517,23 1,24 1,26 1,33 1,38 1,45 1,51 1,52 1,85 1,86 1,105 1,150 1,151 1,161 1,167 1,206 8.18}
{0 CHEMBL348809,23 1,24 1,26 1,33 1,38 1,45 1,51 1,52 1,110 1,149 1,150 1,151 1,154 1,161 1,163 1,181 1,206 7.097}
{0 CHEMBL349048,24 1,26 1,33 1,42 1,45 1,51 1,52 1,54 1,98 1,150 1,151 1,161 1,163 1,181 1,206 8.183}
{0 CHEMBL349050,10 1,23 1,24 1,26 1,33 1,38 1,42 1,45 1,46 1,49 1,51 1,52 1,85 1,86 1,132 1,150 1,151 1,161 1,206 9.229}
{0 CHEMBL349146,10 1,14 1,23 1,24 1,26 1,33 1,38 1,42 1,45 1,46 1,49 1,51 1,52 1,85 1,86 1,132 1,150 1,151 1,161 1,163 1,206 8.83}
{0 CHEMBL349444,23 1,24 1,26 1,33 1,38 1,39 1,45 1,51 1,52 1,76 1,110 1,150 1,151 1,161 1,206 6.378}
{0 CHEMBL349472,10 1,24 1,36 1,38 1,39 1,41 1,48 1,51 1,52 1,80 1,150 1,151 1,206 7.215}
{0 CHEMBL349542,24 1,47 1,51 1,52 1,132 1,150 1,151 1,161 1,163 1,187 1,206 6.7}
{0 CHEMBL349595,10 1,23 1,24 1,26 1,33 1,38 1,42 1,45 1,46 1,49 1,51 1,52 1,85 1,86 1,132 1,150 1,151 1,161 1,163 1,206 8.886}
{0 CHEMBL350221,3 1,5 1,8 1,11 1,13 1,17 1,24 1,30 1,33 1,38 1,42 1,51 1,150 1,151 1,167 1,180 1,181 1,195 1,206 6.8}
{0 CHEMBL350423,10 1,24 1,36 1,38 1,39 1,41 1,48 1,51 1,52 1,80 1,84 1,117 1,123 1,150 1,151 1,206 7.387}
{0 CHEMBL350489,10 1,24 1,36 1,38 1,39 1,41 1,48 1,51 1,52 1,76 1,80 1,150 1,151 1,206 7.629}
{0 CHEMBL350824,10 1,24 1,36 1,38 1,39 1,41 1,48 1,51 1,52 1,76 1,80 1,150 1,151 1,206 9.824}
{0 CHEMBL350972,24 1,36 1,38 1,51 1,52 1,110 1,150 1,151 1,161 1,163 1,181 1,206 7.553}
{0 CHEMBL351119,21 1,23 1,24 1,26 1,33 1,38 1,45 1,51 1,52 1,76 1,105 1,108 1,150 1,151 1,161 1,167 1,181 1,206 6.194}
{0 CHEMBL351217,6 1,10 1,24 1,36 1,38 1,39 1,41 1,48 1,51 1,52 1,85 1,150 1,151 1,206 7.097}
{0 CHEMBL351218,10 1,24 1,36 1,38 1,39 1,41 1,48 1,51 1,52 1,69 1,80 1,150 1,151 1,154 1,206 8.658}
{0 CHEMBL351377,10 1,23 1,24 1,26 1,33 1,38 1,42 1,45 1,46 1,49 1,51 1,52 1,85 1,86 1,132 1,150 1,151 1,161 1,163 1,206 9.119}
{0 CHEMBL351714,23 1,24 1,26 1,33 1,38 1,45 1,51 1,52 1,149 1,150 1,151 1,161 1,163 1,181 1,206 6.914}
{0 CHEMBL351752,24 1,38 1,47 1,51 1,52 1,61 1,132 1,150 1,151 1,161 1,163 1,187 1,206 6.7}
{0 CHEMBL35180,21 1,23 1,24 1,26 1,33 1,38 1,45 1,51 1,52 1,76 1,150 1,151 1,167 1,181 1,206 7.004}
{0 CHEMBL352107,24 1,35 1,38 1,47 1,51 1,52 1,61 1,132 1,150 1,151 1,161 1,163 1,187 1,206 7.852}
{0 CHEMBL352148,14 1,22 1,24 1,37 1,38 1,51 1,52 1,132 1,150 1,151 1,161 1,163 1,205 1,206 8.319}
{0 CHEMBL352411,23 1,24 1,26 1,33 1,38 1,39 1,45 1,51 1,52 1,84 1,95 1,150 1,151 1,161 1,167 1,206 9.051}
{0 CHEMBL353196,23 1,24 1,26 1,33 1,38 1,39 1,45 1,51 1,52 1,84 1,95 1,150 1,151 1,161 1,167 1,206 9.721}
{0 CHEMBL353452,23 1,24 1,26 1,33 1,38 1,39 1,45 1,51 1,52 1,76 1,84 1,150 1,151 1,206 7}
{0 CHEMBL353993,23 1,24 1,26 1,33 1,38 1,39 1,45 1,51 1,52 1,84 1,105 1,150 1,151 1,161 1,167 1,206 8.215}
{0 CHEMBL355149,23 1,24 1,26 1,33 1,38 1,45 1,51 1,52 1,110 1,150 1,151 1,161 1,163 1,181 1,206 6.979}
{0 CHEMBL356521,23 1,24 1,26 1,33 1,38 1,39 1,45 1,51 1,52 1,61 1,68 1,84 1,105 1,150 1,151 1,161 1,180 1,181 1,206 9.538}
{0 CHEMBL359246,24 1,31 1,38 1,50 1,51 1,52 1,69 1,83 1,99 1,137 1,150 1,151 1,152 1,163 1,181 1,205 1,206 6.796}
{0 CHEMBL36005,21 1,23 1,24 1,25 1,26 1,38 1,39 1,51 1,52 1,71 1,76 1,150 1,151 1,167 1,181 1,183 1,206 7.602}
{0 CHEMBL36157,23 1,24 1,26 1,31 1,33 1,38 1,51 1,52 1,150 1,151 1,163 1,167 1,176 1,181 1,190 1,206 8.69}
{0 CHEMBL361907,23 1,24 1,25 1,26 1,38 1,51 1,52 1,76 1,105 1,150 1,151 1,167 1,206 6.843}
{0 CHEMBL363595,10 1,14 1,22 1,24 1,36 1,37 1,38 1,41 1,51 1,52 1,132 1,150 1,151 1,161 1,163 1,206 9.292}
{0 CHEMBL364501,10 1,14 1,22 1,24 1,36 1,37 1,38 1,41 1,51 1,52 1,132 1,150 1,151 1,161 1,163 1,206 9.432}
{0 CHEMBL364895,14 1,22 1,24 1,37 1,38 1,51 1,52 1,132 1,150 1,151 1,161 1,163 1,206 8.569}
{0 CHEMBL364957,10 1,14 1,22 1,24 1,36 1,37 1,38 1,41 1,51 1,52 1,69 1,132 1,150 1,151 1,154 1,161 1,163 1,206 8.377}
{0 CHEMBL36497,3 1,5 1,8 1,11 1,13 1,17 1,28 1,30 1,38 1,44 1,51 1,115 1,150 1,151 1,161 1,180 1,181 1,206 5}
{0 CHEMBL365180,10 1,14 1,22 1,24 1,36 1,37 1,38 1,41 1,51 1,52 1,132 1,150 1,151 1,152 1,154 1,161 1,163 1,206 7.854}
{0 CHEMBL36552,23 1,24 1,26 1,31 1,33 1,38 1,39 1,51 1,52 1,84 1,105 1,150 1,151 1,176 1,190 1,206 6.5}
{0 CHEMBL36796,23 1,24 1,26 1,33 1,38 1,39 1,51 1,52 1,84 1,117 1,150 1,151 1,176 1,190 1,206 6.5}
{0 CHEMBL368992,23 1,24 1,26 1,33 1,38 1,39 1,45 1,51 1,52 1,84 1,150 1,151 1,161 1,167 1,206 7.523}
{0 CHEMBL371144,14 1,22 1,24 1,36 1,37 1,38 1,51 1,132 1,150 1,151 1,161 1,206 9.252}
{0 CHEMBL372203,10 1,14 1,22 1,24 1,36 1,37 1,38 1,41 1,51 1,52 1,132 1,150 1,151 1,152 1,154 1,161 1,163 1,206 8}
{0 CHEMBL372262,14 1,22 1,24 1,36 1,37 1,38 1,51 1,52 1,132 1,150 1,151 1,161 1,163 1,206 9.367}
{0 CHEMBL37239,23 1,24 1,26 1,31 1,33 1,38 1,51 1,52 1,150 1,151 1,163 1,167 1,176 1,181 1,190 1,206 9.2}
{0 CHEMBL37257,23 1,24 1,26 1,33 1,38 1,39 1,51 1,52 1,84 1,150 1,151 1,176 1,190 1,206 6.6}
{0 CHEMBL37307,23 1,24 1,26 1,31 1,33 1,38 1,39 1,51 1,52 1,84 1,105 1,150 1,151 1,167 1,176 1,190 1,206 8}
{0 CHEMBL37317,3 1,5 1,8 1,11 1,13 1,15 1,16 1,17 1,28 1,30 1,35 1,38 1,44 1,51 1,76 1,111 1,150 1,151 1,161 1,180 1,181 1,206 5}
{0 CHEMBL37333,21 1,23 1,24 1,25 1,26 1,38 1,39 1,51 1,52 1,71 1,76 1,105 1,150 1,151 1,167 1,181 1,183 1,206 7.18}
{0 CHEMBL37416,23 1,24 1,26 1,33 1,38 1,51 1,52 1,105 1,150 1,151 1,159 1,163 1,167 1,176 1,181 1,190 1,206 7}
{0 CHEMBL37419,6 1,23 1,24 1,26 1,31 1,38 1,39 1,48 1,51 1,52 1,105 1,150 1,151 1,167 1,206 7.44}
{0 CHEMBL37462,3 1,5 1,7 1,8 1,9 1,11 1,13 1,15 1,16 1,17 1,18 1,28 1,30 1,35 1,38 1,44 1,51 1,52 1,76 1,111 1,150 1,151 1,161 1,163 1,180 1,181 1,206 5.62}
{0 CHEMBL37544,21 1,23 1,24 1,25 1,26 1,38 1,39 1,51 1,52 1,71 1,76 1,105 1,150 1,151 1,167 1,181 1,183 1,206 6.77}
{0 CHEMBL38041,2 1,12 1,20 1,24 1,31 1,32 1,40 1,51 1,52 1,105 1,144 1,150 1,151 1,163 1,180 1,181 1,206 5}
{0 CHEMBL383577,21 1,24 1,36 1,39 1,51 1,52 1,71 1,150 1,151 1,161 1,181 1,193 1,203 1,206 7.699}
{0 CHEMBL38418,10 1,24 1,36 1,38 1,39 1,41 1,48 1,50 1,51 1,52 1,150 1,151 1,206 8.222}
{0 CHEMBL38465,28 1,35 1,51 1,87 1,98 1,150 1,151 1,161 1,180 1,181 1,206 8.824}
{0 CHEMBL38473,10 1,23 1,24 1,26 1,33 1,38 1,42 1,45 1,46 1,49 1,51 1,52 1,85 1,132 1,150 1,151 1,161 1,163 1,206 8.704}
{0 CHEMBL38482,3 1,5 1,8 1,11 1,13 1,17 1,28 1,30 1,38 1,44 1,51 1,115 1,150 1,151 1,161 1,180 1,181 1,206 5}
{0 CHEMBL38582,24 1,26 1,33 1,45 1,51 1,52 1,54 1,98 1,150 1,151 1,161 1,163 1,181 1,206 8.371}
{0 CHEMBL38627,20 1,24 1,25 1,38 1,41 1,50 1,51 1,52 1,53 1,56 1,69 1,137 1,150 1,151 1,163 1,190 1,206 8.409}
{0 CHEMBL38814,22 1,24 1,38 1,51 1,52 1,132 1,150 1,151 1,161 1,163 1,206 5.638}
{0 CHEMBL38843,24 1,27 1,51 1,52 1,132 1,150 1,151 1,161 1,163 1,206 7.538}
{0 CHEMBL38919,22 1,24 1,31 1,37 1,38 1,51 1,52 1,132 1,140 1,150 1,151 1,154 1,161 1,163 1,195 1,206 7.721}
{0 CHEMBL38969,10 1,23 1,24 1,26 1,33 1,38 1,42 1,45 1,46 1,49 1,51 1,52 1,85 1,86 1,132 1,150 1,151 1,161 1,163 1,206 8.796}
{0 CHEMBL38993,23 1,24 1,26 1,31 1,33 1,38 1,39 1,45 1,51 1,52 1,84 1,105 1,150 1,151 1,206 6.466}
{0 CHEMBL39,3 1,5 1,8 1,11 1,13 1,17 1,30 1,38 1,51 1,150 1,151 1,167 1,180 1,181 1,195 1,206 6.409}
{0 CHEMBL39016,10 1,23 1,24 1,26 1,33 1,38 1,42 1,45 1,46 1,49 1,51 1,52 1,85 1,86 1,132 1,150 1,151 1,161 1,163 1,206 8.886}
{0 CHEMBL39081,18 1,22 1,24 1,37 1,38 1,51 1,52 1,132 1,150 1,151 1,161 1,163 1,206 8.62}
{0 CHEMBL39109,24 1,26 1,33 1,45 1,51 1,52 1,150 1,151 1,161 1,163 1,181 1,193 1,206 5.98}
{0 CHEMBL39243,3 1,5 1,7 1,8 1,9 1,11 1,13 1,15 1,16 1,17 1,18 1,28 1,30 1,35 1,38 1,44 1,51 1,52 1,76 1,111 1,150 1,151 1,161 1,163 1,180 1,181 1,206 5.6}
{0 CHEMBL39296,3 1,5 1,7 1,8 1,9 1,11 1,13 1,15 1,16 1,17 1,18 1,28 1,30 1,35 1,38 1,44 1,51 1,52 1,111 1,150 1,151 1,161 1,163 1,180 1,181 1,206 5.4}
{0 CHEMBL39317,3 1,5 1,8 1,11 1,13 1,15 1,16 1,17 1,24 1,28 1,30 1,35 1,38 1,44 1,51 1,85 1,115 1,150 1,151 1,161 1,180 1,181 1,206 5}
{0 CHEMBL39331,3 1,5 1,8 1,11 1,13 1,15 1,16 1,17 1,24 1,28 1,30 1,31 1,35 1,38 1,44 1,51 1,105 1,115 1,150 1,151 1,161 1,180 1,181 1,206 5}
{0 CHEMBL39364,18 1,22 1,24 1,30 1,37 1,38 1,51 1,52 1,132 1,150 1,151 1,161 1,163 1,206 9.398}
{0 CHEMBL39426,23 1,24 1,26 1,31 1,33 1,38 1,39 1,51 1,52 1,84 1,105 1,150 1,151 1,176 1,190 1,206 6.5}
{0 CHEMBL39455,23 1,24 1,26 1,31 1,33 1,38 1,39 1,45 1,51 1,52 1,84 1,150 1,151 1,167 1,206 7.145}
{0 CHEMBL39479,23 1,24 1,26 1,31 1,33 1,38 1,51 1,52 1,150 1,151 1,163 1,167 1,176 1,181 1,190 1,206 8.9}
{0 CHEMBL39621,23 1,24 1,26 1,31 1,33 1,38 1,50 1,51 1,52 1,150 1,151 1,163 1,167 1,176 1,181 1,190 1,206 8.5}
{0 CHEMBL39636,3 1,5 1,8 1,11 1,13 1,15 1,16 1,17 1,28 1,30 1,35 1,38 1,44 1,51 1,111 1,150 1,151 1,161 1,180 1,181 1,206 5}
{0 CHEMBL39712,3 1,5 1,8 1,11 1,13 1,15 1,16 1,17 1,28 1,30 1,35 1,38 1,44 1,51 1,111 1,150 1,151 1,161 1,180 1,181 1,206 5}
{0 CHEMBL39934,23 1,24 1,26 1,31 1,33 1,38 1,51 1,52 1,60 1,150 1,151 1,163 1,167 1,176 1,181 1,190 1,206 8.2}
{0 CHEMBL40082,23 1,24 1,26 1,33 1,38 1,42 1,45 1,51 1,52 1,85 1,86 1,105 1,150 1,151 1,163 1,167 1,206 8.538}
{0 CHEMBL40260,8 1,11 1,13 1,24 1,28 1,30 1,51 1,73 1,87 1,112 1,150 1,151 1,161 1,171 1,180 1,181 1,206 8.481}
{0 CHEMBL40497,10 1,23 1,24 1,26 1,33 1,38 1,42 1,45 1,46 1,49 1,51 1,52 1,85 1,86 1,132 1,150 1,151 1,161 1,163 1,206 8.907}
{0 CHEMBL407493,23 1,24 1,26 1,33 1,38 1,39 1,45 1,51 1,52 1,68 1,76 1,84 1,105 1,150 1,151 1,161 1,180 1,181 1,206 9.62}
{0 CHEMBL40903,10 1,23 1,24 1,26 1,33 1,38 1,42 1,45 1,46 1,49 1,51 1,52 1,85 1,86 1,132 1,150 1,151 1,161 1,163 1,206 9.007}
{0 CHEMBL41077,8 1,11 1,13 1,24 1,28 1,30 1,35 1,51 1,87 1,112 1,150 1,151 1,161 1,180 1,181 1,206 7.848}
{0 CHEMBL41140,24 1,37 1,47 1,51 1,132 1,150 1,151 1,159 1,161 1,187 1,206 7.237}
{0 CHEMBL411467,6 1,23 1,24 1,26 1,31 1,38 1,51 1,52 1,105 1,150 1,151 1,163 1,167 1,181 1,206 7.77}
{0 CHEMBL41256,24 1,27 1,51 1,52 1,150 1,151 1,161 1,163 1,206 6.31}
{0 CHEMBL41294,23 1,24 1,26 1,33 1,38 1,39 1,45 1,51 1,52 1,84 1,150 1,151 1,206 5.724}
{0 CHEMBL41379,14 1,24 1,37 1,38 1,51 1,52 1,132 1,144 1,150 1,151 1,155 1,161 1,163 1,187 1,206 7.097}
{0 CHEMBL41414,18 1,24 1,51 1,52 1,131 1,150 1,151 1,163 1,206 5.959}
{0 CHEMBL41462,24 1,37 1,51 1,52 1,132 1,150 1,151 1,161 1,163 1,206 8.021}
{0 CHEMBL41471,20 1,24 1,25 1,38 1,41 1,50 1,51 1,52 1,53 1,56 1,69 1,137 1,150 1,151 1,163 1,190 1,206 8.523}
{0 CHEMBL41511,18 1,22 1,24 1,37 1,38 1,51 1,52 1,55 1,60 1,132 1,150 1,151 1,161 1,163 1,206 9.222}
{0 CHEMBL415300,20 1,24 1,31 1,36 1,38 1,41 1,51 1,52 1,56 1,117 1,150 1,151 1,158 1,163 1,206 7.658}
{0 CHEMBL41598,18 1,24 1,37 1,51 1,52 1,132 1,150 1,151 1,161 1,163 1,187 1,206 8.268}
{0 CHEMBL415985,2 1,7 1,12 1,18 1,19 1,24 1,29 1,31 1,38 1,43 1,51 1,52 1,150 1,151 1,206 4.699}
{0 CHEMBL416047,10 1,23 1,24 1,26 1,33 1,38 1,42 1,45 1,46 1,49 1,51 1,52 1,85 1,86 1,132 1,150 1,151 1,161 1,163 1,206 8.94}
{0 CHEMBL416172,24 1,36 1,38 1,39 1,48 1,51 1,52 1,61 1,66 1,105 1,150 1,151 1,161 1,180 1,181 1,206 8.032}
{0 CHEMBL416805,10 1,24 1,36 1,38 1,39 1,41 1,48 1,50 1,51 1,52 1,150 1,151 1,206 6.924}
{0 CHEMBL41769,12 1,24 1,36 1,38 1,39 1,48 1,51 1,52 1,76 1,105 1,150 1,151 1,206 8.444}
{0 CHEMBL417695,20 1,24 1,25 1,38 1,41 1,50 1,51 1,52 1,53 1,56 1,69 1,137 1,150 1,151 1,163 1,190 1,206 7.108}
{0 CHEMBL417706,22 1,24 1,37 1,38 1,51 1,52 1,132 1,150 1,151 1,161 1,163 1,206 8.456}
{0 CHEMBL41841,22 1,24 1,30 1,37 1,38 1,51 1,52 1,117 1,132 1,150 1,151 1,161 1,163 1,206 9.222}
{0 CHEMBL418673,6 1,24 1,31 1,33 1,34 1,51 1,52 1,85 1,150 1,151 1,163 1,206 6.361}
{0 CHEMBL418678,24 1,27 1,34 1,38 1,51 1,52 1,117 1,132 1,150 1,151 1,157 1,161 1,206 7.67}
{0 CHEMBL418786,1 1,2 1,4 1,6 1,12 1,20 1,24 1,27 1,32 1,34 1,40 1,42 1,51 1,52 1,150 1,151 1,159 1,163 1,206 6}
{0 CHEMBL418790,1 1,2 1,4 1,6 1,12 1,20 1,24 1,27 1,31 1,32 1,34 1,40 1,42 1,51 1,52 1,117 1,150 1,151 1,163 1,206 6}
{0 CHEMBL419012,24 1,31 1,38 1,51 1,52 1,55 1,105 1,137 1,150 1,151 1,152 1,163 1,181 1,206 8.585}
{0 CHEMBL419391,24 1,36 1,37 1,38 1,51 1,52 1,76 1,150 1,151 1,161 1,163 1,181 1,206 8.215}
{0 CHEMBL419496,23 1,24 1,26 1,33 1,38 1,39 1,45 1,51 1,52 1,84 1,150 1,151 1,167 1,206 9}
{0 CHEMBL419822,21 1,24 1,25 1,31 1,38 1,42 1,51 1,52 1,105 1,150 1,151 1,161 1,165 1,181 1,206 6.155}
{0 CHEMBL42,20 1,24 1,36 1,38 1,41 1,51 1,52 1,56 1,117 1,150 1,151 1,158 1,163 1,206 7.276}
{0 CHEMBL421059,24 1,34 1,51 1,52 1,132 1,150 1,151 1,157 1,161 1,206 7.292}
{0 CHEMBL421187,1 1,2 1,4 1,6 1,12 1,20 1,24 1,27 1,31 1,32 1,34 1,40 1,42 1,51 1,52 1,117 1,150 1,151 1,206 6}
{0 CHEMBL421424,14 1,24 1,38 1,51 1,98 1,150 1,151 1,161 1,180 1,181 1,206 9.481}
{0 CHEMBL422279,24 1,34 1,38 1,51 1,52 1,132 1,150 1,151 1,157 1,161 1,163 1,206 7.745}
{0 CHEMBL423504,23 1,24 1,26 1,33 1,38 1,45 1,51 1,76 1,84 1,127 1,150 1,151 1,167 1,180 1,206 7.137}
{0 CHEMBL423687,14 1,24 1,36 1,37 1,38 1,51 1,52 1,132 1,150 1,151 1,161 1,163 1,181 1,206 8.495}
{0 CHEMBL423719,24 1,27 1,34 1,51 1,52 1,59 1,115 1,117 1,132 1,150 1,151 1,157 1,161 1,206 7.222}
{0 CHEMBL423899,24 1,27 1,34 1,51 1,52 1,132 1,150 1,151 1,157 1,161 1,163 1,206 8.316}
{0 CHEMBL424117,24 1,31 1,38 1,51 1,52 1,150 1,151 1,163 1,181 1,205 1,206 8.06}
{0 CHEMBL424471,24 1,41 1,51 1,52 1,56 1,163 1,172 1,202 1,206 5.438}
{0 CHEMBL424498,23 1,24 1,26 1,33 1,38 1,39 1,45 1,51 1,52 1,68 1,76 1,84 1,105 1,150 1,151 1,161 1,180 1,181 1,206 9.377}
{0 CHEMBL424662,24 1,34 1,51 1,52 1,61 1,117 1,132 1,150 1,151 1,157 1,161 1,206 6.83}
{0 CHEMBL424950,23 1,24 1,26 1,33 1,38 1,39 1,45 1,51 1,52 1,84 1,150 1,151 1,167 1,206 8.914}
{0 CHEMBL426935,23 1,24 1,26 1,33 1,38 1,39 1,45 1,51 1,52 1,84 1,150 1,151 1,167 1,206 8.666}
{0 CHEMBL42787,23 1,24 1,26 1,33 1,38 1,45 1,51 1,52 1,76 1,105 1,150 1,151 1,158 1,167 1,206 8.288}
{0 CHEMBL42911,18 1,22 1,24 1,37 1,38 1,51 1,52 1,132 1,150 1,151 1,161 1,163 1,206 9.097}
{0 CHEMBL42912,18 1,22 1,24 1,37 1,38 1,51 1,52 1,132 1,142 1,150 1,151 1,161 1,163 1,206 9.009}
{0 CHEMBL430566,24 1,37 1,51 1,132 1,150 1,151 1,161 1,206 7.489}
{0 CHEMBL43127,23 1,24 1,26 1,31 1,33 1,38 1,39 1,45 1,51 1,52 1,84 1,105 1,150 1,151 1,167 1,206 7.631}
{0 CHEMBL431499,23 1,24 1,26 1,31 1,33 1,38 1,51 1,52 1,105 1,150 1,151 1,161 1,163 1,167 1,176 1,181 1,190 1,206 7.4}
{0 CHEMBL43187,14 1,22 1,24 1,37 1,38 1,51 1,52 1,132 1,150 1,151 1,161 1,163 1,206 7.538}
{0 CHEMBL43193,24 1,37 1,51 1,52 1,132 1,150 1,151 1,161 1,163 1,206 8.721}
{0 CHEMBL432284,10 1,23 1,24 1,26 1,33 1,38 1,42 1,45 1,46 1,49 1,51 1,52 1,85 1,86 1,132 1,150 1,151 1,161 1,163 1,206 8.678}
{0 CHEMBL43243,23 1,24 1,26 1,33 1,38 1,39 1,45 1,51 1,52 1,84 1,150 1,151 1,206 6.833}
{0 CHEMBL432483,23 1,24 1,26 1,31 1,33 1,38 1,39 1,45 1,51 1,52 1,84 1,150 1,151 1,167 1,206 7}
{0 CHEMBL43304,18 1,22 1,24 1,36 1,37 1,38 1,44 1,51 1,52 1,94 1,132 1,140 1,150 1,151 1,154 1,161 1,163 1,206 8.056}
{0 CHEMBL43305,18 1,22 1,24 1,37 1,38 1,51 1,52 1,132 1,140 1,150 1,151 1,154 1,161 1,163 1,206 7.538}
{0 CHEMBL43355,14 1,22 1,24 1,37 1,38 1,51 1,52 1,132 1,150 1,151 1,161 1,163 1,206 9.639}
{0 CHEMBL434652,14 1,23 1,24 1,26 1,27 1,33 1,37 1,38 1,45 1,51 1,52 1,150 1,151 1,161 1,163 1,181 1,206 7}
{0 CHEMBL43467,22 1,24 1,37 1,38 1,51 1,132 1,150 1,151 1,161 1,206 5.276}
{0 CHEMBL43512,24 1,37 1,51 1,52 1,132 1,150 1,151 1,161 1,163 1,187 1,206 8.745}
{0 CHEMBL435232,24 1,36 1,38 1,51 1,52 1,71 1,150 1,151 1,161 1,163 1,181 1,206 7}
{0 CHEMBL436021,23 1,24 1,26 1,33 1,38 1,45 1,51 1,52 1,76 1,105 1,150 1,151 1,161 1,167 1,206 7.432}
{0 CHEMBL436287,10 1,14 1,22 1,24 1,36 1,37 1,38 1,41 1,51 1,52 1,132 1,150 1,151 1,161 1,163 1,206 7.721}
{0 CHEMBL439630,23 1,24 1,26 1,30 1,33 1,38 1,39 1,45 1,51 1,52 1,81 1,84 1,105 1,150 1,151 1,161 1,163 1,180 1,181 1,206 8.585}
{0 CHEMBL439849,3 1,5 1,8 1,11 1,13 1,17 1,24 1,26 1,30 1,31 1,37 1,38 1,42 1,51 1,52 1,111 1,115 1,150 1,151 1,161 1,180 1,181 1,206 5.367}
{0 CHEMBL439857,14 1,22 1,24 1,36 1,37 1,38 1,51 1,52 1,132 1,150 1,151 1,161 1,163 1,206 10.097}
{0 CHEMBL441295,23 1,24 1,26 1,33 1,38 1,45 1,51 1,52 1,150 1,151 1,161 1,163 1,181 1,206 6.087}
{0 CHEMBL46,14 1,17 1,24 1,27 1,28 1,38 1,51 1,111 1,150 1,151 1,161 1,206 8.5}
{0 CHEMBL50834,3 1,5 1,7 1,8 1,9 1,11 1,13 1,15 1,16 1,17 1,18 1,28 1,30 1,35 1,38 1,51 1,52 1,111 1,137 1,150 1,151 1,161 1,163 1,180 1,181 1,184 1,206 5}
{0 CHEMBL51118,24 1,27 1,34 1,51 1,52 1,81 1,132 1,150 1,151 1,157 1,158 1,161 1,206 9.04}
{0 CHEMBL52264,3 1,5 1,7 1,8 1,9 1,11 1,13 1,15 1,16 1,17 1,18 1,28 1,30 1,35 1,38 1,51 1,52 1,111 1,150 1,151 1,161 1,163 1,180 1,181 1,189 1,206 5}
{0 CHEMBL52772,24 1,27 1,34 1,38 1,51 1,52 1,117 1,132 1,150 1,151 1,157 1,161 1,206 8.932}
{0 CHEMBL52912,3 1,5 1,7 1,8 1,9 1,11 1,13 1,17 1,18 1,30 1,38 1,51 1,52 1,98 1,111 1,150 1,151 1,161 1,163 1,180 1,181 1,206 5.9}
{0 CHEMBL53128,3 1,5 1,7 1,8 1,9 1,11 1,13 1,15 1,16 1,17 1,18 1,28 1,30 1,35 1,38 1,51 1,52 1,111 1,150 1,151 1,161 1,163 1,180 1,181 1,184 1,206 5.3}
{0 CHEMBL53325,21 1,24 1,25 1,31 1,38 1,42 1,51 1,52 1,105 1,150 1,151 1,161 1,165 1,181 1,206 6.155}
{0 CHEMBL53349,3 1,5 1,7 1,8 1,9 1,11 1,13 1,17 1,18 1,28 1,30 1,38 1,51 1,52 1,111 1,150 1,151 1,161 1,163 1,180 1,181 1,206 5.8}
{0 CHEMBL53467,3 1,5 1,7 1,8 1,9 1,11 1,13 1,17 1,18 1,30 1,38 1,51 1,52 1,111 1,150 1,151 1,161 1,163 1,166 1,180 1,181 1,184 1,206 5.5}
{0 CHEMBL53485,3 1,5 1,7 1,8 1,9 1,11 1,13 1,17 1,18 1,30 1,38 1,51 1,52 1,111 1,150 1,151 1,158 1,161 1,163 1,180 1,181 1,184 1,206 5.9}
{0 CHEMBL53573,24 1,27 1,34 1,38 1,51 1,52 1,117 1,132 1,150 1,151 1,157 1,161 1,206 8.638}
{0 CHEMBL53764,3 1,5 1,7 1,8 1,9 1,11 1,13 1,17 1,18 1,28 1,30 1,38 1,51 1,52 1,111 1,150 1,151 1,161 1,163 1,180 1,181 1,201 1,206 5.5}
{0 CHEMBL538027,14 1,23 1,24 1,26 1,33 1,38 1,39 1,45 1,51 1,52 1,84 1,150 1,151 1,161 1,206 7.4}
{0 CHEMBL538247,1 1,6 1,12 1,24 1,38 1,51 1,52 1,85 1,98 1,150 1,151 1,163 1,181 1,189 1,206 6}
{0 CHEMBL538775,23 1,24 1,26 1,33 1,38 1,39 1,45 1,51 1,52 1,84 1,141 1,150 1,151 1,206 6.3}
{0 CHEMBL539003,1 1,6 1,12 1,24 1,51 1,52 1,85 1,117 1,150 1,151 1,163 1,181 1,206 7.47}
{0 CHEMBL539005,1 1,6 1,12 1,24 1,31 1,51 1,52 1,85 1,150 1,151 1,163 1,206 6}
{0 CHEMBL539006,1 1,6 1,12 1,24 1,31 1,38 1,51 1,52 1,85 1,97 1,150 1,151 1,163 1,181 1,206 6}
{0 CHEMBL539020,10 1,24 1,36 1,38 1,39 1,41 1,48 1,50 1,51 1,52 1,150 1,151 1,206 9}
{0 CHEMBL539261,6 1,24 1,31 1,33 1,34 1,51 1,52 1,85 1,150 1,151 1,163 1,181 1,206 6}
{0 CHEMBL539262,1 1,6 1,12 1,24 1,31 1,51 1,52 1,85 1,150 1,151 1,161 1,163 1,181 1,206 8.664}
{0 CHEMBL539275,10 1,24 1,31 1,36 1,38 1,41 1,50 1,51 1,52 1,105 1,116 1,150 1,151 1,163 1,165 1,181 1,206 8}
{0 CHEMBL539785,10 1,24 1,36 1,38 1,39 1,41 1,48 1,50 1,51 1,52 1,150 1,151 1,206 8}
{0 CHEMBL540017,6 1,24 1,31 1,33 1,34 1,51 1,52 1,85 1,150 1,151 1,161 1,163 1,181 1,206 8.815}
{0 CHEMBL540040,10 1,24 1,26 1,36 1,38 1,39 1,41 1,48 1,50 1,51 1,52 1,150 1,151 1,190 1,206 8.6}
{0 CHEMBL540055,10 1,24 1,31 1,36 1,38 1,39 1,41 1,48 1,50 1,51 1,52 1,105 1,150 1,151 1,206 9.8}
{0 CHEMBL540057,10 1,24 1,36 1,38 1,39 1,41 1,48 1,50 1,51 1,52 1,150 1,151 1,206 9.5}
{0 CHEMBL540310,4 1,18 1,24 1,51 1,52 1,127 1,132 1,150 1,151 1,161 1,163 1,206 7.444}
{0 CHEMBL540547,10 1,24 1,36 1,38 1,39 1,41 1,48 1,50 1,51 1,52 1,150 1,151 1,206 8.1}
{0 CHEMBL540568,10 1,24 1,31 1,36 1,38 1,41 1,50 1,51 1,52 1,105 1,116 1,150 1,151 1,163 1,181 1,206 8.6}
{0 CHEMBL540782,1 1,6 1,12 1,19 1,24 1,31 1,38 1,51 1,52 1,85 1,150 1,151 1,181 1,206 6}
{0 CHEMBL540820,10 1,24 1,36 1,38 1,39 1,41 1,48 1,50 1,51 1,52 1,150 1,151 1,204 1,206 8.4}
{0 CHEMBL540823,14 1,23 1,24 1,26 1,27 1,33 1,38 1,39 1,45 1,51 1,52 1,84 1,150 1,151 1,161 1,206 7.9}
{0 CHEMBL54103,3 1,5 1,7 1,8 1,9 1,11 1,13 1,15 1,16 1,17 1,18 1,28 1,30 1,35 1,38 1,44 1,51 1,52 1,111 1,150 1,151 1,161 1,163 1,180 1,181 1,206 5.1}
{0 CHEMBL541040,1 1,6 1,12 1,19 1,24 1,31 1,51 1,52 1,85 1,117 1,150 1,151 1,163 1,181 1,206 7.582}
{0 CHEMBL541283,1 1,6 1,12 1,24 1,31 1,51 1,52 1,85 1,150 1,151 1,163 1,181 1,206 6}
{0 CHEMBL541843,23 1,24 1,26 1,31 1,33 1,38 1,39 1,45 1,51 1,52 1,84 1,105 1,150 1,151 1,206 6.4}
{0 CHEMBL541844,10 1,24 1,36 1,38 1,39 1,41 1,48 1,50 1,51 1,52 1,150 1,151 1,206 7.6}
{0 CHEMBL542090,23 1,24 1,26 1,31 1,33 1,38 1,51 1,52 1,150 1,151 1,161 1,163 1,167 1,176 1,181 1,190 1,206 7.5}
{0 CHEMBL542634,1 1,6 1,12 1,24 1,31 1,51 1,52 1,76 1,85 1,150 1,151 1,163 1,181 1,206 6}
{0 CHEMBL54265,3 1,5 1,7 1,8 1,9 1,11 1,13 1,17 1,18 1,30 1,38 1,51 1,52 1,150 1,151 1,161 1,163 1,179 1,180 1,181 1,206 5}
{0 CHEMBL542668,10 1,24 1,31 1,36 1,38 1,39 1,41 1,48 1,51 1,52 1,105 1,150 1,151 1,206 6.8}
{0 CHEMBL542669,10 1,24 1,31 1,36 1,38 1,39 1,41 1,48 1,50 1,51 1,52 1,105 1,150 1,151 1,165 1,206 9.7}
{0 CHEMBL542869,1 1,6 1,12 1,24 1,31 1,32 1,38 1,51 1,52 1,75 1,85 1,150 1,151 1,163 1,181 1,206 8.1}
{0 CHEMBL542900,10 1,24 1,36 1,38 1,39 1,41 1,48 1,50 1,51 1,52 1,150 1,151 1,206 9.7}
{0 CHEMBL542903,10 1,24 1,36 1,38 1,39 1,41 1,48 1,50 1,51 1,52 1,150 1,151 1,161 1,206 9.4}
{0 CHEMBL542904,10 1,24 1,36 1,38 1,39 1,41 1,48 1,50 1,51 1,52 1,150 1,151 1,206 9.7}
{0 CHEMBL543136,10 1,24 1,36 1,38 1,39 1,41 1,48 1,50 1,51 1,52 1,150 1,151 1,206 8.4}
{0 CHEMBL543160,24 1,51 1,52 1,132 1,150 1,151 1,161 1,163 1,206 6.432}
{0 CHEMBL543340,2 1,12 1,20 1,24 1,31 1,43 1,51 1,52 1,150 1,151 1,162 1,163 1,181 1,206 7.921}
{0 CHEMBL543769,23 1,24 1,26 1,33 1,38 1,51 1,52 1,150 1,151 1,163 1,176 1,181 1,190 1,206 7.9}
{0 CHEMBL544002,23 1,24 1,26 1,31 1,33 1,38 1,51 1,52 1,150 1,151 1,163 1,167 1,176 1,181 1,190 1,206 8.699}
{0 CHEMBL544244,23 1,24 1,26 1,31 1,33 1,38 1,51 1,52 1,105 1,150 1,151 1,163 1,167 1,176 1,181 1,190 1,206 8.6}
{0 CHEMBL544476,23 1,24 1,26 1,33 1,38 1,39 1,51 1,52 1,84 1,150 1,151 1,176 1,190 1,206 6.7}
{0 CHEMBL544755,1 1,2 1,6 1,12 1,20 1,24 1,31 1,33 1,34 1,51 1,52 1,75 1,150 1,151 1,163 1,181 1,206 8.638}
{0 CHEMBL544784,10 1,24 1,36 1,38 1,39 1,41 1,48 1,50 1,51 1,52 1,150 1,151 1,206 9.8}
{0 CHEMBL544785,14 1,23 1,24 1,26 1,27 1,33 1,38 1,39 1,45 1,51 1,52 1,84 1,150 1,151 1,161 1,206 8.6}
{0 CHEMBL544944,23 1,24 1,26 1,33 1,38 1,51 1,52 1,76 1,105 1,150 1,151 1,163 1,167 1,176 1,181 1,190 1,206 7.1}
{0 CHEMBL544952,23 1,24 1,26 1,31 1,33 1,38 1,51 1,52 1,105 1,117 1,150 1,151 1,163 1,167 1,176 1,181 1,190 1,206 7.33}
{0 CHEMBL545449,2 1,12 1,20 1,24 1,31 1,51 1,52 1,75 1,150 1,151 1,162 1,163 1,181 1,206 7.745}
{0 CHEMBL545506,24 1,47 1,51 1,52 1,132 1,150 1,151 1,161 1,163 1,206 6.372}
{0 CHEMBL545717,10 1,24 1,36 1,38 1,39 1,41 1,48 1,50 1,51 1,52 1,150 1,151 1,206 8.6}
{0 CHEMBL545719,10 1,24 1,36 1,38 1,39 1,41 1,48 1,50 1,51 1,52 1,150 1,151 1,206 9.2}
{0 CHEMBL54720,24 1,27 1,34 1,38 1,51 1,52 1,117 1,132 1,150 1,151 1,157 1,161 1,206 8.851}
{0 CHEMBL54914,24 1,27 1,34 1,51 1,52 1,132 1,150 1,151 1,157 1,161 1,163 1,206 8.268}
{0 CHEMBL552824,1 1,6 1,12 1,24 1,31 1,51 1,85 1,100 1,150 1,151 1,206 7.14}
{0 CHEMBL552854,1 1,6 1,12 1,24 1,31 1,51 1,52 1,85 1,105 1,150 1,151 1,162 1,163 1,181 1,206 6}
{0 CHEMBL553266,1 1,6 1,12 1,24 1,31 1,51 1,52 1,85 1,150 1,151 1,163 1,181 1,206 6}
{0 CHEMBL553733,10 1,24 1,36 1,38 1,39 1,41 1,48 1,50 1,51 1,52 1,117 1,150 1,151 1,206 8.6}
{0 CHEMBL554259,10 1,24 1,31 1,36 1,38 1,39 1,41 1,48 1,50 1,51 1,52 1,105 1,150 1,151 1,165 1,206 7.9}
{0 CHEMBL554341,10 1,24 1,36 1,38 1,39 1,41 1,48 1,50 1,51 1,52 1,150 1,151 1,204 1,206 8}
{0 CHEMBL554389,1 1,6 1,12 1,24 1,31 1,39 1,48 1,51 1,52 1,85 1,150 1,151 1,206 7.788}
{0 CHEMBL554755,1 1,6 1,12 1,19 1,24 1,31 1,51 1,52 1,85 1,117 1,150 1,151 1,163 1,181 1,206 6}
{0 CHEMBL554844,1 1,6 1,12 1,24 1,31 1,51 1,52 1,85 1,150 1,151 1,206 6}
{0 CHEMBL554984,23 1,24 1,26 1,33 1,38 1,39 1,45 1,51 1,52 1,84 1,117 1,150 1,151 1,206 5.561}
{0 CHEMBL555038,10 1,24 1,36 1,38 1,39 1,41 1,48 1,50 1,51 1,52 1,150 1,151 1,206 9.2}
{0 CHEMBL555068,10 1,24 1,36 1,38 1,39 1,41 1,48 1,50 1,51 1,52 1,150 1,151 1,206 9.5}
{0 CHEMBL555080,23 1,24 1,26 1,33 1,38 1,39 1,45 1,51 1,52 1,84 1,150 1,151 1,206 6.2}
{0 CHEMBL555088,1 1,6 1,12 1,24 1,38 1,51 1,52 1,85 1,150 1,151 1,163 1,181 1,206 6}
{0 CHEMBL555199,14 1,23 1,24 1,26 1,33 1,38 1,39 1,45 1,51 1,52 1,84 1,150 1,151 1,161 1,206 8.7}
{0 CHEMBL555402,23 1,24 1,26 1,33 1,38 1,39 1,45 1,51 1,52 1,84 1,150 1,151 1,206 6.7}
{0 CHEMBL555523,23 1,24 1,26 1,33 1,38 1,39 1,45 1,51 1,52 1,84 1,141 1,150 1,151 1,206 6.8}
{0 CHEMBL555557,23 1,24 1,26 1,33 1,38 1,51 1,52 1,76 1,105 1,150 1,151 1,163 1,167 1,174 1,176 1,181 1,190 1,206 6.8}
{0 CHEMBL555582,10 1,24 1,36 1,38 1,39 1,41 1,48 1,50 1,51 1,52 1,150 1,151 1,206 8.3}
{0 CHEMBL555791,1 1,6 1,12 1,24 1,31 1,51 1,52 1,71 1,85 1,150 1,151 1,181 1,206 6}
{0 CHEMBL555955,4 1,24 1,51 1,52 1,91 1,132 1,150 1,151 1,161 1,163 1,206 8}
{0 CHEMBL555995,1 1,6 1,12 1,24 1,38 1,51 1,52 1,85 1,150 1,151 1,163 1,181 1,206 6.514}
{0 CHEMBL556193,5 1,8 1,11 1,13 1,17 1,24 1,30 1,36 1,38 1,51 1,52 1,76 1,150 1,151 1,163 1,180 1,181 1,206 8.78}
{0 CHEMBL56,21 1,38 1,51 1,52 1,57 1,150 1,151 1,181 1,206 8.921}
{0 CHEMBL56564,5 1,8 1,11 1,13 1,17 1,24 1,30 1,36 1,38 1,51 1,52 1,150 1,151 1,163 1,180 1,181 1,206 8.734}
{0 CHEMBL56900,24 1,38 1,51 1,88 1,144 1,150 1,151 1,161 1,203 1,206 9.2}
{0 CHEMBL56994,23 1,24 1,26 1,33 1,38 1,45 1,51 1,52 1,76 1,105 1,150 1,151 1,158 1,163 1,167 1,181 1,206 4.763}
{0 CHEMBL57686,23 1,24 1,26 1,33 1,38 1,45 1,51 1,52 1,76 1,105 1,150 1,151 1,163 1,167 1,181 1,206 6.485}
{0 CHEMBL59689,24 1,38 1,51 1,88 1,144 1,150 1,151 1,161 1,167 1,203 1,206 9}
{0 CHEMBL59834,1 1,2 1,6 1,12 1,20 1,24 1,31 1,32 1,33 1,34 1,40 1,51 1,52 1,150 1,151 1,163 1,181 1,206 8.8}
{0 CHEMBL59871,22 1,24 1,31 1,37 1,38 1,51 1,132 1,150 1,151 1,161 1,195 1,206 7.91}
{0 CHEMBL60102,24 1,51 1,88 1,150 1,151 1,161 1,203 1,206 8.8}
{0 CHEMBL60103,24 1,51 1,88 1,150 1,151 1,161 1,203 1,206 8}
{0 CHEMBL60889,23 1,24 1,26 1,38 1,51 1,52 1,76 1,117 1,150 1,151 1,167 1,206 5.925}
{0 CHEMBL609962,12 1,24 1,31 1,41 1,51 1,98 1,150 1,151 1,154 1,159 1,161 1,180 1,181 1,206 8.18}
{0 CHEMBL61007,24 1,37 1,51 1,132 1,150 1,151 1,161 1,206 6.883}
{0 CHEMBL62023,1 1,2 1,6 1,12 1,20 1,24 1,31 1,33 1,34 1,51 1,52 1,75 1,150 1,151 1,163 1,181 1,206 8.4}
{0 CHEMBL62270,24 1,51 1,88 1,150 1,151 1,161 1,203 1,206 7.3}
{0 CHEMBL62274,24 1,27 1,34 1,51 1,52 1,81 1,132 1,150 1,151 1,157 1,158 1,161 1,206 8.58}
{0 CHEMBL62366,24 1,34 1,51 1,52 1,129 1,132 1,150 1,151 1,157 1,161 1,163 1,179 1,206 4.72}
{0 CHEMBL62445,24 1,34 1,51 1,129 1,132 1,150 1,151 1,157 1,161 1,179 1,206 5.61}
{0 CHEMBL62449,22 1,24 1,31 1,37 1,38 1,51 1,52 1,132 1,140 1,150 1,151 1,154 1,161 1,195 1,206 7.272}
{0 CHEMBL62451,14 1,22 1,24 1,37 1,38 1,51 1,52 1,132 1,150 1,151 1,154 1,161 1,163 1,206 9.4}
{0 CHEMBL62452,14 1,22 1,24 1,37 1,38 1,51 1,52 1,132 1,150 1,151 1,161 1,163 1,206 9.27}
{0 CHEMBL62589,22 1,24 1,31 1,37 1,38 1,51 1,52 1,132 1,150 1,151 1,161 1,163 1,195 1,206 8.42}
{0 CHEMBL62612,24 1,31 1,34 1,38 1,51 1,52 1,117 1,132 1,150 1,151 1,157 1,161 1,206 5.44}
{0 CHEMBL62636,22 1,24 1,37 1,38 1,51 1,132 1,150 1,151 1,161 1,206 8.269}
{0 CHEMBL62692,24 1,38 1,51 1,88 1,144 1,150 1,151 1,161 1,167 1,203 1,206 9.5}
{0 CHEMBL62778,24 1,27 1,31 1,38 1,51 1,88 1,105 1,144 1,150 1,151 1,161 1,203 1,206 7.2}
{0 CHEMBL62890,9 1,14 1,24 1,37 1,51 1,52 1,132 1,150 1,151 1,161 1,163 1,206 5}
{0 CHEMBL62902,18 1,24 1,31 1,34 1,38 1,51 1,97 1,132 1,150 1,151 1,157 1,161 1,206 5.53}
{0 CHEMBL62911,24 1,27 1,34 1,38 1,51 1,127 1,132 1,150 1,151 1,157 1,161 1,206 6.9}
{0 CHEMBL63024,9 1,14 1,24 1,31 1,37 1,38 1,51 1,52 1,132 1,140 1,150 1,151 1,154 1,161 1,163 1,195 1,206 5}
{0 CHEMBL63025,24 1,38 1,51 1,61 1,88 1,117 1,144 1,150 1,151 1,161 1,203 1,206 9.5}
{0 CHEMBL63091,7 1,14 1,18 1,22 1,24 1,37 1,38 1,51 1,52 1,54 1,132 1,150 1,151 1,161 1,163 1,206 8.5}
{0 CHEMBL63114,24 1,27 1,34 1,51 1,132 1,150 1,151 1,157 1,161 1,205 1,206 4.14}
{0 CHEMBL63409,1 1,6 1,12 1,24 1,31 1,51 1,85 1,126 1,127 1,150 1,151 1,206 7.474}
{0 CHEMBL63588,24 1,27 1,34 1,38 1,51 1,132 1,150 1,151 1,157 1,161 1,205 1,206 4}
{0 CHEMBL63621,1 1,6 1,12 1,24 1,31 1,41 1,51 1,52 1,85 1,116 1,123 1,150 1,151 1,161 1,163 1,181 1,206 6}
{0 CHEMBL63742,1 1,2 1,6 1,12 1,20 1,24 1,31 1,33 1,34 1,43 1,51 1,52 1,150 1,151 1,161 1,163 1,181 1,206 9.051}
{0 CHEMBL63790,19 1,24 1,27 1,31 1,34 1,38 1,51 1,52 1,117 1,132 1,134 1,150 1,151 1,157 1,161 1,206 8.59}
{0 CHEMBL63845,24 1,27 1,31 1,34 1,38 1,51 1,97 1,132 1,150 1,151 1,157 1,161 1,206 4.13}
{0 CHEMBL63891,6 1,24 1,31 1,33 1,34 1,51 1,52 1,76 1,85 1,150 1,151 1,158 1,206 7.695}
{0 CHEMBL63905,24 1,27 1,31 1,34 1,51 1,117 1,132 1,150 1,151 1,157 1,161 1,206 4.01}
{0 CHEMBL64060,24 1,31 1,38 1,51 1,88 1,105 1,144 1,150 1,151 1,161 1,203 1,206 6.7}
{0 CHEMBL64078,14 1,22 1,24 1,37 1,38 1,51 1,52 1,132 1,150 1,151 1,161 1,163 1,206 9.62}
{0 CHEMBL64079,9 1,14 1,24 1,37 1,38 1,51 1,52 1,132 1,150 1,151 1,161 1,163 1,206 5}
{0 CHEMBL64145,9 1,14 1,24 1,37 1,51 1,52 1,132 1,150 1,151 1,161 1,163 1,206 6.389}
{0 CHEMBL64146,24 1,37 1,51 1,52 1,132 1,150 1,151 1,161 1,206 7.281}
{0 CHEMBL64279,14 1,22 1,24 1,37 1,38 1,51 1,132 1,150 1,151 1,161 1,206 8.77}
{0 CHEMBL6437,24 1,31 1,35 1,38 1,51 1,52 1,57 1,150 1,151 1,163 1,191 1,206 7.155}
{0 CHEMBL64416,22 1,24 1,37 1,38 1,51 1,52 1,132 1,150 1,151 1,161 1,206 8.099}
{0 CHEMBL64489,24 1,38 1,51 1,61 1,88 1,144 1,150 1,151 1,161 1,203 1,206 8.5}
{0 CHEMBL64727,24 1,27 1,34 1,38 1,51 1,52 1,117 1,132 1,140 1,150 1,151 1,157 1,161 1,206 5.38}
{0 CHEMBL64782,24 1,38 1,51 1,88 1,150 1,151 1,161 1,203 1,206 7.1}
{0 CHEMBL64801,24 1,27 1,31 1,38 1,51 1,88 1,105 1,144 1,150 1,151 1,161 1,203 1,206 8.4}
{0 CHEMBL64879,22 1,24 1,31 1,37 1,38 1,51 1,132 1,140 1,150 1,151 1,154 1,161 1,195 1,206 7.94}
{0 CHEMBL64880,24 1,38 1,51 1,88 1,144 1,150 1,151 1,161 1,203 1,206 8.7}
{0 CHEMBL64903,27 1,34 1,38 1,42 1,51 1,52 1,117 1,150 1,151 1,157 1,161 1,206 4.74}
{0 CHEMBL64948,24 1,27 1,34 1,51 1,52 1,132 1,150 1,151 1,157 1,161 1,206 7.22}
{0 CHEMBL64986,6 1,24 1,31 1,33 1,34 1,39 1,51 1,52 1,84 1,85 1,150 1,151 1,206 8.684}
{0 CHEMBL65212,24 1,27 1,34 1,51 1,132 1,143 1,150 1,151 1,157 1,161 1,205 1,206 4}
{0 CHEMBL65226,6 1,24 1,31 1,33 1,34 1,51 1,52 1,85 1,150 1,151 1,161 1,163 1,181 1,206 6.886}
{0 CHEMBL65413,24 1,27 1,34 1,38 1,51 1,52 1,117 1,132 1,150 1,151 1,157 1,161 1,206 5.93}
{0 CHEMBL65669,24 1,34 1,51 1,52 1,129 1,132 1,150 1,151 1,157 1,161 1,163 1,179 1,206 4.67}
{0 CHEMBL65710,24 1,27 1,34 1,38 1,51 1,52 1,117 1,132 1,150 1,151 1,157 1,161 1,206 8.34}
{0 CHEMBL65736,24 1,27 1,34 1,51 1,52 1,76 1,132 1,150 1,151 1,157 1,161 1,206 7.22}
{0 CHEMBL65974,24 1,27 1,34 1,51 1,52 1,132 1,150 1,151 1,157 1,161 1,163 1,206 6.09}
{0 CHEMBL66307,24 1,27 1,34 1,38 1,51 1,52 1,117 1,132 1,150 1,151 1,157 1,161 1,206 5.86}
{0 CHEMBL66408,24 1,34 1,38 1,51 1,52 1,117 1,129 1,132 1,150 1,151 1,157 1,161 1,179 1,206 4.4}
{0 CHEMBL66972,6 1,19 1,24 1,31 1,33 1,34 1,38 1,51 1,52 1,85 1,150 1,151 1,181 1,206 6}
{0 CHEMBL67403,1 1,4 1,6 1,12 1,24 1,31 1,51 1,52 1,85 1,150 1,151 1,163 1,181 1,206 6}
{0 CHEMBL67555,23 1,24 1,26 1,38 1,51 1,52 1,76 1,105 1,113 1,150 1,151 1,167 1,206 8.301}
{0 CHEMBL68348,1 1,6 1,12 1,24 1,31 1,51 1,52 1,85 1,105 1,150 1,151 1,163 1,181 1,206 6}
{0 CHEMBL68390,24 1,27 1,31 1,34 1,38 1,51 1,97 1,132 1,150 1,151 1,157 1,161 1,206 5.8}
{0 CHEMBL73538,20 1,24 1,31 1,36 1,38 1,41 1,51 1,52 1,56 1,150 1,151 1,158 1,163 1,206 7.398}
{0 CHEMBL73854,21 1,24 1,25 1,31 1,38 1,42 1,51 1,52 1,105 1,150 1,151 1,161 1,165 1,181 1,206 6.155}
{0 CHEMBL73964,21 1,25 1,38 1,42 1,51 1,52 1,150 1,151 1,161 1,167 1,181 1,206 6.155}
{0 CHEMBL74080,21 1,25 1,38 1,42 1,51 1,52 1,150 1,151 1,161 1,181 1,206 6.155}
{0 CHEMBL7430,35 1,38 1,39 1,51 1,52 1,57 1,117 1,150 1,151 1,163 1,204 1,206 7.387}
{0 CHEMBL74723,21 1,25 1,38 1,42 1,51 1,52 1,57 1,150 1,151 1,161 1,181 1,206 6.155}
{0 CHEMBL74811,21 1,24 1,25 1,31 1,38 1,42 1,51 1,52 1,105 1,150 1,151 1,161 1,165 1,181 1,206 6.155}
{0 CHEMBL74858,21 1,24 1,25 1,31 1,38 1,42 1,51 1,52 1,105 1,150 1,151 1,161 1,165 1,181 1,206 6.155}
{0 CHEMBL75228,7 1,18 1,38 1,51 1,52 1,150 1,151 1,161 1,206 6.155}
{0 CHEMBL75286,3 1,21 1,24 1,31 1,38 1,42 1,51 1,52 1,105 1,150 1,151 1,161 1,181 1,206 6.155}
{0 CHEMBL75372,21 1,38 1,42 1,51 1,52 1,150 1,151 1,161 1,181 1,206 6.155}
{0 CHEMBL75444,21 1,24 1,25 1,31 1,38 1,42 1,51 1,52 1,105 1,150 1,151 1,161 1,181 1,206 6.155}
{0 CHEMBL75480,21 1,38 1,42 1,51 1,52 1,150 1,151 1,161 1,181 1,206 6.155}
{0 CHEMBL75608,21 1,25 1,38 1,42 1,51 1,52 1,150 1,151 1,161 1,181 1,206 6.155}
{0 CHEMBL75878,21 1,24 1,25 1,31 1,38 1,42 1,51 1,52 1,54 1,105 1,150 1,151 1,161 1,165 1,181 1,206 6.155}
{0 CHEMBL7617,24 1,35 1,38 1,41 1,51 1,52 1,56 1,57 1,117 1,150 1,151 1,163 1,204 1,206 7.31}
{0 CHEMBL76601,22 1,24 1,26 1,33 1,45 1,51 1,52 1,150 1,151 1,161 1,163 1,181 1,193 1,203 1,206 8.5}
{0 CHEMBL76758,21 1,25 1,38 1,42 1,51 1,52 1,150 1,151 1,161 1,181 1,206 6.155}
{0 CHEMBL77220,21 1,24 1,25 1,31 1,38 1,42 1,51 1,52 1,105 1,150 1,151 1,161 1,165 1,181 1,206 6.155}
{0 CHEMBL77906,21 1,24 1,25 1,31 1,38 1,42 1,51 1,52 1,105 1,150 1,151 1,161 1,181 1,206 6.155}
{0 CHEMBL7828,12 1,24 1,31 1,36 1,38 1,41 1,51 1,52 1,56 1,117 1,145 1,150 1,151 1,163 1,206 7.409}
{0 CHEMBL78509,6 1,24 1,31 1,33 1,34 1,38 1,41 1,51 1,52 1,67 1,150 1,151 1,163 1,181 1,206 8.4}
{0 CHEMBL79156,6 1,24 1,31 1,33 1,34 1,38 1,42 1,51 1,52 1,67 1,150 1,151 1,163 1,181 1,206 9}
{0 CHEMBL80249,6 1,21 1,22 1,24 1,31 1,33 1,34 1,38 1,51 1,52 1,67 1,108 1,150 1,151 1,163 1,181 1,206 8.9}
{0 CHEMBL80306,6 1,22 1,24 1,31 1,33 1,34 1,38 1,51 1,52 1,67 1,150 1,151 1,163 1,181 1,206 7.7}
{0 CHEMBL80417,22 1,24 1,26 1,33 1,45 1,51 1,52 1,150 1,151 1,161 1,163 1,181 1,193 1,203 1,206 8.6}
{0 CHEMBL80889,21 1,22 1,24 1,26 1,33 1,45 1,51 1,52 1,108 1,150 1,151 1,161 1,163 1,181 1,193 1,203 1,206 9.1}
{0 CHEMBL82138,24 1,51 1,52 1,150 1,151 1,161 1,163 1,181 1,206 8.161}
{0 CHEMBL84290,24 1,37 1,47 1,51 1,52 1,132 1,150 1,151 1,161 1,163 1,181 1,206 7.402}
{0 CHEMBL86,4 1,23 1,24 1,26 1,38 1,51 1,52 1,76 1,105 1,150 1,151 1,167 1,206 6.458}
{0 CHEMBL88263,23 1,24 1,26 1,33 1,38 1,39 1,45 1,51 1,52 1,76 1,84 1,150 1,151 1,167 1,206 9}
{0 CHEMBL88310,23 1,24 1,26 1,33 1,38 1,39 1,45 1,51 1,52 1,84 1,150 1,151 1,167 1,206 9}
{0 CHEMBL88464,24 1,31 1,38 1,41 1,51 1,52 1,56 1,117 1,145 1,150 1,151 1,163 1,206 7.244}
{0 CHEMBL88565,10 1,24 1,36 1,38 1,41 1,50 1,51 1,52 1,116 1,150 1,151 1,163 1,181 1,206 9.1}
{0 CHEMBL88867,4 1,23 1,24 1,26 1,38 1,51 1,52 1,76 1,150 1,151 1,161 1,167 1,206 6.42}
{0 CHEMBL88870,24 1,26 1,38 1,41 1,50 1,51 1,52 1,56 1,117 1,150 1,151 1,163 1,204 1,206 7.092}
{0 CHEMBL88973,12 1,24 1,36 1,38 1,51 1,52 1,76 1,150 1,151 1,161 1,206 6.959}
{0 CHEMBL89259,23 1,24 1,26 1,33 1,38 1,39 1,45 1,51 1,52 1,76 1,84 1,150 1,151 1,167 1,206 9}
{0 CHEMBL89970,24 1,31 1,38 1,41 1,51 1,52 1,56 1,117 1,145 1,150 1,151 1,163 1,206 7.387}
{0 CHEMBL905,3 1,5 1,7 1,8 1,9 1,11 1,13 1,17 1,18 1,30 1,38 1,51 1,52 1,111 1,150 1,151 1,161 1,163 1,180 1,181 1,206 5.4}
{0 CHEMBL90769,24 1,42 1,51 1,52 1,81 1,132 1,150 1,151 1,158 1,161 1,206 8.097}
{0 CHEMBL90882,24 1,31 1,38 1,41 1,51 1,52 1,56 1,117 1,145 1,150 1,151 1,163 1,206 7.076}
{0 CHEMBL90977,24 1,26 1,37 1,38 1,41 1,51 1,52 1,56 1,117 1,150 1,151 1,163 1,204 1,206 7.456}
{0 CHEMBL91147,23 1,24 1,26 1,33 1,38 1,39 1,45 1,51 1,52 1,76 1,84 1,150 1,151 1,167 1,206 10}
{0 CHEMBL91310,24 1,26 1,38 1,41 1,51 1,52 1,56 1,117 1,150 1,151 1,163 1,204 1,206 7.509}
{0 CHEMBL91379,23 1,24 1,26 1,33 1,38 1,39 1,45 1,51 1,52 1,84 1,150 1,151 1,167 1,206 8.854}
{0 CHEMBL91771,23 1,24 1,25 1,26 1,38 1,39 1,51 1,52 1,76 1,150 1,151 1,167 1,206 7.244}
{0 CHEMBL91841,23 1,24 1,26 1,33 1,38 1,39 1,45 1,51 1,52 1,84 1,150 1,151 1,167 1,206 7.854}
{0 CHEMBL91842,12 1,24 1,36 1,38 1,51 1,52 1,76 1,150 1,151 1,161 1,206 5.928}
{0 CHEMBL92100,12 1,24 1,36 1,38 1,39 1,48 1,51 1,52 1,76 1,150 1,151 1,206 9.699}
{0 CHEMBL92529,24 1,42 1,51 1,52 1,132 1,150 1,151 1,161 1,206 7}
{0 CHEMBL92871,24 1,42 1,51 1,52 1,132 1,150 1,151 1,161 1,206 7.046}
{0 CHEMBL93611,1 1,2 1,4 1,6 1,12 1,20 1,24 1,27 1,31 1,34 1,42 1,51 1,52 1,75 1,150 1,151 1,206 6}
{0 CHEMBL95235,1 1,2 1,4 1,6 1,12 1,20 1,21 1,24 1,27 1,31 1,32 1,34 1,40 1,42 1,51 1,52 1,108 1,150 1,151 1,181 1,206 6}
{0 CHEMBL95661,1 1,2 1,4 1,6 1,12 1,20 1,24 1,27 1,31 1,32 1,34 1,42 1,51 1,52 1,150 1,151 1,206 6}
{0 CHEMBL95685,1 1,2 1,4 1,6 1,12 1,20 1,24 1,27 1,32 1,34 1,40 1,42 1,51 1,52 1,76 1,150 1,151 1,163 1,206 6}
{0 CHEMBL95808,1 1,2 1,4 1,6 1,12 1,20 1,24 1,27 1,31 1,32 1,34 1,40 1,42 1,51 1,52 1,150 1,151 1,206 6}
{0 CHEMBL95968,1 1,2 1,4 1,6 1,12 1,20 1,24 1,27 1,31 1,32 1,34 1,40 1,51 1,52 1,127 1,150 1,151 1,206 6}
{0 CHEMBL96960,1 1,2 1,6 1,12 1,20 1,24 1,31 1,32 1,34 1,40 1,42 1,51 1,52 1,150 1,151 1,163 1,198 1,206 6.51}
{0 CHEMBL97019,1 1,2 1,4 1,6 1,12 1,20 1,21 1,24 1,27 1,31 1,32 1,34 1,42 1,51 1,52 1,108 1,150 1,151 1,181 1,206 6}
{0 CHEMBL97450,3 1,5 1,8 1,11 1,13 1,17 1,24 1,30 1,31 1,38 1,51 1,150 1,151 1,161 1,180 1,181 1,206 6}
{0 CHEMBL97508,1 1,2 1,4 1,6 1,12 1,20 1,24 1,27 1,31 1,34 1,42 1,51 1,52 1,150 1,151 1,163 1,205 1,206 6}
{0 CHEMBL97755,1 1,2 1,4 1,6 1,12 1,20 1,24 1,27 1,31 1,32 1,34 1,42 1,51 1,52 1,150 1,151 1,206 6}
{0 CHEMBL97903,1 1,2 1,4 1,6 1,12 1,20 1,24 1,27 1,31 1,32 1,34 1,40 1,51 1,52 1,127 1,150 1,151 1,206 6}
{0 CHEMBL99096,1 1,2 1,4 1,6 1,12 1,20 1,24 1,27 1,31 1,34 1,38 1,42 1,51 1,52 1,150 1,151 1,152 1,154 1,163 1,186 1,206 6}
{0 CHEMBL99141,1 1,2 1,4 1,6 1,12 1,20 1,24 1,27 1,31 1,32 1,34 1,38 1,40 1,42 1,51 1,52 1,117 1,150 1,151 1,206 6}
{0 CHEMBL99147,1 1,2 1,4 1,6 1,12 1,20 1,21 1,24 1,27 1,31 1,34 1,42 1,51 1,52 1,75 1,108 1,150 1,151 1,181 1,206 6}
{0 CHEMBL99299,1 1,2 1,4 1,6 1,12 1,20 1,24 1,27 1,31 1,32 1,34 1,40 1,51 1,52 1,127 1,150 1,151 1,206 6}
{0 CHEMBL99383,1 1,2 1,4 1,6 1,12 1,20 1,24 1,27 1,31 1,34 1,42 1,51 1,52 1,150 1,151 1,163 1,206 6}
{0 CHEMBL99452,1 1,2 1,6 1,12 1,20 1,24 1,31 1,32 1,34 1,42 1,51 1,52 1,150 1,151 1,163 1,198 1,206 6}
{0 CHEMBL99515,1 1,2 1,4 1,6 1,12 1,20 1,24 1,27 1,31 1,34 1,42 1,51 1,52 1,75 1,150 1,151 1,163 1,206 6}
{0 CHEMBL99577,4 1,6 1,24 1,27 1,31 1,34 1,42 1,51 1,52 1,85 1,150 1,151 1,163 1,206 6}
{0 CHEMBL99578,1 1,2 1,4 1,6 1,12 1,20 1,24 1,27 1,31 1,34 1,42 1,43 1,51 1,52 1,150 1,151 1,163 1,206 6}
{0 CHEMBL99590,1 1,2 1,4 1,6 1,12 1,20 1,24 1,27 1,31 1,32 1,34 1,42 1,51 1,52 1,150 1,151 1,163 1,206 6}
{0 CHEMBL99591,1 1,2 1,4 1,6 1,12 1,20 1,24 1,27 1,31 1,32 1,34 1,40 1,42 1,51 1,52 1,150 1,151 1,163 1,206 6}
{0 CHEMBL99723,1 1,2 1,6 1,12 1,20 1,24 1,27 1,31 1,32 1,34 1,42 1,51 1,52 1,100 1,150 1,151 1,163 1,168 1,206 6}
