{
  "data_set_description": {
    "collection_date": "November 2013",
    "creator": "Dr Jeremy Besnard, Dr Ivan Olier, Dr Noureddin Sadawi, Dr Larisa Soldatova, Dr Crina Grosan, Prof Ross King, Dr Richard Bickerton, Prof Andrew Hopkins and Dr Willem van Hoorn",
    "default_target_attribute": "pXC50",
    "description": "This dataset contains QSAR data (from ChEMBL version 17) showing activity values (unit is pseudo-pCI50) of several compounds on drug target ChEMBL_ID: CHEMBL5440 (TID: 101196), and it has 58 rows and 1180 features (not including molecule IDs and class feature: molecule_id and pXC50). The features represent Molecular Descriptors which were generated from SMILES strings. Missing value imputation was applied to this dataset (By choosing the Median).",
    "description_version": "1",
    "file_id": "3529378",
    "format": "ARFF",
    "id": "34448",
    "licence": "Public",
    "md5_checksum": "b967aa7087a877b0976ae02c966fab9a",
    "minio_url": "https://data.openml.org/datasets/0003/34448/dataset_34448.pq",
    "name": "QSAR-DATASET-FOR-DRUG-TARGET-CHEMBL5440",
    "original_data_url": "https://www.ebi.ac.uk/chembl/target/inspect/CHEMBL5440",
    "parquet_url": "https://data.openml.org/datasets/0003/34448/dataset_34448.pq",
    "processing_date": "2018-10-04 04:01:13",
    "row_id_attribute": "molecule_id",
    "status": "deactivated",
    "tag": [
      "MetaQSAR",
      "study_13"
    ],
    "upload_date": "2016-07-15T15:23:49",
    "url": "https://api.openml.org/data/v1/download/3529378/QSAR-DATASET-FOR-DRUG-TARGET-CHEMBL5440.arff",
    "version": "11",
    "visibility": "public"
  }
}